You are viewing a plain text version of this content. The canonical link for it is here.
Posted to notifications@commons.apache.org by Apache Jenkins Server <je...@builds.apache.org> on 2018/10/15 21:06:49 UTC

Build failed in Jenkins: commons-io-ubuntu #1

See <https://builds.apache.org/job/commons-io-ubuntu/1/display/redirect>

------------------------------------------
[...truncated 19.96 KB...]
[INFO] Running org.apache.commons.io.input.ReversedLinesFileReaderTestParamBlockSize
[INFO] Tests run: 85, Failures: 0, Errors: 0, Skipped: 0, Time elapsed: 0.308 s - in org.apache.commons.io.input.ReversedLinesFileReaderTestParamBlockSize
[INFO] Running org.apache.commons.io.input.XmlStreamReaderTest
[INFO] Tests run: 16, Failures: 0, Errors: 0, Skipped: 0, Time elapsed: 0.548 s - in org.apache.commons.io.input.XmlStreamReaderTest
[INFO] Running org.apache.commons.io.input.TaggedInputStreamTest
[INFO] Tests run: 4, Failures: 0, Errors: 0, Skipped: 0, Time elapsed: 0.078 s - in org.apache.commons.io.input.TaggedInputStreamTest
[INFO] Running org.apache.commons.io.input.TailerTest
Elapsed: 575
testMultiByteBreak() Default charset: UTF-8
[INFO] Tests run: 10, Failures: 0, Errors: 0, Skipped: 0, Time elapsed: 10.613 s - in org.apache.commons.io.input.TailerTest
[INFO] Running org.apache.commons.io.input.CharacterSetFilterReaderTest
[INFO] Tests run: 10, Failures: 0, Errors: 0, Skipped: 0, Time elapsed: 0.082 s - in org.apache.commons.io.input.CharacterSetFilterReaderTest
[INFO] Running org.apache.commons.io.input.ClosedInputStreamTest
[INFO] Tests run: 1, Failures: 0, Errors: 0, Skipped: 0, Time elapsed: 0.067 s - in org.apache.commons.io.input.ClosedInputStreamTest
[INFO] Running org.apache.commons.io.input.AutoCloseInputStreamTest
[INFO] Tests run: 4, Failures: 0, Errors: 0, Skipped: 0, Time elapsed: 0.11 s - in org.apache.commons.io.input.AutoCloseInputStreamTest
[INFO] Running org.apache.commons.io.input.BoundedInputStreamTest
[INFO] Tests run: 2, Failures: 0, Errors: 0, Skipped: 0, Time elapsed: 0.064 s - in org.apache.commons.io.input.BoundedInputStreamTest
[INFO] Running org.apache.commons.io.input.CharSequenceInputStreamTest
[WARNING] Tests run: 30, Failures: 0, Errors: 0, Skipped: 2, Time elapsed: 0.51 s - in org.apache.commons.io.input.CharSequenceInputStreamTest
[INFO] Running org.apache.commons.io.input.ProxyReaderTest
[INFO] Tests run: 2, Failures: 0, Errors: 0, Skipped: 0, Time elapsed: 0.093 s - in org.apache.commons.io.input.ProxyReaderTest
[INFO] Running org.apache.commons.io.input.ReaderInputStreamTest
[INFO] Tests run: 8, Failures: 0, Errors: 0, Skipped: 0, Time elapsed: 0.111 s - in org.apache.commons.io.input.ReaderInputStreamTest
[INFO] Running org.apache.commons.io.input.MessageDigestCalculatingInputStreamTest
[INFO] Tests run: 1, Failures: 0, Errors: 0, Skipped: 0, Time elapsed: 0.077 s - in org.apache.commons.io.input.MessageDigestCalculatingInputStreamTest
[INFO] Running org.apache.commons.io.input.CountingInputStreamTest
[INFO] Tests run: 10, Failures: 0, Errors: 0, Skipped: 0, Time elapsed: 0.128 s - in org.apache.commons.io.input.CountingInputStreamTest
[INFO] Running org.apache.commons.io.input.NullReaderTest
[INFO] Tests run: 6, Failures: 0, Errors: 0, Skipped: 0, Time elapsed: 0.089 s - in org.apache.commons.io.input.NullReaderTest
[INFO] Running org.apache.commons.io.input.compatibility.XmlStreamReaderUtilitiesCompatibilityTest
[INFO] Tests run: 11, Failures: 0, Errors: 0, Skipped: 0, Time elapsed: 0.099 s - in org.apache.commons.io.input.compatibility.XmlStreamReaderUtilitiesCompatibilityTest
[INFO] Running org.apache.commons.io.input.CloseShieldInputStreamTest
[INFO] Tests run: 1, Failures: 0, Errors: 0, Skipped: 0, Time elapsed: 0.095 s - in org.apache.commons.io.input.CloseShieldInputStreamTest
[INFO] Running org.apache.commons.io.input.ClassLoaderObjectInputStreamTest
[INFO] Tests run: 7, Failures: 0, Errors: 0, Skipped: 0, Time elapsed: 0.088 s - in org.apache.commons.io.input.ClassLoaderObjectInputStreamTest
[INFO] Running org.apache.commons.io.input.CharSequenceReaderTest
[INFO] Tests run: 7, Failures: 0, Errors: 0, Skipped: 0, Time elapsed: 0.068 s - in org.apache.commons.io.input.CharSequenceReaderTest
[INFO] Running org.apache.commons.io.input.ReversedLinesFileReaderTestSimple
[INFO] Tests run: 3, Failures: 0, Errors: 0, Skipped: 0, Time elapsed: 0.095 s - in org.apache.commons.io.input.ReversedLinesFileReaderTestSimple
[INFO] Running org.apache.commons.io.input.WindowsLineEndingInputStreamTest
[INFO] Tests run: 7, Failures: 0, Errors: 0, Skipped: 0, Time elapsed: 0.069 s - in org.apache.commons.io.input.WindowsLineEndingInputStreamTest
[INFO] Running org.apache.commons.io.input.BOMInputStreamTest
[WARNING] Tests run: 44, Failures: 0, Errors: 0, Skipped: 1, Time elapsed: 0.223 s - in org.apache.commons.io.input.BOMInputStreamTest
[INFO] Running org.apache.commons.io.input.ReversedLinesFileReaderTestParamFile
[INFO] Tests run: 17, Failures: 0, Errors: 0, Skipped: 0, Time elapsed: 0.16 s - in org.apache.commons.io.input.ReversedLinesFileReaderTestParamFile
[INFO] Running org.apache.commons.io.input.NullInputStreamTest
[INFO] Tests run: 6, Failures: 0, Errors: 0, Skipped: 0, Time elapsed: 0.075 s - in org.apache.commons.io.input.NullInputStreamTest
[INFO] Running org.apache.commons.io.input.BrokenInputStreamTest
[INFO] Tests run: 5, Failures: 0, Errors: 0, Skipped: 0, Time elapsed: 0.149 s - in org.apache.commons.io.input.BrokenInputStreamTest
[INFO] Running org.apache.commons.io.input.InfiniteCircularInputStreamTest
[INFO] Tests run: 2, Failures: 0, Errors: 0, Skipped: 0, Time elapsed: 0.082 s - in org.apache.commons.io.input.InfiniteCircularInputStreamTest
[INFO] Running org.apache.commons.io.input.UnixLineEndingInputStreamTest
[INFO] Tests run: 8, Failures: 0, Errors: 0, Skipped: 0, Time elapsed: 0.085 s - in org.apache.commons.io.input.UnixLineEndingInputStreamTest
[INFO] Running org.apache.commons.io.FileCleanerTestCase
[INFO] Tests run: 9, Failures: 0, Errors: 0, Skipped: 0, Time elapsed: 4.264 s - in org.apache.commons.io.FileCleanerTestCase
[INFO] Running org.apache.commons.io.IOUtilsTestCase
[INFO] Tests run: 107, Failures: 0, Errors: 0, Skipped: 0, Time elapsed: 0.286 s - in org.apache.commons.io.IOUtilsTestCase
[INFO] Running org.apache.commons.io.FileUtilsWaitForTestCase
[INFO] Tests run: 2, Failures: 0, Errors: 0, Skipped: 0, Time elapsed: 4.086 s - in org.apache.commons.io.FileUtilsWaitForTestCase
[INFO] Running org.apache.commons.io.serialization.WildcardClassNameMatcherTest
[INFO] Tests run: 3, Failures: 0, Errors: 0, Skipped: 0, Time elapsed: 0.079 s - in org.apache.commons.io.serialization.WildcardClassNameMatcherTest
[INFO] Running org.apache.commons.io.serialization.RegexpClassNameMatcherTest
[INFO] Tests run: 5, Failures: 0, Errors: 0, Skipped: 0, Time elapsed: 0.095 s - in org.apache.commons.io.serialization.RegexpClassNameMatcherTest
[INFO] Running org.apache.commons.io.serialization.ValidatingObjectInputStreamTest
[INFO] Tests run: 18, Failures: 0, Errors: 0, Skipped: 0, Time elapsed: 0.114 s - in org.apache.commons.io.serialization.ValidatingObjectInputStreamTest
[INFO] Running org.apache.commons.io.serialization.FullClassNameMatcherTest
[INFO] Tests run: 2, Failures: 0, Errors: 0, Skipped: 0, Time elapsed: 0.08 s - in org.apache.commons.io.serialization.FullClassNameMatcherTest
[INFO] Running org.apache.commons.io.serialization.MoreComplexObjectTest
[INFO] Tests run: 3, Failures: 0, Errors: 0, Skipped: 0, Time elapsed: 0.105 s - in org.apache.commons.io.serialization.MoreComplexObjectTest
[INFO] Running org.apache.commons.io.DirectoryWalkerTestCaseJava4
[INFO] Tests run: 14, Failures: 0, Errors: 0, Skipped: 0, Time elapsed: 0.106 s - in org.apache.commons.io.DirectoryWalkerTestCaseJava4
[INFO] Running org.apache.commons.io.IOCaseTestCase
[INFO] Tests run: 17, Failures: 0, Errors: 0, Skipped: 0, Time elapsed: 0.094 s - in org.apache.commons.io.IOCaseTestCase
[INFO] Running org.apache.commons.io.FileSystemUtilsTestCase
[INFO] Tests run: 30, Failures: 0, Errors: 0, Skipped: 0, Time elapsed: 0.103 s - in org.apache.commons.io.FileSystemUtilsTestCase
[INFO] Running org.apache.commons.io.ByteOrderMarkTestCase
[INFO] Tests run: 9, Failures: 0, Errors: 0, Skipped: 0, Time elapsed: 0.079 s - in org.apache.commons.io.ByteOrderMarkTestCase
[INFO] Running org.apache.commons.io.FileSystemTestCase
[INFO] Tests run: 5, Failures: 0, Errors: 0, Skipped: 0, Time elapsed: 0.063 s - in org.apache.commons.io.FileSystemTestCase
[INFO] Running org.apache.commons.io.IOExceptionWithCauseTestCase
[INFO] Tests run: 2, Failures: 0, Errors: 0, Skipped: 0, Time elapsed: 0.065 s - in org.apache.commons.io.IOExceptionWithCauseTestCase
[INFO] Running org.apache.commons.io.CharsetsTestCase
[INFO] Tests run: 8, Failures: 0, Errors: 0, Skipped: 0, Time elapsed: 0.062 s - in org.apache.commons.io.CharsetsTestCase
[INFO] Running org.apache.commons.io.FileUtilsCopyToFileTestCase
[INFO] Tests run: 2, Failures: 0, Errors: 0, Skipped: 0, Time elapsed: 0.102 s - in org.apache.commons.io.FileUtilsCopyToFileTestCase
[INFO] Running org.apache.commons.io.IOUtilsWriteTestCase
[INFO] Tests run: 53, Failures: 0, Errors: 0, Skipped: 0, Time elapsed: 0.17 s - in org.apache.commons.io.IOUtilsWriteTestCase
[INFO] Running org.apache.commons.io.comparator.PathFileComparatorTest
[INFO] Tests run: 8, Failures: 0, Errors: 0, Skipped: 0, Time elapsed: 0.103 s - in org.apache.commons.io.comparator.PathFileComparatorTest
[INFO] Running org.apache.commons.io.comparator.DirectoryFileComparatorTest
[INFO] Tests run: 7, Failures: 0, Errors: 0, Skipped: 0, Time elapsed: 0.091 s - in org.apache.commons.io.comparator.DirectoryFileComparatorTest
[INFO] Running org.apache.commons.io.comparator.ExtensionFileComparatorTest
[INFO] Tests run: 8, Failures: 0, Errors: 0, Skipped: 0, Time elapsed: 0.086 s - in org.apache.commons.io.comparator.ExtensionFileComparatorTest
[INFO] Running org.apache.commons.io.comparator.LastModifiedFileComparatorTest
[INFO] Tests run: 7, Failures: 0, Errors: 0, Skipped: 0, Time elapsed: 13.635 s - in org.apache.commons.io.comparator.LastModifiedFileComparatorTest
[INFO] Running org.apache.commons.io.comparator.SizeFileComparatorTest
[INFO] Tests run: 9, Failures: 0, Errors: 0, Skipped: 0, Time elapsed: 0.124 s - in org.apache.commons.io.comparator.SizeFileComparatorTest
[INFO] Running org.apache.commons.io.comparator.DefaultFileComparatorTest
[INFO] Tests run: 7, Failures: 0, Errors: 0, Skipped: 0, Time elapsed: 0.102 s - in org.apache.commons.io.comparator.DefaultFileComparatorTest
[INFO] Running org.apache.commons.io.comparator.CompositeFileComparatorTest
[INFO] Tests run: 10, Failures: 0, Errors: 0, Skipped: 0, Time elapsed: 0.11 s - in org.apache.commons.io.comparator.CompositeFileComparatorTest
[INFO] Running org.apache.commons.io.comparator.NameFileComparatorTest
[INFO] Tests run: 8, Failures: 0, Errors: 0, Skipped: 0, Time elapsed: 0.132 s - in org.apache.commons.io.comparator.NameFileComparatorTest
[INFO] Running org.apache.commons.io.HexDumpTest
[INFO] Tests run: 1, Failures: 0, Errors: 0, Skipped: 0, Time elapsed: 0.103 s - in org.apache.commons.io.HexDumpTest
[INFO] Running org.apache.commons.io.DirectoryWalkerTestCase
[INFO] Tests run: 15, Failures: 0, Errors: 0, Skipped: 0, Time elapsed: 0.115 s - in org.apache.commons.io.DirectoryWalkerTestCase
[INFO] Running org.apache.commons.io.FileCleaningTrackerTestCase
[INFO] Tests run: 9, Failures: 0, Errors: 0, Skipped: 0, Time elapsed: 4.269 s - in org.apache.commons.io.FileCleaningTrackerTestCase
[INFO] Running org.apache.commons.io.IOUtilsCopyTestCase
[INFO] Tests run: 23, Failures: 0, Errors: 0, Skipped: 0, Time elapsed: 0.16 s - in org.apache.commons.io.IOUtilsCopyTestCase
[INFO] 
[INFO] Results:
[INFO] 
[WARNING] Tests run: 1349, Failures: 0, Errors: 0, Skipped: 4
[INFO] 
[JENKINS] Recording test results
[WARNING] Attempt to (de-)serialize anonymous class hudson.maven.reporters.SurefireArchiver$2; see: https://jenkins.io/redirect/serialization-of-anonymous-classes/
[WARNING] Attempt to (de-)serialize anonymous class hudson.maven.reporters.BuildInfoRecorder$1; see: https://jenkins.io/redirect/serialization-of-anonymous-classes/
[INFO] 
[INFO] --- maven-jar-plugin:3.1.0:jar (default-jar) @ commons-io ---
[INFO] Building jar: <https://builds.apache.org/job/commons-io-ubuntu/ws/target/commons-io-2.7-SNAPSHOT.jar>
[INFO] 
[INFO] >>> maven-javadoc-plugin:3.0.0:javadoc (create-javadoc-jar) > generate-sources @ commons-io >>>
[INFO] 
[INFO] --- maven-enforcer-plugin:3.0.0-M1:enforce (enforce-maven-version) @ commons-io ---
[INFO] 
[INFO] --- maven-enforcer-plugin:3.0.0-M1:enforce (enforce-maven-3) @ commons-io ---
[INFO] 
[INFO] --- build-helper-maven-plugin:3.0.0:parse-version (parse-version) @ commons-io ---
[INFO] 
[INFO] --- maven-antrun-plugin:1.8:run (javadoc.resources) @ commons-io ---
[INFO] Executing tasks

main:
[INFO] Executed tasks
[WARNING] Failed to getClass for org.apache.maven.plugins.javadoc.JavadocReport
[INFO] 
[INFO] <<< maven-javadoc-plugin:3.0.0:javadoc (create-javadoc-jar) < generate-sources @ commons-io <<<
[INFO] 
[INFO] 
[INFO] --- maven-javadoc-plugin:3.0.0:javadoc (create-javadoc-jar) @ commons-io ---
[INFO] 
4 errors
21 warnings
[JENKINS] Archiving  javadoc
[WARNING] Attempt to (de-)serialize anonymous class hudson.FilePath$32; see: https://jenkins.io/redirect/serialization-of-anonymous-classes/
[WARNING] Attempt to (de-)serialize anonymous class hudson.maven.reporters.MavenArtifactArchiver$2; see: https://jenkins.io/redirect/serialization-of-anonymous-classes/
[WARNING] Attempt to (de-)serialize anonymous class hudson.maven.reporters.MavenFingerprinter$1; see: https://jenkins.io/redirect/serialization-of-anonymous-classes/
[INFO] ------------------------------------------------------------------------
[INFO] BUILD FAILURE
[INFO] ------------------------------------------------------------------------
[INFO] Total time: 02:41 min
[INFO] Finished at: 2018-10-15T21:06:47Z
[INFO] ------------------------------------------------------------------------
Waiting for Jenkins to finish collecting data
[ERROR] Failed to execute goal org.apache.maven.plugins:maven-javadoc-plugin:3.0.0:javadoc (create-javadoc-jar) on project commons-io: An error has occurred in Javadoc report generation:
[ERROR] Exit code: 1 - <https://builds.apache.org/job/commons-io-ubuntu/ws/src/main/java/org/apache/commons/io/input/ObservableInputStream.java>:77: warning: no @param for pException
[ERROR] public void error(final IOException pException) throws IOException { throw pException; }
[ERROR] ^
[ERROR] <https://builds.apache.org/job/commons-io-ubuntu/ws/src/main/java/org/apache/commons/io/input/buffer/CircularBufferInputStream.java>:56: error: @param name not found
[ERROR] * @param pBufferSize The size of the {@link CircularByteBuffer}, which is
[ERROR] ^
[ERROR] <https://builds.apache.org/job/commons-io-ubuntu/ws/src/main/java/org/apache/commons/io/input/buffer/CircularByteBuffer.java>:133: error: incorrect use of inline tag
[ERROR] * @code{pOffset}+@code{pLength}-1 of byte array {@code pBuffer}.
[ERROR] ^
[ERROR] <https://builds.apache.org/job/commons-io-ubuntu/ws/src/main/java/org/apache/commons/io/input/buffer/CircularByteBuffer.java>:137: warning: no @param for pBuffer
[ERROR] public boolean peek(byte[] pBuffer, int pOffset, int pLength) {
[ERROR] ^
[ERROR] <https://builds.apache.org/job/commons-io-ubuntu/ws/src/main/java/org/apache/commons/io/input/buffer/CircularByteBuffer.java>:137: warning: no @param for pOffset
[ERROR] public boolean peek(byte[] pBuffer, int pOffset, int pLength) {
[ERROR] ^
[ERROR] <https://builds.apache.org/job/commons-io-ubuntu/ws/src/main/java/org/apache/commons/io/input/buffer/CircularByteBuffer.java>:137: warning: no @param for pLength
[ERROR] public boolean peek(byte[] pBuffer, int pOffset, int pLength) {
[ERROR] ^
[ERROR] <https://builds.apache.org/job/commons-io-ubuntu/ws/src/main/java/org/apache/commons/io/input/buffer/CircularByteBuffer.java>:163: error: incorrect use of inline tag
[ERROR] * @code{pOffset}+@code{pLength}-1 of byte array {@code pBuffer}.
[ERROR] ^
[ERROR] <https://builds.apache.org/job/commons-io-ubuntu/ws/src/main/java/org/apache/commons/io/input/buffer/CircularByteBuffer.java>:169: warning: no @param for pBuffer
[ERROR] public void add(byte[] pBuffer, int pOffset, int pLength) {
[ERROR] ^
[ERROR] <https://builds.apache.org/job/commons-io-ubuntu/ws/src/main/java/org/apache/commons/io/input/buffer/CircularByteBuffer.java>:169: warning: no @param for pOffset
[ERROR] public void add(byte[] pBuffer, int pOffset, int pLength) {
[ERROR] ^
[ERROR] <https://builds.apache.org/job/commons-io-ubuntu/ws/src/main/java/org/apache/commons/io/input/buffer/CircularByteBuffer.java>:169: warning: no @param for pLength
[ERROR] public void add(byte[] pBuffer, int pOffset, int pLength) {
[ERROR] ^
[ERROR] <https://builds.apache.org/job/commons-io-ubuntu/ws/src/main/java/org/apache/commons/io/input/buffer/CircularByteBuffer.java>:195: warning: no @return
[ERROR] public boolean hasSpace() {
[ERROR] ^
[ERROR] <https://builds.apache.org/job/commons-io-ubuntu/ws/src/main/java/org/apache/commons/io/input/buffer/CircularByteBuffer.java>:204: warning: no @param for pBytes
[ERROR] public boolean hasSpace(int pBytes) {
[ERROR] ^
[ERROR] <https://builds.apache.org/job/commons-io-ubuntu/ws/src/main/java/org/apache/commons/io/input/buffer/CircularByteBuffer.java>:204: warning: no @return
[ERROR] public boolean hasSpace(int pBytes) {
[ERROR] ^
[ERROR] <https://builds.apache.org/job/commons-io-ubuntu/ws/src/main/java/org/apache/commons/io/input/buffer/CircularByteBuffer.java>:211: warning: no @return
[ERROR] public boolean hasBytes() {
[ERROR] ^
[ERROR] <https://builds.apache.org/job/commons-io-ubuntu/ws/src/main/java/org/apache/commons/io/input/buffer/CircularByteBuffer.java>:218: warning: no @return
[ERROR] public int getSpace() {
[ERROR] ^
[ERROR] <https://builds.apache.org/job/commons-io-ubuntu/ws/src/main/java/org/apache/commons/io/input/buffer/CircularByteBuffer.java>:225: warning: no @return
[ERROR] public int getCurrentNumberOfBytes() {
[ERROR] ^
[ERROR] <https://builds.apache.org/job/commons-io-ubuntu/ws/src/main/java/org/apache/commons/io/input/buffer/CircularByteBuffer.java>:35: warning: no @param for pSize
[ERROR] public CircularByteBuffer(int pSize) {
[ERROR] ^
[ERROR] <https://builds.apache.org/job/commons-io-ubuntu/ws/src/main/java/org/apache/commons/io/input/buffer/PeekableInputStream.java>:53: warning: no description for @param
[ERROR] * @param pBuffer
[ERROR] ^
[ERROR] <https://builds.apache.org/job/commons-io-ubuntu/ws/src/main/java/org/apache/commons/io/input/buffer/PeekableInputStream.java>:54: warning: no description for @return
[ERROR] * @return
[ERROR] ^
[ERROR] <https://builds.apache.org/job/commons-io-ubuntu/ws/src/main/java/org/apache/commons/io/input/buffer/PeekableInputStream.java>:72: warning: no description for @param
[ERROR] * @param pBuffer
[ERROR] ^
[ERROR] <https://builds.apache.org/job/commons-io-ubuntu/ws/src/main/java/org/apache/commons/io/input/buffer/PeekableInputStream.java>:73: warning: no description for @return
[ERROR] * @return
[ERROR] ^
[ERROR] <https://builds.apache.org/job/commons-io-ubuntu/ws/src/main/java/org/apache/commons/io/input/buffer/PeekableInputStream.java>:74: warning: no description for @throws
[ERROR] * @throws IOException
[ERROR] ^
[ERROR] <https://builds.apache.org/job/commons-io-ubuntu/ws/src/main/java/org/apache/commons/io/input/buffer/PeekableInputStream.java>:76: warning: no @param for pOffset
[ERROR] public boolean peek(byte[] pBuffer, int pOffset, int pLength) throws IOException {
[ERROR] ^
[ERROR] <https://builds.apache.org/job/commons-io-ubuntu/ws/src/main/java/org/apache/commons/io/input/buffer/PeekableInputStream.java>:76: warning: no @param for pLength
[ERROR] public boolean peek(byte[] pBuffer, int pOffset, int pLength) throws IOException {
[ERROR] ^
[ERROR] <https://builds.apache.org/job/commons-io-ubuntu/ws/src/main/java/org/apache/commons/io/input/buffer/PeekableInputStream.java>:42: error: @param name not found
[ERROR] * @param pBufferSize The size of the {@link CircularByteBuffer}, which is
[ERROR] ^
[ERROR] 
[ERROR] Command line was: /usr/local/asfpackages/java/jdk1.8.0_172/jre/../bin/javadoc @options @packages
[ERROR] 
[ERROR] Refer to the generated Javadoc files in '<https://builds.apache.org/job/commons-io-ubuntu/ws/target/site/apidocs'> dir.
[ERROR] -> [Help 1]
[ERROR] 
[ERROR] To see the full stack trace of the errors, re-run Maven with the -e switch.
[ERROR] Re-run Maven using the -X switch to enable full debug logging.
[ERROR] 
[ERROR] For more information about the errors and possible solutions, please read the following articles:
[ERROR] [Help 1] http://cwiki.apache.org/confluence/display/MAVEN/MojoExecutionException
[JENKINS] Archiving <https://builds.apache.org/job/commons-io-ubuntu/ws/pom.xml> to commons-io/commons-io/2.7-SNAPSHOT/commons-io-2.7-SNAPSHOT.pom
[JENKINS] Archiving <https://builds.apache.org/job/commons-io-ubuntu/ws/target/commons-io-2.7-SNAPSHOT.jar> to commons-io/commons-io/2.7-SNAPSHOT/commons-io-2.7-SNAPSHOT.jar
[Fast Archiver] No prior successful build to compare, so performing full copy of artifacts
Sending e-mails to: notifications@commons.apache.org
channel stopped

Jenkins build is back to normal : commons-io-ubuntu #3

Posted by Apache Jenkins Server <je...@builds.apache.org>.
See <https://builds.apache.org/job/commons-io-ubuntu/3/display/redirect?page=changes>


Build failed in Jenkins: commons-io-ubuntu #2

Posted by Apache Jenkins Server <je...@builds.apache.org>.
See <https://builds.apache.org/job/commons-io-ubuntu/2/display/redirect?page=changes>

Changes:

[sebb] Unused import

------------------------------------------
[...truncated 19.56 KB...]
[INFO] Running org.apache.commons.io.output.TeeOutputStreamTest
[INFO] Tests run: 3, Failures: 0, Errors: 0, Skipped: 0, Time elapsed: 0.081 s - in org.apache.commons.io.output.TeeOutputStreamTest
[INFO] Running org.apache.commons.io.output.ProxyOutputStreamTest
[INFO] Tests run: 2, Failures: 0, Errors: 0, Skipped: 0, Time elapsed: 0.11 s - in org.apache.commons.io.output.ProxyOutputStreamTest
[INFO] Running org.apache.commons.io.output.AppendableOutputStreamTest
[INFO] Tests run: 2, Failures: 0, Errors: 0, Skipped: 0, Time elapsed: 0.103 s - in org.apache.commons.io.output.AppendableOutputStreamTest
[INFO] Running org.apache.commons.io.output.ChunkedWriterTest
[INFO] Tests run: 3, Failures: 0, Errors: 0, Skipped: 0, Time elapsed: 0.071 s - in org.apache.commons.io.output.ChunkedWriterTest
[INFO] Running org.apache.commons.io.output.NullOutputStreamTest
[INFO] Tests run: 1, Failures: 0, Errors: 0, Skipped: 0, Time elapsed: 0.066 s - in org.apache.commons.io.output.NullOutputStreamTest
[INFO] Running org.apache.commons.io.output.BrokenOutputStreamTest
[INFO] Tests run: 3, Failures: 0, Errors: 0, Skipped: 0, Time elapsed: 0.069 s - in org.apache.commons.io.output.BrokenOutputStreamTest
[INFO] Running org.apache.commons.io.output.WriterOutputStreamTest
[INFO] Tests run: 12, Failures: 0, Errors: 0, Skipped: 0, Time elapsed: 0.122 s - in org.apache.commons.io.output.WriterOutputStreamTest
[INFO] Running org.apache.commons.io.output.CloseShieldOutputStreamTest
[INFO] Tests run: 1, Failures: 0, Errors: 0, Skipped: 0, Time elapsed: 0.111 s - in org.apache.commons.io.output.CloseShieldOutputStreamTest
[INFO] Running org.apache.commons.io.output.ProxyWriterTest
[INFO] Tests run: 21, Failures: 0, Errors: 0, Skipped: 0, Time elapsed: 0.105 s - in org.apache.commons.io.output.ProxyWriterTest
[INFO] Running org.apache.commons.io.output.ByteArrayOutputStreamTestCase
[INFO] Tests run: 3, Failures: 0, Errors: 0, Skipped: 0, Time elapsed: 0.079 s - in org.apache.commons.io.output.ByteArrayOutputStreamTestCase
[INFO] Running org.apache.commons.io.output.ClosedOutputStreamTest
[INFO] Tests run: 2, Failures: 0, Errors: 0, Skipped: 0, Time elapsed: 0.08 s - in org.apache.commons.io.output.ClosedOutputStreamTest
[INFO] Running org.apache.commons.io.output.ChunkedOutputStreamTest
[INFO] Tests run: 3, Failures: 0, Errors: 0, Skipped: 0, Time elapsed: 0.087 s - in org.apache.commons.io.output.ChunkedOutputStreamTest
[INFO] Running org.apache.commons.io.output.XmlStreamWriterTest
[INFO] Tests run: 13, Failures: 0, Errors: 0, Skipped: 0, Time elapsed: 0.169 s - in org.apache.commons.io.output.XmlStreamWriterTest
[INFO] Running org.apache.commons.io.output.LockableFileWriterTest
[INFO] Tests run: 7, Failures: 0, Errors: 0, Skipped: 0, Time elapsed: 0.145 s - in org.apache.commons.io.output.LockableFileWriterTest
[INFO] Running org.apache.commons.io.output.TaggedOutputStreamTest
[INFO] Tests run: 3, Failures: 0, Errors: 0, Skipped: 0, Time elapsed: 0.095 s - in org.apache.commons.io.output.TaggedOutputStreamTest
[INFO] Running org.apache.commons.io.output.NullWriterTest
[INFO] Tests run: 1, Failures: 0, Errors: 0, Skipped: 0, Time elapsed: 0.084 s - in org.apache.commons.io.output.NullWriterTest
[INFO] Running org.apache.commons.io.output.CountingOutputStreamTest
[INFO] Tests run: 2, Failures: 0, Errors: 0, Skipped: 0, Time elapsed: 0.158 s - in org.apache.commons.io.output.CountingOutputStreamTest
[INFO] Running org.apache.commons.io.output.ThresholdingOutputStreamTest
[INFO] Tests run: 1, Failures: 0, Errors: 0, Skipped: 0, Time elapsed: 0.082 s - in org.apache.commons.io.output.ThresholdingOutputStreamTest
[INFO] Running org.apache.commons.io.output.DeferredFileOutputStreamTest
[INFO] Tests run: 130, Failures: 0, Errors: 0, Skipped: 0, Time elapsed: 0.258 s - in org.apache.commons.io.output.DeferredFileOutputStreamTest
[INFO] Running org.apache.commons.io.CharsetsTestCase
[INFO] Tests run: 8, Failures: 0, Errors: 0, Skipped: 0, Time elapsed: 0.081 s - in org.apache.commons.io.CharsetsTestCase
[INFO] Running org.apache.commons.io.FileDeleteStrategyTestCase
[INFO] Tests run: 5, Failures: 0, Errors: 0, Skipped: 0, Time elapsed: 0.137 s - in org.apache.commons.io.FileDeleteStrategyTestCase
[INFO] Running org.apache.commons.io.input.ReversedLinesFileReaderTestSimple
[INFO] Tests run: 3, Failures: 0, Errors: 0, Skipped: 0, Time elapsed: 0.13 s - in org.apache.commons.io.input.ReversedLinesFileReaderTestSimple
[INFO] Running org.apache.commons.io.input.BoundedReaderTest
[INFO] Tests run: 12, Failures: 0, Errors: 0, Skipped: 0, Time elapsed: 0.087 s - in org.apache.commons.io.input.BoundedReaderTest
[INFO] Running org.apache.commons.io.input.buffer.CircularBufferInputStreamTest
[INFO] Tests run: 1, Failures: 0, Errors: 0, Skipped: 0, Time elapsed: 0.081 s - in org.apache.commons.io.input.buffer.CircularBufferInputStreamTest
[INFO] Running org.apache.commons.io.input.ClosedInputStreamTest
[INFO] Tests run: 1, Failures: 0, Errors: 0, Skipped: 0, Time elapsed: 0.07 s - in org.apache.commons.io.input.ClosedInputStreamTest
[INFO] Running org.apache.commons.io.input.BoundedInputStreamTest
[INFO] Tests run: 2, Failures: 0, Errors: 0, Skipped: 0, Time elapsed: 0.126 s - in org.apache.commons.io.input.BoundedInputStreamTest
[INFO] Running org.apache.commons.io.input.TaggedInputStreamTest
[INFO] Tests run: 4, Failures: 0, Errors: 0, Skipped: 0, Time elapsed: 0.118 s - in org.apache.commons.io.input.TaggedInputStreamTest
[INFO] Running org.apache.commons.io.input.BrokenInputStreamTest
[INFO] Tests run: 5, Failures: 0, Errors: 0, Skipped: 0, Time elapsed: 0.082 s - in org.apache.commons.io.input.BrokenInputStreamTest
[INFO] Running org.apache.commons.io.input.ClassLoaderObjectInputStreamTest
[INFO] Tests run: 7, Failures: 0, Errors: 0, Skipped: 0, Time elapsed: 0.117 s - in org.apache.commons.io.input.ClassLoaderObjectInputStreamTest
[INFO] Running org.apache.commons.io.input.ReaderInputStreamTest
[INFO] Tests run: 8, Failures: 0, Errors: 0, Skipped: 0, Time elapsed: 0.112 s - in org.apache.commons.io.input.ReaderInputStreamTest
[INFO] Running org.apache.commons.io.input.ReversedLinesFileReaderTestParamBlockSize
[INFO] Tests run: 85, Failures: 0, Errors: 0, Skipped: 0, Time elapsed: 0.289 s - in org.apache.commons.io.input.ReversedLinesFileReaderTestParamBlockSize
[INFO] Running org.apache.commons.io.input.UnixLineEndingInputStreamTest
[INFO] Tests run: 8, Failures: 0, Errors: 0, Skipped: 0, Time elapsed: 0.103 s - in org.apache.commons.io.input.UnixLineEndingInputStreamTest
[INFO] Running org.apache.commons.io.input.CountingInputStreamTest
[INFO] Tests run: 10, Failures: 0, Errors: 0, Skipped: 0, Time elapsed: 0.133 s - in org.apache.commons.io.input.CountingInputStreamTest
[INFO] Running org.apache.commons.io.input.ProxyReaderTest
[INFO] Tests run: 2, Failures: 0, Errors: 0, Skipped: 0, Time elapsed: 0.064 s - in org.apache.commons.io.input.ProxyReaderTest
[INFO] Running org.apache.commons.io.input.InfiniteCircularInputStreamTest
[INFO] Tests run: 2, Failures: 0, Errors: 0, Skipped: 0, Time elapsed: 0.075 s - in org.apache.commons.io.input.InfiniteCircularInputStreamTest
[INFO] Running org.apache.commons.io.input.TailerTest
Elapsed: 1019
testMultiByteBreak() Default charset: ISO-8859-1
[INFO] Tests run: 10, Failures: 0, Errors: 0, Skipped: 0, Time elapsed: 11.069 s - in org.apache.commons.io.input.TailerTest
[INFO] Running org.apache.commons.io.input.XmlStreamReaderTest
[INFO] Tests run: 16, Failures: 0, Errors: 0, Skipped: 0, Time elapsed: 0.685 s - in org.apache.commons.io.input.XmlStreamReaderTest
[INFO] Running org.apache.commons.io.input.CharacterFilterReaderTest
[INFO] Tests run: 5, Failures: 0, Errors: 0, Skipped: 0, Time elapsed: 0.099 s - in org.apache.commons.io.input.CharacterFilterReaderTest
[INFO] Running org.apache.commons.io.input.ObservableInputStreamTest
[INFO] Tests run: 2, Failures: 0, Errors: 0, Skipped: 0, Time elapsed: 0.1 s - in org.apache.commons.io.input.ObservableInputStreamTest
[INFO] Running org.apache.commons.io.input.compatibility.XmlStreamReaderUtilitiesCompatibilityTest
[INFO] Tests run: 11, Failures: 0, Errors: 0, Skipped: 0, Time elapsed: 0.134 s - in org.apache.commons.io.input.compatibility.XmlStreamReaderUtilitiesCompatibilityTest
[INFO] Running org.apache.commons.io.input.CharacterSetFilterReaderTest
[INFO] Tests run: 10, Failures: 0, Errors: 0, Skipped: 0, Time elapsed: 0.1 s - in org.apache.commons.io.input.CharacterSetFilterReaderTest
[INFO] Running org.apache.commons.io.input.CloseShieldInputStreamTest
[INFO] Tests run: 1, Failures: 0, Errors: 0, Skipped: 0, Time elapsed: 0.093 s - in org.apache.commons.io.input.CloseShieldInputStreamTest
[INFO] Running org.apache.commons.io.input.MessageDigestCalculatingInputStreamTest
[INFO] Tests run: 1, Failures: 0, Errors: 0, Skipped: 0, Time elapsed: 0.092 s - in org.apache.commons.io.input.MessageDigestCalculatingInputStreamTest
[INFO] Running org.apache.commons.io.input.ReversedLinesFileReaderTestParamFile
[INFO] Tests run: 17, Failures: 0, Errors: 0, Skipped: 0, Time elapsed: 0.212 s - in org.apache.commons.io.input.ReversedLinesFileReaderTestParamFile
[INFO] Running org.apache.commons.io.input.XmlStreamReaderUtilitiesTest
[INFO] Tests run: 11, Failures: 0, Errors: 0, Skipped: 0, Time elapsed: 0.115 s - in org.apache.commons.io.input.XmlStreamReaderUtilitiesTest
[INFO] Running org.apache.commons.io.input.WindowsLineEndingInputStreamTest
[INFO] Tests run: 7, Failures: 0, Errors: 0, Skipped: 0, Time elapsed: 0.09 s - in org.apache.commons.io.input.WindowsLineEndingInputStreamTest
[INFO] Running org.apache.commons.io.input.CharSequenceReaderTest
[INFO] Tests run: 7, Failures: 0, Errors: 0, Skipped: 0, Time elapsed: 0.084 s - in org.apache.commons.io.input.CharSequenceReaderTest
[INFO] Running org.apache.commons.io.input.NullInputStreamTest
[INFO] Tests run: 6, Failures: 0, Errors: 0, Skipped: 0, Time elapsed: 0.08 s - in org.apache.commons.io.input.NullInputStreamTest
[INFO] Running org.apache.commons.io.input.CharSequenceInputStreamTest
[WARNING] Tests run: 30, Failures: 0, Errors: 0, Skipped: 2, Time elapsed: 0.93 s - in org.apache.commons.io.input.CharSequenceInputStreamTest
[INFO] Running org.apache.commons.io.input.SwappedDataInputStreamTest
[INFO] Tests run: 14, Failures: 0, Errors: 0, Skipped: 0, Time elapsed: 0.124 s - in org.apache.commons.io.input.SwappedDataInputStreamTest
[INFO] Running org.apache.commons.io.input.NullReaderTest
[INFO] Tests run: 6, Failures: 0, Errors: 0, Skipped: 0, Time elapsed: 0.109 s - in org.apache.commons.io.input.NullReaderTest
[INFO] Running org.apache.commons.io.input.AutoCloseInputStreamTest
[INFO] Tests run: 4, Failures: 0, Errors: 0, Skipped: 0, Time elapsed: 0.075 s - in org.apache.commons.io.input.AutoCloseInputStreamTest
[INFO] Running org.apache.commons.io.input.TeeInputStreamTest
[INFO] Tests run: 7, Failures: 0, Errors: 0, Skipped: 0, Time elapsed: 0.081 s - in org.apache.commons.io.input.TeeInputStreamTest
[INFO] Running org.apache.commons.io.input.BOMInputStreamTest
[WARNING] Tests run: 44, Failures: 0, Errors: 0, Skipped: 1, Time elapsed: 0.251 s - in org.apache.commons.io.input.BOMInputStreamTest
[INFO] Running org.apache.commons.io.IOCaseTestCase
[INFO] Tests run: 17, Failures: 0, Errors: 0, Skipped: 0, Time elapsed: 0.104 s - in org.apache.commons.io.IOCaseTestCase
[INFO] 
[INFO] Results:
[INFO] 
[WARNING] Tests run: 1349, Failures: 0, Errors: 0, Skipped: 4
[INFO] 
[JENKINS] Recording test results
[WARNING] Attempt to (de-)serialize anonymous class hudson.maven.reporters.SurefireArchiver$2; see: https://jenkins.io/redirect/serialization-of-anonymous-classes/
[WARNING] Attempt to (de-)serialize anonymous class hudson.maven.reporters.BuildInfoRecorder$1; see: https://jenkins.io/redirect/serialization-of-anonymous-classes/
[INFO] 
[INFO] --- maven-jar-plugin:3.1.0:jar (default-jar) @ commons-io ---
[INFO] Building jar: <https://builds.apache.org/job/commons-io-ubuntu/ws/target/commons-io-2.7-SNAPSHOT.jar>
[INFO] 
[INFO] >>> maven-javadoc-plugin:3.0.0:javadoc (create-javadoc-jar) > generate-sources @ commons-io >>>
[INFO] 
[INFO] --- maven-enforcer-plugin:3.0.0-M1:enforce (enforce-maven-version) @ commons-io ---
[INFO] 
[INFO] --- maven-enforcer-plugin:3.0.0-M1:enforce (enforce-maven-3) @ commons-io ---
[INFO] 
[INFO] --- build-helper-maven-plugin:3.0.0:parse-version (parse-version) @ commons-io ---
[INFO] 
[INFO] --- maven-antrun-plugin:1.8:run (javadoc.resources) @ commons-io ---
[INFO] Executing tasks

main:
[INFO] Executed tasks
[WARNING] Failed to getClass for org.apache.maven.plugins.javadoc.JavadocReport
[INFO] 
[INFO] <<< maven-javadoc-plugin:3.0.0:javadoc (create-javadoc-jar) < generate-sources @ commons-io <<<
[INFO] 
[INFO] 
[INFO] --- maven-javadoc-plugin:3.0.0:javadoc (create-javadoc-jar) @ commons-io ---
[INFO] 
4 errors
21 warnings
[JENKINS] Archiving  javadoc
[WARNING] Attempt to (de-)serialize anonymous class hudson.FilePath$32; see: https://jenkins.io/redirect/serialization-of-anonymous-classes/
[WARNING] Attempt to (de-)serialize anonymous class hudson.maven.reporters.MavenArtifactArchiver$2; see: https://jenkins.io/redirect/serialization-of-anonymous-classes/
[WARNING] Attempt to (de-)serialize anonymous class hudson.maven.reporters.MavenFingerprinter$1; see: https://jenkins.io/redirect/serialization-of-anonymous-classes/
[INFO] ------------------------------------------------------------------------
[INFO] BUILD FAILURE
[INFO] ------------------------------------------------------------------------
[INFO] Total time: 04:02 min
[INFO] Finished at: 2018-10-15T21:14:30Z
[INFO] ------------------------------------------------------------------------
Waiting for Jenkins to finish collecting data
[ERROR] Failed to execute goal org.apache.maven.plugins:maven-javadoc-plugin:3.0.0:javadoc (create-javadoc-jar) on project commons-io: An error has occurred in Javadoc report generation:
[ERROR] Exit code: 1 - <https://builds.apache.org/job/commons-io-ubuntu/ws/src/main/java/org/apache/commons/io/input/ObservableInputStream.java>:77: warning: no @param for pException
[ERROR] public void error(final IOException pException) throws IOException { throw pException; }
[ERROR] ^
[ERROR] <https://builds.apache.org/job/commons-io-ubuntu/ws/src/main/java/org/apache/commons/io/input/buffer/CircularBufferInputStream.java>:56: error: @param name not found
[ERROR] * @param pBufferSize The size of the {@link CircularByteBuffer}, which is
[ERROR] ^
[ERROR] <https://builds.apache.org/job/commons-io-ubuntu/ws/src/main/java/org/apache/commons/io/input/buffer/CircularByteBuffer.java>:133: error: incorrect use of inline tag
[ERROR] * @code{pOffset}+@code{pLength}-1 of byte array {@code pBuffer}.
[ERROR] ^
[ERROR] <https://builds.apache.org/job/commons-io-ubuntu/ws/src/main/java/org/apache/commons/io/input/buffer/CircularByteBuffer.java>:137: warning: no @param for pBuffer
[ERROR] public boolean peek(byte[] pBuffer, int pOffset, int pLength) {
[ERROR] ^
[ERROR] <https://builds.apache.org/job/commons-io-ubuntu/ws/src/main/java/org/apache/commons/io/input/buffer/CircularByteBuffer.java>:137: warning: no @param for pOffset
[ERROR] public boolean peek(byte[] pBuffer, int pOffset, int pLength) {
[ERROR] ^
[ERROR] <https://builds.apache.org/job/commons-io-ubuntu/ws/src/main/java/org/apache/commons/io/input/buffer/CircularByteBuffer.java>:137: warning: no @param for pLength
[ERROR] public boolean peek(byte[] pBuffer, int pOffset, int pLength) {
[ERROR] ^
[ERROR] <https://builds.apache.org/job/commons-io-ubuntu/ws/src/main/java/org/apache/commons/io/input/buffer/CircularByteBuffer.java>:163: error: incorrect use of inline tag
[ERROR] * @code{pOffset}+@code{pLength}-1 of byte array {@code pBuffer}.
[ERROR] ^
[ERROR] <https://builds.apache.org/job/commons-io-ubuntu/ws/src/main/java/org/apache/commons/io/input/buffer/CircularByteBuffer.java>:169: warning: no @param for pBuffer
[ERROR] public void add(byte[] pBuffer, int pOffset, int pLength) {
[ERROR] ^
[ERROR] <https://builds.apache.org/job/commons-io-ubuntu/ws/src/main/java/org/apache/commons/io/input/buffer/CircularByteBuffer.java>:169: warning: no @param for pOffset
[ERROR] public void add(byte[] pBuffer, int pOffset, int pLength) {
[ERROR] ^
[ERROR] <https://builds.apache.org/job/commons-io-ubuntu/ws/src/main/java/org/apache/commons/io/input/buffer/CircularByteBuffer.java>:169: warning: no @param for pLength
[ERROR] public void add(byte[] pBuffer, int pOffset, int pLength) {
[ERROR] ^
[ERROR] <https://builds.apache.org/job/commons-io-ubuntu/ws/src/main/java/org/apache/commons/io/input/buffer/CircularByteBuffer.java>:195: warning: no @return
[ERROR] public boolean hasSpace() {
[ERROR] ^
[ERROR] <https://builds.apache.org/job/commons-io-ubuntu/ws/src/main/java/org/apache/commons/io/input/buffer/CircularByteBuffer.java>:204: warning: no @param for pBytes
[ERROR] public boolean hasSpace(int pBytes) {
[ERROR] ^
[ERROR] <https://builds.apache.org/job/commons-io-ubuntu/ws/src/main/java/org/apache/commons/io/input/buffer/CircularByteBuffer.java>:204: warning: no @return
[ERROR] public boolean hasSpace(int pBytes) {
[ERROR] ^
[ERROR] <https://builds.apache.org/job/commons-io-ubuntu/ws/src/main/java/org/apache/commons/io/input/buffer/CircularByteBuffer.java>:211: warning: no @return
[ERROR] public boolean hasBytes() {
[ERROR] ^
[ERROR] <https://builds.apache.org/job/commons-io-ubuntu/ws/src/main/java/org/apache/commons/io/input/buffer/CircularByteBuffer.java>:218: warning: no @return
[ERROR] public int getSpace() {
[ERROR] ^
[ERROR] <https://builds.apache.org/job/commons-io-ubuntu/ws/src/main/java/org/apache/commons/io/input/buffer/CircularByteBuffer.java>:225: warning: no @return
[ERROR] public int getCurrentNumberOfBytes() {
[ERROR] ^
[ERROR] <https://builds.apache.org/job/commons-io-ubuntu/ws/src/main/java/org/apache/commons/io/input/buffer/CircularByteBuffer.java>:35: warning: no @param for pSize
[ERROR] public CircularByteBuffer(int pSize) {
[ERROR] ^
[ERROR] <https://builds.apache.org/job/commons-io-ubuntu/ws/src/main/java/org/apache/commons/io/input/buffer/PeekableInputStream.java>:53: warning: no description for @param
[ERROR] * @param pBuffer
[ERROR] ^
[ERROR] <https://builds.apache.org/job/commons-io-ubuntu/ws/src/main/java/org/apache/commons/io/input/buffer/PeekableInputStream.java>:54: warning: no description for @return
[ERROR] * @return
[ERROR] ^
[ERROR] <https://builds.apache.org/job/commons-io-ubuntu/ws/src/main/java/org/apache/commons/io/input/buffer/PeekableInputStream.java>:72: warning: no description for @param
[ERROR] * @param pBuffer
[ERROR] ^
[ERROR] <https://builds.apache.org/job/commons-io-ubuntu/ws/src/main/java/org/apache/commons/io/input/buffer/PeekableInputStream.java>:73: warning: no description for @return
[ERROR] * @return
[ERROR] ^
[ERROR] <https://builds.apache.org/job/commons-io-ubuntu/ws/src/main/java/org/apache/commons/io/input/buffer/PeekableInputStream.java>:74: warning: no description for @throws
[ERROR] * @throws IOException
[ERROR] ^
[ERROR] <https://builds.apache.org/job/commons-io-ubuntu/ws/src/main/java/org/apache/commons/io/input/buffer/PeekableInputStream.java>:76: warning: no @param for pOffset
[ERROR] public boolean peek(byte[] pBuffer, int pOffset, int pLength) throws IOException {
[ERROR] ^
[ERROR] <https://builds.apache.org/job/commons-io-ubuntu/ws/src/main/java/org/apache/commons/io/input/buffer/PeekableInputStream.java>:76: warning: no @param for pLength
[ERROR] public boolean peek(byte[] pBuffer, int pOffset, int pLength) throws IOException {
[ERROR] ^
[ERROR] <https://builds.apache.org/job/commons-io-ubuntu/ws/src/main/java/org/apache/commons/io/input/buffer/PeekableInputStream.java>:42: error: @param name not found
[ERROR] * @param pBufferSize The size of the {@link CircularByteBuffer}, which is
[ERROR] ^
[ERROR] 
[ERROR] Command line was: /usr/local/asfpackages/java/jdk1.8.0_172/jre/../bin/javadoc @options @packages
[ERROR] 
[ERROR] Refer to the generated Javadoc files in '<https://builds.apache.org/job/commons-io-ubuntu/ws/target/site/apidocs'> dir.
[ERROR] -> [Help 1]
[ERROR] 
[ERROR] To see the full stack trace of the errors, re-run Maven with the -e switch.
[ERROR] Re-run Maven using the -X switch to enable full debug logging.
[ERROR] 
[ERROR] For more information about the errors and possible solutions, please read the following articles:
[ERROR] [Help 1] http://cwiki.apache.org/confluence/display/MAVEN/MojoExecutionException
[JENKINS] Archiving <https://builds.apache.org/job/commons-io-ubuntu/ws/pom.xml> to commons-io/commons-io/2.7-SNAPSHOT/commons-io-2.7-SNAPSHOT.pom
[JENKINS] Archiving <https://builds.apache.org/job/commons-io-ubuntu/ws/target/commons-io-2.7-SNAPSHOT.jar> to commons-io/commons-io/2.7-SNAPSHOT/commons-io-2.7-SNAPSHOT.jar
[Fast Archiver] No prior successful build to compare, so performing full copy of artifacts
Sending e-mails to: notifications@commons.apache.org
channel stopped