You are viewing a plain text version of this content. The canonical link for it is here.
Posted to dev@activemq.apache.org by Apache Hudson Server <hu...@hudson.zones.apache.org> on 2010/05/06 06:02:30 UTC

Hudson build became unstable: ActiveMQ #340

See <http://hudson.zones.apache.org/hudson/job/ActiveMQ/340/changes>



Hudson build is still unstable: ActiveMQ #348

Posted by Apache Hudson Server <hu...@hudson.zones.apache.org>.
See <http://hudson.zones.apache.org/hudson/job/ActiveMQ/changes>



Hudson build is still unstable: ActiveMQ #347

Posted by Apache Hudson Server <hu...@hudson.zones.apache.org>.
See <http://hudson.zones.apache.org/hudson/job/ActiveMQ/changes>



Hudson build is still unstable: ActiveMQ #346

Posted by Apache Hudson Server <hu...@hudson.zones.apache.org>.
See <http://hudson.zones.apache.org/hudson/job/ActiveMQ/changes>



Hudson build is unstable: ActiveMQ #345

Posted by Apache Hudson Server <hu...@hudson.zones.apache.org>.
See <http://hudson.zones.apache.org/hudson/job/ActiveMQ/345/changes>



Build failed in Hudson: ActiveMQ #344

Posted by Apache Hudson Server <hu...@hudson.zones.apache.org>.
See <http://hudson.zones.apache.org/hudson/job/ActiveMQ/344/changes>

Changes:

[gtully] add test for prosperity

------------------------------------------
[...truncated 5839 lines...]
Tests run: 1, Failures: 0, Errors: 0, Skipped: 0, Time elapsed: 1.318 sec
Running org.apache.activemq.broker.ReconnectWithJMXEnabledTest
Tests run: 1, Failures: 0, Errors: 0, Skipped: 0, Time elapsed: 4.224 sec
Running org.apache.activemq.xbean.XBeanConfigTest
Tests run: 1, Failures: 0, Errors: 0, Skipped: 0, Time elapsed: 1.067 sec
Running org.apache.activemq.util.BitArrayBinTest
Tests run: 3, Failures: 0, Errors: 0, Skipped: 0, Time elapsed: 0.105 sec
Running org.apache.activemq.openwire.v3.ConsumerInfoTest
Tests run: 1, Failures: 0, Errors: 0, Skipped: 0, Time elapsed: 0.052 sec
Running org.apache.activemq.broker.region.cursors.NegativeQueueTest
Tests run: 7, Failures: 0, Errors: 0, Skipped: 0, Time elapsed: 289.54 sec
Running org.apache.activemq.openwire.v1.MessageAckTest
Tests run: 1, Failures: 0, Errors: 0, Skipped: 0, Time elapsed: 0.039 sec
Running org.apache.activemq.JmsSessionRecoverTest
Tests run: 6, Failures: 0, Errors: 0, Skipped: 0, Time elapsed: 0.715 sec
Running org.apache.activemq.openwire.v2.ConnectionInfoTest
Tests run: 1, Failures: 0, Errors: 0, Skipped: 0, Time elapsed: 0.033 sec
Running org.apache.activemq.broker.scheduler.JmsSchedulerTest
Tests run: 4, Failures: 0, Errors: 0, Skipped: 0, Time elapsed: 82.306 sec
Running org.apache.activemq.openwire.v6.ConnectionControlTest
Tests run: 1, Failures: 0, Errors: 0, Skipped: 0, Time elapsed: 0.026 sec
Running org.apache.activemq.broker.region.cursors.StoreQueueCursorNoDuplicateTest
Tests run: 1, Failures: 0, Errors: 0, Skipped: 0, Time elapsed: 0.232 sec
Running org.apache.activemq.openwire.v3.JournalTransactionTest
Tests run: 1, Failures: 0, Errors: 0, Skipped: 0, Time elapsed: 0.028 sec
Running org.apache.activemq.openwire.v3.ResponseTest
Tests run: 1, Failures: 0, Errors: 0, Skipped: 0, Time elapsed: 0.028 sec
Running org.apache.activemq.usecases.MessageGroupNewConsumerTest
Tests run: 1, Failures: 0, Errors: 0, Skipped: 0, Time elapsed: 3.813 sec
Running org.apache.activemq.openwire.v1.ConsumerControlTest
Tests run: 1, Failures: 0, Errors: 0, Skipped: 0, Time elapsed: 0.032 sec
Running org.apache.activemq.openwire.v4.MessageAckTest
Tests run: 1, Failures: 0, Errors: 0, Skipped: 0, Time elapsed: 0.045 sec
Running org.apache.activemq.openwire.v4.ProducerIdTest
Tests run: 1, Failures: 0, Errors: 0, Skipped: 0, Time elapsed: 0.024 sec
Running org.apache.activemq.JmsQueueTopicCompositeSendReceiveTest
Tests run: 1, Failures: 0, Errors: 0, Skipped: 0, Time elapsed: 1.398 sec
Running org.apache.activemq.transport.discovery.DiscoveryNetworkReconnectTest
Tests run: 2, Failures: 0, Errors: 0, Skipped: 0, Time elapsed: 38.916 sec
Running org.apache.activemq.bugs.AMQ2102Test
Tests run: 2, Failures: 0, Errors: 0, Skipped: 0, Time elapsed: 189.073 sec
Running org.apache.activemq.broker.BrokerServiceTest
Tests run: 5, Failures: 0, Errors: 0, Skipped: 0, Time elapsed: 4.199 sec
Running org.apache.activemq.ProducerFlowControlSendFailTest
Tests run: 7, Failures: 0, Errors: 0, Skipped: 0, Time elapsed: 14.222 sec
Running org.apache.activemq.ProducerFlowControlTest
Tests run: 6, Failures: 0, Errors: 0, Skipped: 0, Time elapsed: 25.365 sec
Running org.apache.activemq.broker.virtual.VirtualTopicsAndDurableSubsTest
Tests run: 7, Failures: 0, Errors: 0, Skipped: 0, Time elapsed: 14.329 sec
Running org.apache.activemq.openwire.v5.MessageDispatchTest
Tests run: 1, Failures: 0, Errors: 0, Skipped: 0, Time elapsed: 0.06 sec
Running org.apache.activemq.network.DuplexNetworkMBeanTest
Tests run: 2, Failures: 0, Errors: 0, Skipped: 0, Time elapsed: 120.649 sec
Running org.apache.activemq.openwire.v1.JournalTransactionTest
Tests run: 1, Failures: 0, Errors: 0, Skipped: 0, Time elapsed: 0.027 sec
Running org.apache.activemq.management.BoundedRangeStatisticTest
Tests run: 1, Failures: 0, Errors: 0, Skipped: 0, Time elapsed: 0.518 sec
Running org.apache.activemq.JmsSendReceiveWithMessageExpirationTest
Tests run: 4, Failures: 0, Errors: 0, Skipped: 0, Time elapsed: 14.654 sec
Running org.apache.activemq.transport.TopicClusterTest
Tests run: 1, Failures: 0, Errors: 0, Skipped: 0, Time elapsed: 10.692 sec
Running org.apache.activemq.store.kahadb.TempKahaDBStoreBrokerTest
Tests run: 129, Failures: 0, Errors: 0, Skipped: 0, Time elapsed: 178.81 sec
Running org.apache.activemq.command.ActiveMQMapMessageTest
Tests run: 17, Failures: 0, Errors: 0, Skipped: 0, Time elapsed: 0.552 sec
Running org.apache.activemq.openwire.v5.TransactionInfoTest
Tests run: 1, Failures: 0, Errors: 0, Skipped: 0, Time elapsed: 0.033 sec
Running org.apache.activemq.openwire.v1.ConnectionIdTest
Tests run: 1, Failures: 0, Errors: 0, Skipped: 0, Time elapsed: 0.021 sec
Running org.apache.activemq.openwire.v6.MessageDispatchTest
Tests run: 1, Failures: 0, Errors: 0, Skipped: 0, Time elapsed: 0.049 sec
Running org.apache.activemq.openwire.v6.BrokerInfoTest
Tests run: 1, Failures: 0, Errors: 0, Skipped: 0, Time elapsed: 0.029 sec
Running org.apache.activemq.openwire.v2.DataArrayResponseTest
Tests run: 1, Failures: 0, Errors: 0, Skipped: 0, Time elapsed: 0.035 sec
Running org.apache.activemq.JmsQueueWildcardSendReceiveTest
Tests run: 4, Failures: 0, Errors: 0, Skipped: 0, Time elapsed: 1.574 sec
Running org.apache.activemq.JMSIndividualAckTest
Tests run: 3, Failures: 0, Errors: 0, Skipped: 0, Time elapsed: 2.533 sec
Running org.apache.activemq.openwire.v5.DiscoveryEventTest
Tests run: 1, Failures: 0, Errors: 0, Skipped: 0, Time elapsed: 0.024 sec
Running org.apache.activemq.transport.QueueClusterTest
Tests run: 1, Failures: 0, Errors: 0, Skipped: 0, Time elapsed: 12.782 sec
Running org.apache.activemq.openwire.v2.ProducerIdTest
Tests run: 1, Failures: 0, Errors: 0, Skipped: 0, Time elapsed: 0.023 sec
Running org.apache.activemq.openwire.v3.SessionInfoTest
Tests run: 1, Failures: 0, Errors: 0, Skipped: 0, Time elapsed: 0.032 sec
Running org.apache.activemq.openwire.v1.ReplayCommandTest
Tests run: 1, Failures: 0, Errors: 0, Skipped: 0, Time elapsed: 0.024 sec
Running org.apache.activemq.openwire.v3.ConnectionIdTest
Tests run: 1, Failures: 0, Errors: 0, Skipped: 0, Time elapsed: 0.02 sec
Running org.apache.activemq.broker.region.group.MessageGroupHashBucketTest
Tests run: 2, Failures: 0, Errors: 0, Skipped: 0, Time elapsed: 0.025 sec
Running org.apache.activemq.openwire.v4.LastPartialCommandTest
Tests run: 1, Failures: 0, Errors: 0, Skipped: 0, Time elapsed: 0.032 sec
Running org.apache.activemq.network.jms.TopicBridgeSpringTest
Tests run: 1, Failures: 0, Errors: 0, Skipped: 0, Time elapsed: 0.981 sec
Running org.apache.activemq.openwire.v4.ProducerInfoTest
Tests run: 1, Failures: 0, Errors: 0, Skipped: 0, Time elapsed: 0.036 sec
Running org.apache.activemq.bugs.JmsDurableTopicSlowReceiveTest
Tests run: 2, Failures: 0, Errors: 0, Skipped: 0, Time elapsed: 103.26 sec
Running org.apache.activemq.openwire.v2.DataResponseTest
Tests run: 1, Failures: 0, Errors: 0, Skipped: 0, Time elapsed: 0.037 sec
Running org.apache.activemq.openwire.v2.SubscriptionInfoTest
Tests run: 1, Failures: 0, Errors: 0, Skipped: 0, Time elapsed: 0.039 sec
Running org.apache.activemq.bugs.AMQ2364Test
Tests run: 1, Failures: 0, Errors: 0, Skipped: 0, Time elapsed: 1.889 sec
Running org.apache.activemq.openwire.v4.ConnectionIdTest
Tests run: 1, Failures: 0, Errors: 0, Skipped: 0, Time elapsed: 0.023 sec
Running org.apache.activemq.network.ForwardingBridgeTest
Tests run: 4, Failures: 0, Errors: 0, Skipped: 0, Time elapsed: 8.151 sec
Running org.apache.activemq.openwire.v1.SubscriptionInfoTest
Tests run: 1, Failures: 0, Errors: 0, Skipped: 0, Time elapsed: 0.029 sec
Running org.apache.activemq.openwire.v4.NetworkBridgeFilterTest
Tests run: 1, Failures: 0, Errors: 0, Skipped: 0, Time elapsed: 0.027 sec
Running org.apache.activemq.openwire.v1.ConnectionInfoTest
Tests run: 1, Failures: 0, Errors: 0, Skipped: 0, Time elapsed: 0.031 sec
Running org.apache.activemq.openwire.v5.SessionIdTest
Tests run: 1, Failures: 0, Errors: 0, Skipped: 0, Time elapsed: 0.021 sec
Running org.apache.activemq.broker.policy.DeadLetterTest
Tests run: 4, Failures: 0, Errors: 0, Skipped: 0, Time elapsed: 1.619 sec
Running org.apache.activemq.JmsTopicTransactionTest
Tests run: 14, Failures: 0, Errors: 0, Skipped: 0, Time elapsed: 10.703 sec
Running org.apache.activemq.openwire.v1.MessageIdTest
Tests run: 1, Failures: 0, Errors: 0, Skipped: 0, Time elapsed: 0.024 sec
Running org.apache.activemq.openwire.v3.ConnectionErrorTest
Tests run: 1, Failures: 0, Errors: 0, Skipped: 0, Time elapsed: 0.026 sec
Running org.apache.activemq.JmsTopicSendReceiveSubscriberTest
Tests run: 1, Failures: 0, Errors: 0, Skipped: 0, Time elapsed: 0.379 sec
Running org.apache.activemq.openwire.v4.MessagePullTest
Tests run: 1, Failures: 0, Errors: 0, Skipped: 0, Time elapsed: 0.042 sec
Running org.apache.activemq.network.SimpleNetworkTest
Tests run: 4, Failures: 0, Errors: 0, Skipped: 0, Time elapsed: 33.023 sec
Running org.apache.activemq.openwire.v3.ProducerInfoTest
Tests run: 1, Failures: 0, Errors: 0, Skipped: 0, Time elapsed: 0.039 sec
Running org.apache.activemq.command.ActiveMQBytesMessageTest
Tests run: 19, Failures: 0, Errors: 0, Skipped: 0, Time elapsed: 0.042 sec
Running org.apache.activemq.openwire.v1.ActiveMQMapMessageTest
Tests run: 1, Failures: 0, Errors: 0, Skipped: 0, Time elapsed: 0.077 sec
Running org.apache.activemq.openwire.v2.ActiveMQTextMessageTest
Tests run: 1, Failures: 0, Errors: 0, Skipped: 0, Time elapsed: 0.078 sec
Running org.apache.activemq.store.jdbc.JDBCStoreBrokerTest
Tests run: 129, Failures: 0, Errors: 0, Skipped: 0, Time elapsed: 42.75 sec
Running org.apache.activemq.openwire.v5.ConsumerControlTest
Tests run: 1, Failures: 0, Errors: 0, Skipped: 0, Time elapsed: 0.03 sec
Running org.apache.activemq.openwire.v4.ReplayCommandTest
Tests run: 1, Failures: 0, Errors: 0, Skipped: 0, Time elapsed: 0.026 sec
Running org.apache.activemq.bugs.AMQ1687Test
Tests run: 1, Failures: 0, Errors: 0, Skipped: 0, Time elapsed: 2.199 sec
Running org.apache.activemq.broker.region.DestinationRemoveRestartTest
Tests run: 2, Failures: 0, Errors: 0, Skipped: 0, Time elapsed: 0.76 sec
Running org.apache.activemq.usecases.AMQStackOverFlowTest
Tests run: 1, Failures: 0, Errors: 0, Skipped: 0, Time elapsed: 5.333 sec
Running org.apache.activemq.JmsTopicSendReceiveTest
Tests run: 1, Failures: 0, Errors: 0, Skipped: 0, Time elapsed: 0.339 sec
Running org.apache.activemq.openwire.v6.XATransactionIdTest
Tests run: 1, Failures: 0, Errors: 0, Skipped: 0, Time elapsed: 0.024 sec
Running org.apache.activemq.openwire.v4.JournalQueueAckTest
Tests run: 1, Failures: 0, Errors: 0, Skipped: 0, Time elapsed: 0.049 sec
Running org.apache.activemq.broker.region.QueueDuplicatesFromStoreTest
Tests run: 2, Failures: 0, Errors: 0, Skipped: 0, Time elapsed: 12.905 sec
Running org.apache.activemq.openwire.v1.ActiveMQTempTopicTest
Tests run: 1, Failures: 0, Errors: 0, Skipped: 0, Time elapsed: 0.03 sec
Running org.apache.activemq.openwire.v3.ShutdownInfoTest
Tests run: 1, Failures: 0, Errors: 0, Skipped: 0, Time elapsed: 0.026 sec
Running org.apache.activemq.JmsDurableTopicTransactionTest
Tests run: 14, Failures: 0, Errors: 0, Skipped: 0, Time elapsed: 9.811 sec
Running org.apache.activemq.usecases.ThreeBrokerQueueNetworkUsingTcpTest
Tests run: 13, Failures: 0, Errors: 0, Skipped: 0, Time elapsed: 180.109 sec
Running org.apache.activemq.openwire.v3.BrokerIdTest
Tests run: 1, Failures: 0, Errors: 0, Skipped: 0, Time elapsed: 0.021 sec
Running org.apache.activemq.advisory.TempDestLoadTest
Tests run: 2, Failures: 0, Errors: 0, Skipped: 0, Time elapsed: 36.493 sec
Running org.apache.activemq.openwire.v4.SessionInfoTest
Tests run: 1, Failures: 0, Errors: 0, Skipped: 0, Time elapsed: 0.027 sec
Running org.apache.activemq.broker.policy.IndividualDeadLetterTest
Tests run: 5, Failures: 0, Errors: 0, Skipped: 0, Time elapsed: 3.687 sec
Running org.apache.activemq.streams.JMSInputStreamTest
Tests run: 4, Failures: 0, Errors: 0, Skipped: 0, Time elapsed: 0.679 sec
Running org.apache.activemq.util.LinkedNodeTest
Tests run: 3, Failures: 0, Errors: 0, Skipped: 0, Time elapsed: 0.019 sec
Running org.apache.activemq.openwire.v5.MessageDispatchNotificationTest
Tests run: 1, Failures: 0, Errors: 0, Skipped: 0, Time elapsed: 0.041 sec
Running org.apache.activemq.spring.SpringTest
Tests run: 6, Failures: 0, Errors: 0, Skipped: 0, Time elapsed: 11.434 sec
Running org.apache.activemq.openwire.v1.LocalTransactionIdTest
Tests run: 1, Failures: 0, Errors: 0, Skipped: 0, Time elapsed: 0.024 sec
Running org.apache.activemq.openwire.v6.DiscoveryEventTest
Tests run: 1, Failures: 0, Errors: 0, Skipped: 0, Time elapsed: 0.026 sec
Running org.apache.activemq.usecases.ThreeBrokerTopicNetworkUsingTcpTest
Tests run: 9, Failures: 0, Errors: 0, Skipped: 0, Time elapsed: 84.831 sec
Running org.apache.activemq.broker.virtual.VirtualTopicPubSubTest
Tests run: 2, Failures: 0, Errors: 0, Skipped: 0, Time elapsed: 0.59 sec
Running org.apache.activemq.broker.XARecoveryBrokerTest
Tests run: 5, Failures: 0, Errors: 0, Skipped: 0, Time elapsed: 5.48 sec
Running org.apache.activemq.JmsTopicSelectorTest
Tests run: 2, Failures: 0, Errors: 0, Skipped: 0, Time elapsed: 7.361 sec
Running org.apache.activemq.blob.FTPBlobTest
Tests run: 1, Failures: 0, Errors: 0, Skipped: 0, Time elapsed: 1.738 sec
Running org.apache.activemq.JMSUsecaseTest
Tests run: 20, Failures: 0, Errors: 0, Skipped: 0, Time elapsed: 3.194 sec
Running org.apache.activemq.blob.BlobTransferPolicyUriTest
Tests run: 1, Failures: 0, Errors: 0, Skipped: 0, Time elapsed: 0.022 sec
Running org.apache.activemq.filter.DestinationPathTest
Tests run: 1, Failures: 0, Errors: 0, Skipped: 0, Time elapsed: 0.019 sec
Running org.apache.activemq.openwire.v5.JournalQueueAckTest
Tests run: 1, Failures: 0, Errors: 0, Skipped: 0, Time elapsed: 0.048 sec
Running org.apache.activemq.usecases.TwoBrokerTopicSendReceiveUsingJavaConfigurationTest
Tests run: 1, Failures: 0, Errors: 0, Skipped: 0, Time elapsed: 7.206 sec
Running org.apache.activemq.openwire.v1.ControlCommandTest
Tests run: 1, Failures: 0, Errors: 0, Skipped: 0, Time elapsed: 0.027 sec
Running org.apache.activemq.config.ConfigTest
Tests run: 8, Failures: 0, Errors: 0, Skipped: 0, Time elapsed: 22.485 sec
Running org.apache.activemq.transport.stomp.StompSslTest
Build timed out. Aborting
[locks-and-latches] Releasing all the locks
[locks-and-latches] All the locks released
ERROR: Failed to parse POMs
hudson.remoting.ChannelClosedException: channel is already closed
	at hudson.remoting.Channel.send(Channel.java:412)
	at hudson.remoting.ProxyOutputStream.write(ProxyOutputStream.java:112)
	at hudson.remoting.ProxyOutputStream.write(ProxyOutputStream.java:100)
	at hudson.remoting.RemoteOutputStream.write(RemoteOutputStream.java:110)
	at java.io.BufferedOutputStream.flushBuffer(BufferedOutputStream.java:65)
	at java.io.BufferedOutputStream.flush(BufferedOutputStream.java:123)
	at java.io.BufferedOutputStream.flush(BufferedOutputStream.java:124)
	at java.io.ObjectOutputStream$BlockDataOutputStream.flush(ObjectOutputStream.java:1784)
	at java.io.ObjectOutputStream.flush(ObjectOutputStream.java:691)
	at hudson.remoting.Channel.send(Channel.java:418)
	at hudson.remoting.Request.call(Request.java:149)
	at hudson.remoting.Channel.call(Channel.java:551)
	at hudson.maven.ProcessCache$MavenProcess.call(ProcessCache.java:156)
	at hudson.maven.MavenModuleSetBuild$RunnerImpl.doRun(MavenModuleSetBuild.java:480)
	at hudson.model.AbstractBuild$AbstractRunner.run(AbstractBuild.java:416)
	at hudson.model.Run.run(Run.java:1243)
	at hudson.maven.MavenModuleSetBuild.run(MavenModuleSetBuild.java:304)
	at hudson.model.ResourceController.execute(ResourceController.java:88)
	at hudson.model.Executor.run(Executor.java:122)
FATAL: channel is already closed
hudson.remoting.ChannelClosedException: channel is already closed
	at hudson.remoting.Channel.send(Channel.java:412)
	at hudson.remoting.Request.call(Request.java:105)
	at hudson.remoting.Channel.call(Channel.java:551)
	at hudson.Launcher$RemoteLauncher.kill(Launcher.java:735)
	at hudson.model.AbstractBuild$AbstractRunner.run(AbstractBuild.java:421)
	at hudson.model.Run.run(Run.java:1243)
	at hudson.maven.MavenModuleSetBuild.run(MavenModuleSetBuild.java:304)
	at hudson.model.ResourceController.execute(ResourceController.java:88)
	at hudson.model.Executor.run(Executor.java:122)


Build failed in Hudson: ActiveMQ #343

Posted by Apache Hudson Server <hu...@hudson.zones.apache.org>.
See <http://hudson.zones.apache.org/hudson/job/ActiveMQ/343/changes>

Changes:

[dejanb] https://issues.apache.org/activemq/browse/AMQ-2706 - request-reply over network

------------------------------------------
[...truncated 5136 lines...]
Downloading: http://maven.springframework.org/osgi/org/springframework/osgi/spring-osgi-io/1.2.1/spring-osgi-io-1.2.1.jar
Downloading: http://repo1.maven.org/maven2/org/springframework/osgi/spring-osgi-io/1.2.1/spring-osgi-io-1.2.1.jar
[INFO] snapshot org.apache.activemq:activemq-jaas:5.4-SNAPSHOT: checking for updates from com.springsource.repository.bundles.external
[INFO] snapshot org.apache.activemq:activemq-jaas:5.4-SNAPSHOT: checking for updates from apache.snapshots
Downloading: http://repository.springsource.com/maven/bundles/external/org/apache/geronimo/specs/geronimo-jta_1.0.1B_spec/1.0.1/geronimo-jta_1.0.1B_spec-1.0.1.jar
Downloading: http://repo1.maven.org/maven2/org/apache/geronimo/specs/geronimo-jta_1.0.1B_spec/1.0.1/geronimo-jta_1.0.1B_spec-1.0.1.jar
Downloading: http://repository.springsource.com/maven/bundles/external/org/apache/geronimo/specs/geronimo-j2ee-management_1.0_spec/1.0/geronimo-j2ee-management_1.0_spec-1.0.jar
Downloading: http://repo1.maven.org/maven2/org/apache/geronimo/specs/geronimo-j2ee-management_1.0_spec/1.0/geronimo-j2ee-management_1.0_spec-1.0.jar
Downloading: http://repository.springsource.com/maven/bundles/external/org/apache/geronimo/specs/geronimo-annotation_1.0_spec/1.1.1/geronimo-annotation_1.0_spec-1.1.1.jar
Downloading: http://repo1.maven.org/maven2/org/apache/geronimo/specs/geronimo-annotation_1.0_spec/1.1.1/geronimo-annotation_1.0_spec-1.1.1.jar
Downloading: http://repository.springsource.com/maven/bundles/external/org/apache/geronimo/specs/geronimo-jacc_1.1_spec/1.0.1/geronimo-jacc_1.1_spec-1.0.1.jar
Downloading: http://repo1.maven.org/maven2/org/apache/geronimo/specs/geronimo-jacc_1.1_spec/1.0.1/geronimo-jacc_1.1_spec-1.0.1.jar
Downloading: http://repository.springsource.com/maven/bundles/external/commons-pool/commons-pool/1.5.4/commons-pool-1.5.4.jar
Downloading: http://repo1.maven.org/maven2/commons-pool/commons-pool/1.5.4/commons-pool-1.5.4.jar
Downloading: http://repository.springsource.com/maven/bundles/external/com/thoughtworks/xstream/xstream/1.3.1/xstream-1.3.1.jar
Downloading: http://repo1.maven.org/maven2/com/thoughtworks/xstream/xstream/1.3.1/xstream-1.3.1.jar
Downloading: http://repository.springsource.com/maven/bundles/external/xpp3/xpp3_min/1.1.4c/xpp3_min-1.1.4c.jar
Downloading: http://repo1.maven.org/maven2/xpp3/xpp3_min/1.1.4c/xpp3_min-1.1.4c.jar
Downloading: http://repository.springsource.com/maven/bundles/external/org/springframework/spring-context/3.0.1.RELEASE/spring-context-3.0.1.RELEASE.jar
Downloading: http://repo1.maven.org/maven2/org/springframework/spring-context/3.0.1.RELEASE/spring-context-3.0.1.RELEASE.jar
Downloading: http://repository.springsource.com/maven/bundles/external/org/springframework/spring-aop/3.0.1.RELEASE/spring-aop-3.0.1.RELEASE.jar
Downloading: http://repo1.maven.org/maven2/org/springframework/spring-aop/3.0.1.RELEASE/spring-aop-3.0.1.RELEASE.jar
Downloading: http://repository.springsource.com/maven/bundles/external/aopalliance/aopalliance/1.0/aopalliance-1.0.jar
Downloading: http://repo1.maven.org/maven2/aopalliance/aopalliance/1.0/aopalliance-1.0.jar
Downloading: http://repository.springsource.com/maven/bundles/external/org/springframework/spring-asm/3.0.1.RELEASE/spring-asm-3.0.1.RELEASE.jar
Downloading: http://repo1.maven.org/maven2/org/springframework/spring-asm/3.0.1.RELEASE/spring-asm-3.0.1.RELEASE.jar
Downloading: http://repository.springsource.com/maven/bundles/external/org/springframework/spring-beans/3.0.1.RELEASE/spring-beans-3.0.1.RELEASE.jar
Downloading: http://repo1.maven.org/maven2/org/springframework/spring-beans/3.0.1.RELEASE/spring-beans-3.0.1.RELEASE.jar
Downloading: http://repository.springsource.com/maven/bundles/external/org/springframework/spring-core/3.0.1.RELEASE/spring-core-3.0.1.RELEASE.jar
Downloading: http://repo1.maven.org/maven2/org/springframework/spring-core/3.0.1.RELEASE/spring-core-3.0.1.RELEASE.jar
Downloading: http://repository.springsource.com/maven/bundles/external/org/springframework/spring-expression/3.0.1.RELEASE/spring-expression-3.0.1.RELEASE.jar
Downloading: http://repo1.maven.org/maven2/org/springframework/spring-expression/3.0.1.RELEASE/spring-expression-3.0.1.RELEASE.jar
Downloading: http://repository.springsource.com/maven/bundles/external/org/apache/derby/derby/10.1.3.1/derby-10.1.3.1.jar
Downloading: http://repo1.maven.org/maven2/org/apache/derby/derby/10.1.3.1/derby-10.1.3.1.jar
Downloading: http://repository.springsource.com/maven/bundles/external/xalan/xalan/2.6.0/xalan-2.6.0.jar
Downloading: http://repo1.maven.org/maven2/xalan/xalan/2.6.0/xalan-2.6.0.jar
Downloading: http://repository.springsource.com/maven/bundles/external/xml-apis/xml-apis/1.0.b2/xml-apis-1.0.b2.jar
Downloading: http://repo1.maven.org/maven2/xml-apis/xml-apis/1.0.b2/xml-apis-1.0.b2.jar
Downloading: http://repository.springsource.com/maven/bundles/external/commons-net/commons-net/2.0/commons-net-2.0.jar
Downloading: http://repo1.maven.org/maven2/commons-net/commons-net/2.0/commons-net-2.0.jar
Downloading: http://repository.springsource.com/maven/bundles/external/org/hamcrest/hamcrest-all/1.1/hamcrest-all-1.1.jar
Downloading: http://repo1.maven.org/maven2/org/hamcrest/hamcrest-all/1.1/hamcrest-all-1.1.jar
Downloading: http://repository.springsource.com/maven/bundles/external/org/apache/activemq/activeio-core/3.1.2/activeio-core-3.1.2-tests.jar
Downloading: http://repo1.maven.org/maven2/org/apache/activemq/activeio-core/3.1.2/activeio-core-3.1.2-tests.jar
Downloading: http://repository.springsource.com/maven/bundles/external/org/codehaus/jettison/jettison/1.0/jettison-1.0.jar
Downloading: http://repo1.maven.org/maven2/org/codehaus/jettison/jettison/1.0/jettison-1.0.jar
Downloading: http://repository.springsource.com/maven/bundles/external/stax/stax-api/1.0.1/stax-api-1.0.1.jar
Downloading: http://repo1.maven.org/maven2/stax/stax-api/1.0.1/stax-api-1.0.1.jar
Downloading: http://repository.springsource.com/maven/bundles/external/org/springframework/spring-jms/3.0.1.RELEASE/spring-jms-3.0.1.RELEASE.jar
Downloading: http://repo1.maven.org/maven2/org/springframework/spring-jms/3.0.1.RELEASE/spring-jms-3.0.1.RELEASE.jar
Downloading: http://repository.springsource.com/maven/bundles/external/org/springframework/spring-tx/3.0.1.RELEASE/spring-tx-3.0.1.RELEASE.jar
Downloading: http://repo1.maven.org/maven2/org/springframework/spring-tx/3.0.1.RELEASE/spring-tx-3.0.1.RELEASE.jar
Downloading: http://repository.springsource.com/maven/bundles/external/org/springframework/spring-test/3.0.1.RELEASE/spring-test-3.0.1.RELEASE.jar
Downloading: http://repo1.maven.org/maven2/org/springframework/spring-test/3.0.1.RELEASE/spring-test-3.0.1.RELEASE.jar
Downloading: http://repository.springsource.com/maven/bundles/external/commons-primitives/commons-primitives/1.0/commons-primitives-1.0.jar
Downloading: http://repo1.maven.org/maven2/commons-primitives/commons-primitives/1.0/commons-primitives-1.0.jar
Downloading: http://repository.springsource.com/maven/bundles/external/axion/axion/1.0-M3-dev/axion-1.0-M3-dev.jar
Downloading: http://repo1.maven.org/maven2/axion/axion/1.0-M3-dev/axion-1.0-M3-dev.jar
Downloading: http://repository.springsource.com/maven/bundles/external/commons-codec/commons-codec/1.2/commons-codec-1.2.jar
Downloading: http://repo1.maven.org/maven2/commons-codec/commons-codec/1.2/commons-codec-1.2.jar
Downloading: http://repository.springsource.com/maven/bundles/external/net/java/dev/javacc/javacc/3.2/javacc-3.2.jar
Downloading: http://repo1.maven.org/maven2/net/java/dev/javacc/javacc/3.2/javacc-3.2.jar
Downloading: http://repository.springsource.com/maven/bundles/external/regexp/regexp/1.3/regexp-1.3.jar
Downloading: http://repo1.maven.org/maven2/regexp/regexp/1.3/regexp-1.3.jar
Downloading: http://repository.springsource.com/maven/bundles/external/org/apache/directory/server/apacheds-core/1.0.0/apacheds-core-1.0.0.jar
Downloading: http://repo1.maven.org/maven2/org/apache/directory/server/apacheds-core/1.0.0/apacheds-core-1.0.0.jar
Downloading: http://repository.springsource.com/maven/bundles/external/jdbm/jdbm/1.0/jdbm-1.0.jar
Downloading: http://m2.safehaus.org/jdbm/jdbm/1.0/jdbm-1.0.jar
Downloading: http://repo1.maven.org/maven2/jdbm/jdbm/1.0/jdbm-1.0.jar
Downloading: http://repository.springsource.com/maven/bundles/external/org/apache/directory/server/apacheds-core-shared/1.0.0/apacheds-core-shared-1.0.0.jar
Downloading: http://m2.safehaus.org/org/apache/directory/server/apacheds-core-shared/1.0.0/apacheds-core-shared-1.0.0.jar
Downloading: http://repo1.maven.org/maven2/org/apache/directory/server/apacheds-core-shared/1.0.0/apacheds-core-shared-1.0.0.jar
Downloading: http://repository.springsource.com/maven/bundles/external/org/apache/directory/shared/shared-ldap/0.9.5.3/shared-ldap-0.9.5.3.jar
Downloading: http://m2.safehaus.org/org/apache/directory/shared/shared-ldap/0.9.5.3/shared-ldap-0.9.5.3.jar
Downloading: http://repo1.maven.org/maven2/org/apache/directory/shared/shared-ldap/0.9.5.3/shared-ldap-0.9.5.3.jar
Downloading: http://repository.springsource.com/maven/bundles/external/org/apache/directory/shared/shared-asn1/0.9.5.3/shared-asn1-0.9.5.3.jar
Downloading: http://m2.safehaus.org/org/apache/directory/shared/shared-asn1/0.9.5.3/shared-asn1-0.9.5.3.jar
Downloading: http://repo1.maven.org/maven2/org/apache/directory/shared/shared-asn1/0.9.5.3/shared-asn1-0.9.5.3.jar
Downloading: http://repository.springsource.com/maven/bundles/external/antlr/antlr/2.7.6/antlr-2.7.6.jar
Downloading: http://m2.safehaus.org/antlr/antlr/2.7.6/antlr-2.7.6.jar
Downloading: http://repo1.maven.org/maven2/antlr/antlr/2.7.6/antlr-2.7.6.jar
Downloading: http://repository.springsource.com/maven/bundles/external/org/slf4j/slf4j-log4j12/1.5.0/slf4j-log4j12-1.5.0.jar
Downloading: http://repo1.maven.org/maven2/org/slf4j/slf4j-log4j12/1.5.0/slf4j-log4j12-1.5.0.jar
Downloading: http://repository.springsource.com/maven/bundles/external/org/jmock/jmock-junit4/2.5.1/jmock-junit4-2.5.1.jar
Downloading: http://repo1.maven.org/maven2/org/jmock/jmock-junit4/2.5.1/jmock-junit4-2.5.1.jar
Downloading: http://repository.springsource.com/maven/bundles/external/org/jmock/jmock/2.5.1/jmock-2.5.1.jar
Downloading: http://repo1.maven.org/maven2/org/jmock/jmock/2.5.1/jmock-2.5.1.jar
Downloading: http://repository.springsource.com/maven/bundles/external/org/hamcrest/hamcrest-core/1.1/hamcrest-core-1.1.jar
Downloading: http://repo1.maven.org/maven2/org/hamcrest/hamcrest-core/1.1/hamcrest-core-1.1.jar
Downloading: http://repository.springsource.com/maven/bundles/external/org/hamcrest/hamcrest-library/1.1/hamcrest-library-1.1.jar
Downloading: http://repo1.maven.org/maven2/org/hamcrest/hamcrest-library/1.1/hamcrest-library-1.1.jar
Downloading: http://repository.springsource.com/maven/bundles/external/junit/junit-dep/4.4/junit-dep-4.4.jar
Downloading: http://repo1.maven.org/maven2/junit/junit-dep/4.4/junit-dep-4.4.jar
Downloading: http://repository.springsource.com/maven/bundles/external/org/jmock/jmock-legacy/2.5.1/jmock-legacy-2.5.1.jar
Downloading: http://repo1.maven.org/maven2/org/jmock/jmock-legacy/2.5.1/jmock-legacy-2.5.1.jar
Downloading: http://repository.springsource.com/maven/bundles/external/org/objenesis/objenesis/1.0/objenesis-1.0.jar
Downloading: http://repo1.maven.org/maven2/org/objenesis/objenesis/1.0/objenesis-1.0.jar
Downloading: http://repository.springsource.com/maven/bundles/external/cglib/cglib-nodep/2.1_3/cglib-nodep-2.1_3.jar
Downloading: http://repo1.maven.org/maven2/cglib/cglib-nodep/2.1_3/cglib-nodep-2.1_3.jar
Downloading: http://repository.springsource.com/maven/bundles/external/org/apache/ftpserver/ftpserver-core/1.0.0/ftpserver-core-1.0.0.jar
Downloading: http://repo1.maven.org/maven2/org/apache/ftpserver/ftpserver-core/1.0.0/ftpserver-core-1.0.0.jar
Downloading: http://repository.springsource.com/maven/bundles/external/org/apache/ftpserver/ftplet-api/1.0.0/ftplet-api-1.0.0.jar
Downloading: http://repo1.maven.org/maven2/org/apache/ftpserver/ftplet-api/1.0.0/ftplet-api-1.0.0.jar
Downloading: http://repository.springsource.com/maven/bundles/external/org/apache/mina/mina-core/2.0.0-M4/mina-core-2.0.0-M4.jar
Downloading: http://repo1.maven.org/maven2/org/apache/mina/mina-core/2.0.0-M4/mina-core-2.0.0-M4.jar
[INFO] [enforcer:enforce {execution: default}]
Downloading: http://repo1.maven.org/maven2/org/codehaus/plexus/plexus-compiler-api/1.5.1/plexus-compiler-api-1.5.1.pom
Downloading: http://repository.springsource.com/maven/bundles/external/org/apache/maven/maven-profile/2.0/maven-profile-2.0.pom
Downloading: http://repo1.maven.org/maven2/org/apache/maven/maven-profile/2.0/maven-profile-2.0.pom
Downloading: http://repository.springsource.com/maven/bundles/external/org/apache/maven/maven-repository-metadata/2.0/maven-repository-metadata-2.0.pom
Downloading: http://repo1.maven.org/maven2/org/apache/maven/maven-repository-metadata/2.0/maven-repository-metadata-2.0.pom
Downloading: http://repository.springsource.com/maven/bundles/external/org/apache/maven/wagon/wagon-provider-api/1.0-alpha-5/wagon-provider-api-1.0-alpha-5.pom
Downloading: http://repo1.maven.org/maven2/org/apache/maven/wagon/wagon-provider-api/1.0-alpha-5/wagon-provider-api-1.0-alpha-5.pom
Downloading: http://repo1.maven.org/maven2/plexus/plexus-utils/1.0.1/plexus-utils-1.0.1.pom
Downloading: http://repo1.maven.org/maven2/plexus/plexus-root/1.0/plexus-root-1.0.pom
Downloading: http://repo1.maven.org/maven2/org/apache/maven/maven-plugin-api/2.0-beta-1/maven-plugin-api-2.0-beta-1.pom
Downloading: http://repo1.maven.org/maven2/org/apache/maven/maven/2.0-beta-1/maven-2.0-beta-1.pom
Downloading: http://repo1.maven.org/maven2/org/codehaus/plexus/plexus-compiler-api/1.5.1/plexus-compiler-api-1.5.1.jar
Downloading: http://repo1.maven.org/maven2/plexus/plexus-utils/1.0.1/plexus-utils-1.0.1.jar
[INFO] [javacc:javacc {execution: default}]
Java Compiler Compiler Version 3.2 (Parser Generator)
(type "javacc" with no arguments for help)
Reading from file <http://hudson.zones.apache.org/hudson/job/ActiveMQ/ws/trunk/activemq-core/src/main/grammar/SelectorParser.jj> . . .
Note: UNICODE_INPUT option is specified. Please make sure you create the parser/lexer usig a Reader with the correct character encoding.
File "TokenMgrError.java" does not exist.  Will create one.
File "ParseException.java" does not exist.  Will create one.
File "Token.java" does not exist.  Will create one.
File "SimpleCharStream.java" does not exist.  Will create one.
Parser generated successfully.
Downloading: http://repository.springsource.com/maven/bundles/external/junit/junit/4.4/junit-4.4.pom
Downloading: http://repo1.maven.org/maven2/junit/junit/4.4/junit-4.4.pom
[INFO] [activemq-protobuf:compile {execution: default}]
[INFO] Compiling: <http://hudson.zones.apache.org/hudson/job/ActiveMQ/ws/trunk/activemq-core/src/main/proto/journal-data.proto>
[INFO] [remote-resources:process {execution: default}]
[WARNING] Attempting to build MavenProject instance for Artifact (groovy:groovy-all:1.0-jsr-03) of type: jar; constructing POM artifact instead.
[INFO] [resources:resources]
[INFO] Using 'UTF-8' encoding to copy filtered resources.
[INFO] Copying 48 resources
[INFO] Copying 3 resources
[INFO] [compiler:compile]
[INFO] Compiling 1252 source files to <http://hudson.zones.apache.org/hudson/job/ActiveMQ/ws/trunk/activemq-core/target/classes>
Downloading: http://repo1.maven.org/maven2/org/springframework/spring-beans/2.0.5/spring-beans-2.0.5.pom
Downloading: http://repository.springsource.com/maven/bundles/external/org/springframework/spring-core/2.0.5/spring-core-2.0.5.pom
Downloading: http://repo1.maven.org/maven2/org/springframework/spring-core/2.0.5/spring-core-2.0.5.pom
Downloading: http://repo1.maven.org/maven2/org/springframework/spring-context/2.0.5/spring-context-2.0.5.pom
Downloading: http://repository.springsource.com/maven/bundles/external/org/springframework/spring-beans/2.5.6/spring-beans-2.5.6.pom
Downloading: http://repo1.maven.org/maven2/org/springframework/spring-beans/2.5.6/spring-beans-2.5.6.pom
Downloading: http://repo1.maven.org/maven2/org/codehaus/plexus/plexus-archiver/1.0-alpha-5/plexus-archiver-1.0-alpha-5.pom
Downloading: http://repo1.maven.org/maven2/org/codehaus/plexus/plexus-components/1.1.4/plexus-components-1.1.4.pom
Downloading: http://repo1.maven.org/maven2/org/apache/maven/maven-archiver/2.0/maven-archiver-2.0.pom
Downloading: http://repository.springsource.com/maven/bundles/external/org/codehaus/plexus/plexus-archiver/1.0-alpha-3/plexus-archiver-1.0-alpha-3.pom
Downloading: http://repo1.maven.org/maven2/org/codehaus/plexus/plexus-archiver/1.0-alpha-3/plexus-archiver-1.0-alpha-3.pom
Downloading: http://repository.springsource.com/maven/bundles/external/jmock/jmock/1.0.0/jmock-1.0.0.pom
Downloading: http://repo1.maven.org/maven2/jmock/jmock/1.0.0/jmock-1.0.0.pom
Downloading: http://repository.springsource.com/maven/bundles/external/commons-logging/commons-logging/1.0.3/commons-logging-1.0.3.jar
Downloading: http://repo1.maven.org/maven2/commons-logging/commons-logging/1.0.3/commons-logging-1.0.3.jar
Downloading: http://repo1.maven.org/maven2/org/springframework/spring-beans/2.0.5/spring-beans-2.0.5.jar
Downloading: http://repository.springsource.com/maven/bundles/external/org/springframework/spring-core/2.0.5/spring-core-2.0.5.jar
Downloading: http://repo1.maven.org/maven2/org/springframework/spring-core/2.0.5/spring-core-2.0.5.jar
Downloading: http://repo1.maven.org/maven2/org/springframework/spring-context/2.0.5/spring-context-2.0.5.jar
Downloading: http://repository.springsource.com/maven/bundles/external/junit/junit/3.8.1/junit-3.8.1.jar
Downloading: http://repo1.maven.org/maven2/junit/junit/3.8.1/junit-3.8.1.jar
Downloading: http://repo1.maven.org/maven2/org/codehaus/plexus/plexus-archiver/1.0-alpha-5/plexus-archiver-1.0-alpha-5.jar
Downloading: http://repo1.maven.org/maven2/org/apache/maven/maven-archiver/2.0/maven-archiver-2.0.jar
Downloading: http://repository.springsource.com/maven/bundles/external/jmock/jmock/1.0.0/jmock-1.0.0.jar
Downloading: http://repo1.maven.org/maven2/jmock/jmock/1.0.0/jmock-1.0.0.jar
[INFO] [xbean:mapping {execution: default}]
[INFO] Generating META-INF properties file: <http://hudson.zones.apache.org/hudson/job/ActiveMQ/ws/trunk/activemq-core/target/classes/META-INF/services/org/apache/xbean/spring/http/activemq.apache.org/schema/core> for namespace: http://activemq.apache.org/schema/core
[INFO] Generating Spring 2.0 handler mapping: <http://hudson.zones.apache.org/hudson/job/ActiveMQ/ws/trunk/activemq-core/target/classes/META-INF/spring.handlers> for namespace: http://activemq.apache.org/schema/core
[INFO] Generating HTML documentation file: <http://hudson.zones.apache.org/hudson/job/ActiveMQ/ws/trunk/activemq-core/target/classes/activemq.xsd.html> for namespace: http://activemq.apache.org/schema/core
Warning, could not load class: T: java.lang.ClassNotFoundException: T
Warning, could not load class: T: java.lang.ClassNotFoundException: T
Warning, could not load class: T: java.lang.ClassNotFoundException: T
[INFO] Generating XSD file: <http://hudson.zones.apache.org/hudson/job/ActiveMQ/ws/trunk/activemq-core/target/classes/activemq.xsd> for namespace: http://activemq.apache.org/schema/core
[INFO] Generating WIKI documentation file: <http://hudson.zones.apache.org/hudson/job/ActiveMQ/ws/trunk/activemq-core/target/classes/activemq.xsd.wiki> for namespace: http://activemq.apache.org/schema/core
[INFO] ...done.
[INFO] [resources:testResources]
[INFO] Using 'UTF-8' encoding to copy filtered resources.
[INFO] Copying 117 resources
[INFO] Copying 3 resources
[INFO] [compiler:testCompile]
[INFO] Compiling 893 source files to <http://hudson.zones.apache.org/hudson/job/ActiveMQ/ws/trunk/activemq-core/target/test-classes>
[WARNING] <http://hudson.zones.apache.org/hudson/job/ActiveMQ/ws/trunk/activemq-core/src/test/java/org/apache/activemq/bugs/embedded/ThreadExplorer.java>:[114,26] [deprecation] stop() in java.lang.Thread has been deprecated

[INFO] [surefire:test]
[INFO] Surefire report directory: <http://hudson.zones.apache.org/hudson/job/ActiveMQ/ws/trunk/activemq-core/target/surefire-reports>
2010-05-08 00:44:39,682 [pool-1-thread-1] INFO  SimpleSecurityBrokerSystemTest - Path to login config: <http://hudson.zones.apache.org/hudson/job/ActiveMQ/ws/trunk/activemq-jaas/target/test-classes/login.config>

-------------------------------------------------------
 T E S T S
-------------------------------------------------------
Running org.apache.activemq.JmsConsumerResetActiveListenerTest
Tests run: 2, Failures: 0, Errors: 0, Skipped: 0, Time elapsed: 0.611 sec
Running org.apache.activemq.openwire.v2.RemoveInfoTest
Tests run: 1, Failures: 0, Errors: 0, Skipped: 0, Time elapsed: 0.03 sec
Running org.apache.activemq.broker.virtual.MirroredQueueTest
Tests run: 2, Failures: 0, Errors: 0, Skipped: 0, Time elapsed: 0.44 sec
Running org.apache.activemq.security.SimpleSecurityBrokerSystemTest
Tests run: 50, Failures: 0, Errors: 0, Skipped: 0, Time elapsed: 14.187 sec
Running org.apache.activemq.broker.store.TransactionStoreTest
Tests run: 1, Failures: 0, Errors: 0, Skipped: 0, Time elapsed: 0.36 sec
Running org.apache.activemq.usecases.BrowseOverNetworkTest
Tests run: 1, Failures: 0, Errors: 0, Skipped: 0, Time elapsed: 36.325 sec
Running org.apache.activemq.openwire.ItStillMarshallsTheSameTest
Tests run: 1, Failures: 0, Errors: 0, Skipped: 0, Time elapsed: 0.058 sec
Running org.apache.activemq.openwire.v2.KeepAliveInfoTest
Tests run: 1, Failures: 0, Errors: 0, Skipped: 0, Time elapsed: 0.03 sec
Running org.apache.activemq.openwire.v6.JournalTraceTest
Tests run: 1, Failures: 0, Errors: 0, Skipped: 0, Time elapsed: 0.031 sec
Running org.apache.activemq.openwire.v1.ActiveMQObjectMessageTest
Tests run: 1, Failures: 0, Errors: 0, Skipped: 0, Time elapsed: 0.067 sec
Running org.apache.activemq.JMSExclusiveConsumerTest
Tests run: 5, Failures: 0, Errors: 0, Skipped: 0, Time elapsed: 5.69 sec
Running org.apache.activemq.store.jdbc.JDBCNetworkBrokerDetachTest
Build timed out. Aborting
[locks-and-latches] Releasing all the locks
[locks-and-latches] All the locks released
ERROR: Failed to parse POMs
hudson.remoting.ChannelClosedException: channel is already closed
	at hudson.remoting.Channel.send(Channel.java:412)
	at hudson.remoting.ProxyOutputStream.write(ProxyOutputStream.java:112)
	at hudson.remoting.ProxyOutputStream.write(ProxyOutputStream.java:100)
	at hudson.remoting.RemoteOutputStream.write(RemoteOutputStream.java:110)
	at java.io.BufferedOutputStream.flushBuffer(BufferedOutputStream.java:65)
	at java.io.BufferedOutputStream.flush(BufferedOutputStream.java:123)
	at java.io.BufferedOutputStream.flush(BufferedOutputStream.java:124)
	at java.io.ObjectOutputStream$BlockDataOutputStream.flush(ObjectOutputStream.java:1784)
	at java.io.ObjectOutputStream.flush(ObjectOutputStream.java:691)
	at hudson.remoting.Channel.send(Channel.java:418)
	at hudson.remoting.Request.call(Request.java:149)
	at hudson.remoting.Channel.call(Channel.java:551)
	at hudson.maven.ProcessCache$MavenProcess.call(ProcessCache.java:156)
	at hudson.maven.MavenModuleSetBuild$RunnerImpl.doRun(MavenModuleSetBuild.java:480)
	at hudson.model.AbstractBuild$AbstractRunner.run(AbstractBuild.java:416)
	at hudson.model.Run.run(Run.java:1243)
	at hudson.maven.MavenModuleSetBuild.run(MavenModuleSetBuild.java:304)
	at hudson.model.ResourceController.execute(ResourceController.java:88)
	at hudson.model.Executor.run(Executor.java:122)
FATAL: channel is already closed
hudson.remoting.ChannelClosedException: channel is already closed
	at hudson.remoting.Channel.send(Channel.java:412)
	at hudson.remoting.Request.call(Request.java:105)
	at hudson.remoting.Channel.call(Channel.java:551)
	at hudson.Launcher$RemoteLauncher.kill(Launcher.java:735)
	at hudson.model.AbstractBuild$AbstractRunner.run(AbstractBuild.java:421)
	at hudson.model.Run.run(Run.java:1243)
	at hudson.maven.MavenModuleSetBuild.run(MavenModuleSetBuild.java:304)
	at hudson.model.ResourceController.execute(ResourceController.java:88)
	at hudson.model.Executor.run(Executor.java:122)


Hudson build is still unstable: ActiveMQ #342

Posted by Apache Hudson Server <hu...@hudson.zones.apache.org>.
See <http://hudson.zones.apache.org/hudson/job/ActiveMQ/changes>



Hudson build is still unstable: ActiveMQ #341

Posted by Apache Hudson Server <hu...@hudson.zones.apache.org>.
See <http://hudson.zones.apache.org/hudson/job/ActiveMQ/changes>