You are viewing a plain text version of this content. The canonical link for it is here.
Posted to commits@myfaces.apache.org by Apache Jenkins Server <je...@builds.apache.org> on 2018/10/19 16:28:45 UTC

Build failed in Jenkins: myfaces-current23 #350

See <https://builds.apache.org/job/myfaces-current23/350/display/redirect?page=changes>

Changes:

[tandraschko] removed some trinidad, tobago, adf and long-time deprecated code

[tandraschko] cleanup deprecated and duplicate code

[tandraschko] cleanup duplicate code

[tandraschko] cleanup unused code

------------------------------------------
Started by an SCM change
[EnvInject] - Loading node environment variables.
Building remotely on windows-2016-2 (Windows) in workspace <https://builds.apache.org/job/myfaces-current23/ws/>
 > git rev-parse --is-inside-work-tree # timeout=10
Fetching changes from the remote Git repository
 > git config remote.origin.url https://gitbox.apache.org/repos/asf/myfaces.git # timeout=10
Fetching upstream changes from https://gitbox.apache.org/repos/asf/myfaces.git
 > git --version # timeout=10
 > git fetch --tags --progress https://gitbox.apache.org/repos/asf/myfaces.git +refs/heads/*:refs/remotes/origin/*
 > git rev-parse "refs/remotes/origin/master^{commit}" # timeout=10
 > git rev-parse "refs/remotes/origin/origin/master^{commit}" # timeout=10
Checking out Revision 40f6f904e9b8e55e047b00ade174cdda1f4726b0 (refs/remotes/origin/master)
 > git config core.sparsecheckout # timeout=10
 > git checkout -f 40f6f904e9b8e55e047b00ade174cdda1f4726b0
Commit message: "cleanup unused code"
 > git rev-list --no-walk c715d3962ac39176f0ac01ab0355b41d3cba9db7 # timeout=10
[myfaces-current23] $ cmd.exe /C "f:\jenkins\tools\maven\latest\bin\mvn.cmd -Dmaven.repo.local=<https://builds.apache.org/job/myfaces-current23/ws/.repository> clean && exit %%ERRORLEVEL%%"
[INFO] Scanning for projects...
[INFO] ------------------------------------------------------------------------
[INFO] Reactor Build Order:
[INFO] 
[INFO] Apache MyFaces Core 3.0 - Parent
[INFO] Apache MyFaces Core 3.0 - API
[INFO] Apache MyFaces Core 3.0 - Impl Shared Public
[INFO] Apache MyFaces Core 3.0 - Impl Shared
[INFO] Apache MyFaces Core 3.0 - Impl
[INFO] Apache MyFaces Core 3.0 - OSGi Bundle
[INFO] Apache MyFaces Core 3.0 - Impl Test
[INFO] Apache MyFaces Core 3.0
[INFO] 
[INFO] ------------------------------------------------------------------------
[INFO] Building Apache MyFaces Core 3.0 - Parent 3.0.0-SNAPSHOT
[INFO] ------------------------------------------------------------------------
[INFO] 
[INFO] --- maven-clean-plugin:3.1.0:clean (default-clean) @ myfaces-core-project ---
[INFO] Deleting F:\jenkins\jenkins-slave\workspace\myfaces-current23\parent\target
[INFO] 
[INFO] ------------------------------------------------------------------------
[INFO] Building Apache MyFaces Core 3.0 - API 3.0.0-SNAPSHOT
[INFO] ------------------------------------------------------------------------
[INFO] 
[INFO] --- maven-clean-plugin:3.1.0:clean (default-clean) @ myfaces-api ---
[INFO] 
[INFO] ------------------------------------------------------------------------
[INFO] Building Apache MyFaces Core 3.0 - Impl Shared Public 3.0.0-SNAPSHOT
[INFO] ------------------------------------------------------------------------
[INFO] 
[INFO] --- maven-clean-plugin:3.1.0:clean (default-clean) @ myfaces-impl-shared-public ---
[INFO] 
[INFO] ------------------------------------------------------------------------
[INFO] Building Apache MyFaces Core 3.0 - Impl Shared 3.0.0-SNAPSHOT
[INFO] ------------------------------------------------------------------------
[INFO] 
[INFO] --- maven-clean-plugin:3.1.0:clean (default-clean) @ myfaces-impl-shared ---
[INFO] 
[INFO] ------------------------------------------------------------------------
[INFO] Building Apache MyFaces Core 3.0 - Impl 3.0.0-SNAPSHOT
[INFO] ------------------------------------------------------------------------
[INFO] 
[INFO] --- maven-clean-plugin:3.1.0:clean (default-clean) @ myfaces-impl ---
[INFO] 
[INFO] ------------------------------------------------------------------------
[INFO] Building Apache MyFaces Core 3.0 - OSGi Bundle 3.0.0-SNAPSHOT
[INFO] ------------------------------------------------------------------------
[INFO] 
[INFO] --- maven-clean-plugin:3.1.0:clean (default-clean) @ myfaces-bundle ---
[INFO] 
[INFO] ------------------------------------------------------------------------
[INFO] Building Apache MyFaces Core 3.0 - Impl Test 3.0.0-SNAPSHOT
[INFO] ------------------------------------------------------------------------
[INFO] 
[INFO] --- maven-clean-plugin:3.1.0:clean (default-clean) @ myfaces-impl-test ---
[INFO] 
[INFO] ------------------------------------------------------------------------
[INFO] Building Apache MyFaces Core 3.0 3.0.0-SNAPSHOT
[INFO] ------------------------------------------------------------------------
[INFO] 
[INFO] --- maven-clean-plugin:3.1.0:clean (default-clean) @ myfaces-core-module ---
[INFO] ------------------------------------------------------------------------
[INFO] Reactor Summary:
[INFO] 
[INFO] Apache MyFaces Core 3.0 - Parent ................... SUCCESS [  0.378 s]
[INFO] Apache MyFaces Core 3.0 - API ...................... SUCCESS [  0.099 s]
[INFO] Apache MyFaces Core 3.0 - Impl Shared Public ....... SUCCESS [  0.004 s]
[INFO] Apache MyFaces Core 3.0 - Impl Shared .............. SUCCESS [  0.005 s]
[INFO] Apache MyFaces Core 3.0 - Impl ..................... SUCCESS [  0.004 s]
[INFO] Apache MyFaces Core 3.0 - OSGi Bundle .............. SUCCESS [  0.050 s]
[INFO] Apache MyFaces Core 3.0 - Impl Test ................ SUCCESS [  0.004 s]
[INFO] Apache MyFaces Core 3.0 ............................ SUCCESS [  0.002 s]
[INFO] ------------------------------------------------------------------------
[INFO] BUILD SUCCESS
[INFO] ------------------------------------------------------------------------
[INFO] Total time: 2.572 s
[INFO] Finished at: 2018-10-19T09:27:55-07:00
[INFO] Final Memory: 15M/161M
[INFO] ------------------------------------------------------------------------
Java HotSpot(TM) 64-Bit Server VM warning: ignoring option MaxPermSize=256m; support was removed in 8.0
Parsing POMs
Established TCP socket on 60526
maven35-agent.jar already up to date
maven35-interceptor.jar already up to date
maven3-interceptor-commons.jar already up to date
[myfaces-current23] $ f:\\jenkins\\tools\\java\\latest1.8/bin/java -Xmx2048m -Xms128m -XX:MaxPermSize=256m -cp f:\jenkins\jenkins-slave\maven35-agent.jar;f:\jenkins\tools\maven\latest\boot\plexus-classworlds-2.5.2.jar;f:\\jenkins\\tools\\maven\\latest/conf/logging jenkins.maven3.agent.Maven35Main f:\\jenkins\\tools\\maven\\latest F:\jenkins\jenkins-slave\slave.jar f:\jenkins\jenkins-slave\maven35-interceptor.jar f:\jenkins\jenkins-slave\maven3-interceptor-commons.jar 60526
<===[JENKINS REMOTING CAPACITY]===>   channel started
Executing Maven:  -B -f <https://builds.apache.org/job/myfaces-current23/ws/pom.xml> -Dmaven.repo.local=f:\jenkins\jenkins-slave\maven-repositories\1 clean install deploy
[INFO] Scanning for projects...
[INFO] ------------------------------------------------------------------------
[INFO] Reactor Build Order:
[INFO] 
[INFO] Apache MyFaces Core 3.0 - Parent
[INFO] Apache MyFaces Core 3.0 - API
[INFO] Apache MyFaces Core 3.0 - Impl Shared Public
[INFO] Apache MyFaces Core 3.0 - Impl Shared
[INFO] Apache MyFaces Core 3.0 - Impl
[INFO] Apache MyFaces Core 3.0 - OSGi Bundle
[INFO] Apache MyFaces Core 3.0 - Impl Test
[INFO] Apache MyFaces Core 3.0
[INFO] 
[INFO] ------------------------------------------------------------------------
[INFO] Building Apache MyFaces Core 3.0 - Parent 3.0.0-SNAPSHOT
[INFO] ------------------------------------------------------------------------
[INFO] 
[INFO] --- maven-clean-plugin:3.1.0:clean (default-clean) @ myfaces-core-project ---
[INFO] 
[INFO] --- maven-enforcer-plugin:1.4.1:enforce (enforce-maven-version) @ myfaces-core-project ---
[INFO] 
[INFO] --- maven-remote-resources-plugin:1.5:process (process-resource-bundles) @ myfaces-core-project ---
[INFO] 
[INFO] >>> maven-source-plugin:2.2.1:jar (attach-source) > generate-sources @ myfaces-core-project >>>
[INFO] 
[INFO] --- maven-enforcer-plugin:1.4.1:enforce (enforce-maven-version) @ myfaces-core-project ---
[WARNING] Failed to getClass for org.apache.maven.plugin.source.SourceJarMojo
[INFO] 
[INFO] <<< maven-source-plugin:2.2.1:jar (attach-source) < generate-sources @ myfaces-core-project <<<
[INFO] 
[INFO] 
[INFO] --- maven-source-plugin:2.2.1:jar (attach-source) @ myfaces-core-project ---
[INFO] 
[INFO] --- maven-site-plugin:3.3:attach-descriptor (attach-descriptor) @ myfaces-core-project ---
[INFO] 
[INFO] --- maven-checkstyle-plugin:2.17:check (verify-style) @ myfaces-core-project ---
[INFO] Starting audit...
Audit done.
[INFO] 
[INFO] --- maven-install-plugin:2.5.2:install (default-install) @ myfaces-core-project ---
[INFO] Installing F:\jenkins\jenkins-slave\workspace\myfaces-current23\parent\pom.xml to f:\jenkins\jenkins-slave\maven-repositories\1\org\apache\myfaces\core\myfaces-core-project\3.0.0-SNAPSHOT\myfaces-core-project-3.0.0-SNAPSHOT.pom
[INFO] Installing F:\jenkins\jenkins-slave\workspace\myfaces-current23\parent\target\myfaces-core-project-3.0.0-SNAPSHOT-site.xml to f:\jenkins\jenkins-slave\maven-repositories\1\org\apache\myfaces\core\myfaces-core-project\3.0.0-SNAPSHOT\myfaces-core-project-3.0.0-SNAPSHOT-site.xml
[INFO] 
[INFO] --- maven-enforcer-plugin:1.4.1:enforce (enforce-maven-version) @ myfaces-core-project ---
[INFO] 
[INFO] --- maven-remote-resources-plugin:1.5:process (process-resource-bundles) @ myfaces-core-project ---
[INFO] 
[INFO] >>> maven-source-plugin:2.2.1:jar (attach-source) > generate-sources @ myfaces-core-project >>>
[INFO] 
[INFO] --- maven-enforcer-plugin:1.4.1:enforce (enforce-maven-version) @ myfaces-core-project ---
[WARNING] Failed to getClass for org.apache.maven.plugin.source.SourceJarMojo
[INFO] 
[INFO] <<< maven-source-plugin:2.2.1:jar (attach-source) < generate-sources @ myfaces-core-project <<<
[INFO] 
[INFO] 
[INFO] --- maven-source-plugin:2.2.1:jar (attach-source) @ myfaces-core-project ---
[INFO] 
[INFO] --- maven-site-plugin:3.3:attach-descriptor (attach-descriptor) @ myfaces-core-project ---
[INFO] 
[INFO] --- maven-checkstyle-plugin:2.17:check (verify-style) @ myfaces-core-project ---
[INFO] Starting audit...
Audit done.
[INFO] 
[INFO] --- maven-install-plugin:2.5.2:install (default-install) @ myfaces-core-project ---
[INFO] Installing F:\jenkins\jenkins-slave\workspace\myfaces-current23\parent\pom.xml to f:\jenkins\jenkins-slave\maven-repositories\1\org\apache\myfaces\core\myfaces-core-project\3.0.0-SNAPSHOT\myfaces-core-project-3.0.0-SNAPSHOT.pom
[INFO] Installing F:\jenkins\jenkins-slave\workspace\myfaces-current23\parent\target\myfaces-core-project-3.0.0-SNAPSHOT-site.xml to f:\jenkins\jenkins-slave\maven-repositories\1\org\apache\myfaces\core\myfaces-core-project\3.0.0-SNAPSHOT\myfaces-core-project-3.0.0-SNAPSHOT-site.xml
[INFO] Installing F:\jenkins\jenkins-slave\workspace\myfaces-current23\parent\target\myfaces-core-project-3.0.0-SNAPSHOT-site.xml to f:\jenkins\jenkins-slave\maven-repositories\1\org\apache\myfaces\core\myfaces-core-project\3.0.0-SNAPSHOT\myfaces-core-project-3.0.0-SNAPSHOT-site.xml
[INFO] 
[INFO] --- maven-deploy-plugin:2.8.2:deploy (default-deploy) @ myfaces-core-project ---
[INFO] Downloading from apache.snapshots.https: https://repository.apache.org/content/repositories/snapshots/org/apache/myfaces/core/myfaces-core-project/3.0.0-SNAPSHOT/maven-metadata.xml
[INFO] Downloaded from apache.snapshots.https: https://repository.apache.org/content/repositories/snapshots/org/apache/myfaces/core/myfaces-core-project/3.0.0-SNAPSHOT/maven-metadata.xml (834 B at 719 B/s)
[INFO] Uploading to apache.snapshots.https: https://repository.apache.org/content/repositories/snapshots/org/apache/myfaces/core/myfaces-core-project/3.0.0-SNAPSHOT/myfaces-core-project-3.0.0-20181019.162817-14.pom
[INFO] Uploaded to apache.snapshots.https: https://repository.apache.org/content/repositories/snapshots/org/apache/myfaces/core/myfaces-core-project/3.0.0-SNAPSHOT/myfaces-core-project-3.0.0-20181019.162817-14.pom (26 kB at 21 kB/s)
[INFO] Downloading from apache.snapshots.https: https://repository.apache.org/content/repositories/snapshots/org/apache/myfaces/core/myfaces-core-project/maven-metadata.xml
[INFO] Downloaded from apache.snapshots.https: https://repository.apache.org/content/repositories/snapshots/org/apache/myfaces/core/myfaces-core-project/maven-metadata.xml (662 B at 1.1 kB/s)
[INFO] Uploading to apache.snapshots.https: https://repository.apache.org/content/repositories/snapshots/org/apache/myfaces/core/myfaces-core-project/3.0.0-SNAPSHOT/maven-metadata.xml
[INFO] Uploaded to apache.snapshots.https: https://repository.apache.org/content/repositories/snapshots/org/apache/myfaces/core/myfaces-core-project/3.0.0-SNAPSHOT/maven-metadata.xml (834 B at 744 B/s)
[INFO] Uploading to apache.snapshots.https: https://repository.apache.org/content/repositories/snapshots/org/apache/myfaces/core/myfaces-core-project/maven-metadata.xml
[INFO] Uploaded to apache.snapshots.https: https://repository.apache.org/content/repositories/snapshots/org/apache/myfaces/core/myfaces-core-project/maven-metadata.xml (662 B at 593 B/s)
[INFO] Uploading to apache.snapshots.https: https://repository.apache.org/content/repositories/snapshots/org/apache/myfaces/core/myfaces-core-project/3.0.0-SNAPSHOT/myfaces-core-project-3.0.0-20181019.162817-14-site.xml
[INFO] Uploaded to apache.snapshots.https: https://repository.apache.org/content/repositories/snapshots/org/apache/myfaces/core/myfaces-core-project/3.0.0-SNAPSHOT/myfaces-core-project-3.0.0-20181019.162817-14-site.xml (6.5 kB at 5.8 kB/s)
[INFO] Uploading to apache.snapshots.https: https://repository.apache.org/content/repositories/snapshots/org/apache/myfaces/core/myfaces-core-project/3.0.0-SNAPSHOT/maven-metadata.xml
[INFO] Uploaded to apache.snapshots.https: https://repository.apache.org/content/repositories/snapshots/org/apache/myfaces/core/myfaces-core-project/3.0.0-SNAPSHOT/maven-metadata.xml (834 B at 761 B/s)
[INFO] Uploading to apache.snapshots.https: https://repository.apache.org/content/repositories/snapshots/org/apache/myfaces/core/myfaces-core-project/3.0.0-SNAPSHOT/myfaces-core-project-3.0.0-20181019.162817-14-site.xml
[INFO] Uploaded to apache.snapshots.https: https://repository.apache.org/content/repositories/snapshots/org/apache/myfaces/core/myfaces-core-project/3.0.0-SNAPSHOT/myfaces-core-project-3.0.0-20181019.162817-14-site.xml (6.5 kB at 5.8 kB/s)
[INFO] Uploading to apache.snapshots.https: https://repository.apache.org/content/repositories/snapshots/org/apache/myfaces/core/myfaces-core-project/3.0.0-SNAPSHOT/maven-metadata.xml
[INFO] Uploaded to apache.snapshots.https: https://repository.apache.org/content/repositories/snapshots/org/apache/myfaces/core/myfaces-core-project/3.0.0-SNAPSHOT/maven-metadata.xml (834 B at 747 B/s)
[WARNING] Attempt to (de-)serialize anonymous class hudson.maven.reporters.MavenArtifactArchiver$2; see: https://jenkins.io/redirect/serialization-of-anonymous-classes/
[WARNING] Attempt to (de-)serialize anonymous class hudson.maven.reporters.MavenFingerprinter$1; see: https://jenkins.io/redirect/serialization-of-anonymous-classes/
[INFO] 
[INFO] ------------------------------------------------------------------------
[INFO] Building Apache MyFaces Core 3.0 - API 3.0.0-SNAPSHOT
[INFO] ------------------------------------------------------------------------
[WARNING] The POM for org.apache.myfaces.test:myfaces-test30:jar:1.0.9-SNAPSHOT is missing, no dependency information available
[INFO] ------------------------------------------------------------------------
[INFO] Reactor Summary:
[INFO] 
[INFO] Apache MyFaces Core 3.0 - Parent ................... SUCCESS [ 18.168 s]
[INFO] Apache MyFaces Core 3.0 - API ...................... FAILURE [  0.331 s]
[INFO] Apache MyFaces Core 3.0 - Impl Shared Public ....... SKIPPED
[INFO] Apache MyFaces Core 3.0 - Impl Shared .............. SKIPPED
[INFO] Apache MyFaces Core 3.0 - Impl ..................... SKIPPED
[INFO] Apache MyFaces Core 3.0 - OSGi Bundle .............. SKIPPED
[INFO] Apache MyFaces Core 3.0 - Impl Test ................ SKIPPED
[INFO] Apache MyFaces Core 3.0 ............................ SKIPPED
[INFO] ------------------------------------------------------------------------
[INFO] BUILD FAILURE
[INFO] ------------------------------------------------------------------------
[INFO] Total time: 28.237 s
[INFO] Finished at: 2018-10-19T09:28:32-07:00
[INFO] Final Memory: 35M/289M
[INFO] ------------------------------------------------------------------------
[ERROR] Failed to execute goal on project myfaces-api: Could not resolve dependencies for project org.apache.myfaces.core:myfaces-api:jar:3.0.0-SNAPSHOT: Failure to find org.apache.myfaces.test:myfaces-test30:jar:1.0.9-SNAPSHOT in http://repository.apache.org/snapshots/ was cached in the local repository, resolution will not be reattempted until the update interval of apache-snapshots has elapsed or updates are forced -> [Help 1]
[ERROR] 
[ERROR] To see the full stack trace of the errors, re-run Maven with the -e switch.
[ERROR] Re-run Maven using the -X switch to enable full debug logging.
[ERROR] 
[ERROR] For more information about the errors and possible solutions, please read the following articles:
[ERROR] [Help 1] http://cwiki.apache.org/confluence/display/MAVEN/DependencyResolutionException
[ERROR] 
[ERROR] After correcting the problems, you can resume the build with the command
[ERROR]   mvn <goals> -rf :myfaces-api
[JENKINS] Archiving F:\jenkins\jenkins-slave\workspace\myfaces-current23\api\pom.xml to org.apache.myfaces.core/myfaces-api/3.0.0-SNAPSHOT/myfaces-api-3.0.0-SNAPSHOT.pom
[JENKINS] Archiving F:\jenkins\jenkins-slave\workspace\myfaces-current23\shared\pom.xml to org.apache.myfaces.core.internal/myfaces-impl-shared/3.0.0-SNAPSHOT/myfaces-impl-shared-3.0.0-SNAPSHOT.pom
[JENKINS] Archiving F:\jenkins\jenkins-slave\workspace\myfaces-current23\impl\pom.xml to org.apache.myfaces.core/myfaces-impl/3.0.0-SNAPSHOT/myfaces-impl-3.0.0-SNAPSHOT.pom
[Fast Archiver] Compressed 66.37 KB of artifacts by 48.2% relative to #346
[JENKINS] Archiving F:\jenkins\jenkins-slave\workspace\myfaces-current23\bundle\pom.xml to org.apache.myfaces.core/myfaces-bundle/3.0.0-SNAPSHOT/myfaces-bundle-3.0.0-SNAPSHOT.pom
[JENKINS] Archiving <https://builds.apache.org/job/myfaces-current23/ws/pom.xml> to org.apache.myfaces.core/myfaces-core-module/3.0.0-SNAPSHOT/myfaces-core-module-3.0.0-SNAPSHOT.pom
[JENKINS] Archiving F:\jenkins\jenkins-slave\workspace\myfaces-current23\shared-public\pom.xml to org.apache.myfaces.core.internal/myfaces-impl-shared-public/3.0.0-SNAPSHOT/myfaces-impl-shared-public-3.0.0-SNAPSHOT.pom
[JENKINS] Archiving F:\jenkins\jenkins-slave\workspace\myfaces-current23\impl-test\pom.xml to org.apache.myfaces.core/myfaces-impl-test/3.0.0-SNAPSHOT/myfaces-impl-test-3.0.0-SNAPSHOT.pom
[JENKINS] Archiving F:\jenkins\jenkins-slave\workspace\myfaces-current23\parent\pom.xml to org.apache.myfaces.core/myfaces-core-project/3.0.0-SNAPSHOT/myfaces-core-project-3.0.0-SNAPSHOT.pom
[JENKINS] Archiving F:\jenkins\jenkins-slave\workspace\myfaces-current23\parent\target\myfaces-core-project-3.0.0-SNAPSHOT-site.xml to org.apache.myfaces.core/myfaces-core-project/3.0.0-20181019.162817-14/myfaces-core-project-3.0.0-20181019.162817-14-site.xml
Sending e-mails to: commits@myfaces.apache.org grantsmith@apache.org tandraschko@apache.org
channel stopped
Java HotSpot(TM) 64-Bit Server VM warning: ignoring option MaxPermSize=256m; support was removed in 8.0

Jenkins build is back to normal : myfaces-current23 #361

Posted by Apache Jenkins Server <je...@builds.apache.org>.
See <https://builds.apache.org/job/myfaces-current23/361/display/redirect?page=changes>


Build failed in Jenkins: myfaces-current23 #360

Posted by Apache Jenkins Server <je...@builds.apache.org>.
See <https://builds.apache.org/job/myfaces-current23/360/display/redirect?page=changes>

Changes:

[tandraschko] duplicate/unused code

------------------------------------------
[...truncated 121.22 KB...]
[INFO] Using 'eval' reduces the level of compression!
function (){var _r=window.eval ---> . <--- call(window,code);if(

[WARNING] [WARNING] Using 'eval' is not recommended...
[INFO] Using 'eval' reduces the level of compression!
_T[_e]||((_w.eval ---> && <--- (!_b.isBlackBerry||_b.isBlackBerry

[WARNING] [WARNING] Using 'eval' is not recommended...
[INFO] Using 'eval' reduces the level of compression!
_T[_e]||((_w.eval ---> ) <--- ?"_evalHeadAppendix":null);}if(

[WARNING] [WARNING] Using 'eval' is not recommended...
[INFO] Using 'eval' reduces the level of compression!
[_e]](c);}eval ---> . <--- call(window,c);return null

[WARNING] [WARNING] The variable _T has already been declared in the same scope...
,tv=parseFloat(dav);var _T ---> = <--- this;_T.browser={};

[WARNING] [WARNING] The variable tagNameStart has already been declared in the same scope...
,_tokenPos=0,_tokenForward=1,tagNameStart ---> = <--- (!tagNameStart)?BEGIN_TAG:tagNameStart;

[WARNING] [WARNING] The variable i has already been declared in the same scope...
&&params!=null){for(var i ---> = <--- 0,param;(param=params[

[WARNING] [WARNING] The variable param has already been declared in the same scope...
){for(var i=0,param ---> ; <--- (param=params[i]);

[WARNING] [WARNING] The symbol assigned is declared but is apparently never used.
This code can probably be written in a more efficient way.
}:function (){};var assigned ---> = <--- true;}if("function"!=typeof newCls

[WARNING] [WARNING] The symbol found is declared but is apparently never used.
This code can probably be written in a more efficient way.
obj,finalAttr,value);}var found ---> = <--- false;var prefix=(value)?

[WARNING] [WARNING] The symbol _tokenPos is declared but is apparently never used.
This code can probably be written in a more efficient way.
=-1,_contentEnd=-1,_tokenPos ---> = <--- 0,_tokenForward=1,tagNameStart=(

[WARNING] [WARNING] The symbol _tokenForward is declared but is apparently never used.
This code can probably be written in a more efficient way.
_contentEnd=-1,_tokenPos=0,_tokenForward ---> = <--- 1,tagNameStart=(!tagNameStart)?

[WARNING] [WARNING] The symbol _RT is declared but is apparently never used.
This code can probably be written in a more efficient way.
{var _Lang=this._Lang;var _RT ---> = <--- this._RT;var _Dom=this.

[WARNING] [WARNING] The symbol _Dom is declared but is apparently never used.
This code can probably be written in a more efficient way.
;var _RT=this._RT;var _Dom ---> = <--- this._Dom;try{var scopeThis=

[WARNING] [WARNING] The symbol _AJAXUTIL is declared but is apparently never used.
This code can probably be written in a more efficient way.
},getFormData:function (){var _AJAXUTIL ---> = <--- this._AJAXUTIL,myfacesOptions=this._context

[WARNING] [WARNING] The symbol myfacesOptions is declared but is apparently never used.
This code can probably be written in a more efficient way.
){var _AJAXUTIL=this._AJAXUTIL,myfacesOptions ---> = <--- this._context.myfaces;return this.

[WARNING] [WARNING] The symbol _Lang is declared but is apparently never used.
This code can probably be written in a more efficient way.
,fixViewStates:function (context){var _Lang ---> = <--- this._Lang;var mfInternal=context.

[WARNING] [WARNING] The symbol _Lang is declared but is apparently never used.
This code can probably be written in a more efficient way.
:function (context,theForm){var _Lang ---> = <--- this._Lang;var mfInternal=context.

[WARNING] [WARNING] The symbol prefix is declared but is apparently never used.
This code can probably be written in a more efficient way.
(context,value,identifier){var prefix ---> = <--- this._getPrefix(context);var sourceForm

[WARNING] [WARNING] The symbol self is declared but is apparently never used.
This code can probably be written in a more efficient way.
};var clientIdsByTokens={};var self ---> = <--- {};function Socket(channelToken,url
[INFO] jsf-minimal.js (342,554 bytes) ............................. compressed at 73%
[INFO] Object.js (3,563 bytes) .................................... compressed at 67%
[INFO] _EndImpl.js (1,552 bytes) .................................. compressed at 84%
[INFO] _ExtRuntime.js (7,643 bytes) ............................... compressed at 78%
[INFO] _RuntimeQuirks.js (2,130 bytes) ............................ compressed at 78%
[INFO] _StartImpl.js (1,729 bytes) ................................ compressed at 75%
[INFO] Messages.js (5,777 bytes) .................................. compressed at 47%
[INFO] Messages_de.js (5,949 bytes) ............................... compressed at 44%
[INFO] Messages_es.js (5,488 bytes) ............................... compressed at 39%
[INFO] Messages_fr.js (5,613 bytes) ............................... compressed at 41%
[INFO] Messages_it.js (5,179 bytes) ............................... compressed at 39%
[INFO] Messages_nl.js (5,196 bytes) ............................... compressed at 40%
[INFO] Messages_ru.js (5,935 bytes) ............................... compressed at 34%
[INFO] Messages_zh_CN.js (5,758 bytes) ............................ compressed at 52%
[INFO] Messages_zh_HK.js (6,090 bytes) ............................ compressed at 55%
[INFO] Messages_zh_TW.js (6,499 bytes) ............................ compressed at 58%
[INFO] BaseRequest.js (4,813 bytes) ............................... compressed at 82%
[INFO] FormData.js (2,588 bytes) .................................. compressed at 71%
[INFO] IFrame.js (12,067 bytes) ................................... compressed at 70%
[INFO] Xhr1.js (6,589 bytes) ...................................... compressed at 60%
[INFO] XhrConst.js (1,469 bytes) .................................. compressed at 84%
[INFO] _ExtAjaxRequest.js (2,726 bytes) ........................... compressed at 77%
[INFO] _ExtTransport.js (8,327 bytes) ............................. compressed at 85%

[WARNING] [WARNING] Found an undeclared symbol: jsf
,"partial/ajax");var viewState=decodeURIComponent(jsf ---> . <--- getViewState(this._sourceForm));viewState

[WARNING] [WARNING] The symbol jsf is declared but is apparently never used.
This code can probably be written in a more efficient way.
,"partial/ajax");var viewState=decodeURIComponent(jsf ---> . <--- getViewState(this._sourceForm));viewState
[INFO] _IFrameRequest.js (2,974 bytes) ............................ compressed at 74%
[INFO] _PartialSubmitUtils.js (5,264 bytes) ....................... compressed at 77%
[INFO] _DomExperimental.js (1,629 bytes) .......................... compressed at 75%
[INFO] _DomQuirks.js (25,781 bytes) ............................... compressed at 76%
[INFO] _ExtDom.js (13,061 bytes) .................................. compressed at 74%
[INFO] _ExtLang.js (4,363 bytes) .................................. compressed at 74%
[INFO] _LangQuirks.js (8,389 bytes) ............................... compressed at 77%
[INFO] _Logging.js (4,749 bytes) .................................. compressed at 66%
[INFO] ------------------------------------------------------------------------------
[INFO] compression saved 3,168 bytes
[INFO] 
[INFO] --- maven-compiler-plugin:3.6.1:compile (default-compile) @ myfaces-api ---
[INFO] Nothing to compile - all classes are up to date
[INFO] 
[INFO] --- maven-bundle-plugin:3.0.1:manifest (bundle-manifest) @ myfaces-api ---
[INFO] 
[INFO] --- maven-resources-plugin:2.5:testResources (default-testResources) @ myfaces-api ---
[debug] execute contextualize
[INFO] Using 'UTF-8' encoding to copy filtered resources.
[INFO] skip non existing resourceDirectory F:\jenkins\jenkins-slave\workspace\myfaces-current23\api\src\test\resources
[INFO] Copying 3 resources
[INFO] Copying 3 resources
[INFO] 
[INFO] --- maven-compiler-plugin:3.6.1:testCompile (default-testCompile) @ myfaces-api ---
[INFO] No sources to compile
[INFO] 
[INFO] --- maven-surefire-plugin:2.22.1:test (default-test) @ myfaces-api ---
[INFO] Skipping execution of surefire because it has already been run for this configuration
[JENKINS] Recording test results
[INFO] 
[INFO] --- maven-surefire-plugin:2.22.1:test (default) @ myfaces-api ---
[INFO] Skipping execution of surefire because it has already been run for this configuration
[JENKINS] Recording test results
[INFO] 
[INFO] --- maven-jar-plugin:2.2:jar (default-jar) @ myfaces-api ---
[INFO] Building jar: F:\jenkins\jenkins-slave\workspace\myfaces-current23\api\target\myfaces-api-3.0.0-SNAPSHOT.jar
[INFO] 
[INFO] >>> maven-source-plugin:2.2.1:jar (attach-source) > generate-sources @ myfaces-api >>>
[INFO] 
[INFO] --- maven-enforcer-plugin:1.4.1:enforce (enforce-maven-version) @ myfaces-api ---
[INFO] 
[INFO] --- build-helper-maven-plugin:1.9.1:parse-version (parse-version) @ myfaces-api ---
[INFO] 
[INFO] --- myfaces-builder-plugin:1.0.10:build-metadata (default) @ myfaces-api ---
[INFO] model is up to date
[INFO] 
[INFO] --- myfaces-builder-plugin:1.0.10:make-components (makecomp) @ myfaces-api ---
[INFO] generated component files are up to date
[WARNING] Failed to getClass for org.apache.maven.plugin.source.SourceJarMojo
[INFO] 
[INFO] <<< maven-source-plugin:2.2.1:jar (attach-source) < generate-sources @ myfaces-api <<<
[INFO] 
[INFO] 
[INFO] --- maven-source-plugin:2.2.1:jar (attach-source) @ myfaces-api ---
[INFO] Building jar: F:\jenkins\jenkins-slave\workspace\myfaces-current23\api\target\myfaces-api-3.0.0-SNAPSHOT-sources.jar
[INFO] 
[INFO] --- maven-site-plugin:3.3:attach-descriptor (attach-descriptor) @ myfaces-api ---
[INFO] 
[INFO] --- maven-jar-plugin:2.2:test-jar (default) @ myfaces-api ---
[INFO] Building jar: F:\jenkins\jenkins-slave\workspace\myfaces-current23\api\target\myfaces-api-3.0.0-SNAPSHOT-tests.jar
[INFO] 
[INFO] --- maven-checkstyle-plugin:2.17:check (verify-style) @ myfaces-api ---
[INFO] Starting audit...
Audit done.
[INFO] 
[INFO] --- maven-install-plugin:2.5.2:install (default-install) @ myfaces-api ---
[INFO] Installing F:\jenkins\jenkins-slave\workspace\myfaces-current23\api\target\myfaces-api-3.0.0-SNAPSHOT.jar to f:\jenkins\jenkins-slave\maven-repositories\1\org\apache\myfaces\core\myfaces-api\3.0.0-SNAPSHOT\myfaces-api-3.0.0-SNAPSHOT.jar
[INFO] Installing F:\jenkins\jenkins-slave\workspace\myfaces-current23\api\pom.xml to f:\jenkins\jenkins-slave\maven-repositories\1\org\apache\myfaces\core\myfaces-api\3.0.0-SNAPSHOT\myfaces-api-3.0.0-SNAPSHOT.pom
[INFO] Installing F:\jenkins\jenkins-slave\workspace\myfaces-current23\api\target\myfaces-api-3.0.0-SNAPSHOT-sources.jar to f:\jenkins\jenkins-slave\maven-repositories\1\org\apache\myfaces\core\myfaces-api\3.0.0-SNAPSHOT\myfaces-api-3.0.0-SNAPSHOT-sources.jar
[INFO] Installing F:\jenkins\jenkins-slave\workspace\myfaces-current23\api\target\myfaces-api-3.0.0-SNAPSHOT-tests.jar to f:\jenkins\jenkins-slave\maven-repositories\1\org\apache\myfaces\core\myfaces-api\3.0.0-SNAPSHOT\myfaces-api-3.0.0-SNAPSHOT-tests.jar
[INFO] Installing F:\jenkins\jenkins-slave\workspace\myfaces-current23\api\target\myfaces-api-3.0.0-SNAPSHOT-sources.jar to f:\jenkins\jenkins-slave\maven-repositories\1\org\apache\myfaces\core\myfaces-api\3.0.0-SNAPSHOT\myfaces-api-3.0.0-SNAPSHOT-sources.jar
[INFO] Installing F:\jenkins\jenkins-slave\workspace\myfaces-current23\api\target\myfaces-api-3.0.0-SNAPSHOT-tests.jar to f:\jenkins\jenkins-slave\maven-repositories\1\org\apache\myfaces\core\myfaces-api\3.0.0-SNAPSHOT\myfaces-api-3.0.0-SNAPSHOT-tests.jar
[INFO] 
[INFO] --- maven-deploy-plugin:2.8.2:deploy (default-deploy) @ myfaces-api ---
[INFO] Downloading from apache.snapshots.https: https://repository.apache.org/content/repositories/snapshots/org/apache/myfaces/core/myfaces-api/3.0.0-SNAPSHOT/maven-metadata.xml
[INFO] Downloaded from apache.snapshots.https: https://repository.apache.org/content/repositories/snapshots/org/apache/myfaces/core/myfaces-api/3.0.0-SNAPSHOT/maven-metadata.xml (1.2 kB at 1.9 kB/s)
[INFO] Uploading to apache.snapshots.https: https://repository.apache.org/content/repositories/snapshots/org/apache/myfaces/core/myfaces-api/3.0.0-SNAPSHOT/myfaces-api-3.0.0-20181020.231936-19.jar
[INFO] Uploaded to apache.snapshots.https: https://repository.apache.org/content/repositories/snapshots/org/apache/myfaces/core/myfaces-api/3.0.0-SNAPSHOT/myfaces-api-3.0.0-20181020.231936-19.jar (1.3 MB at 642 kB/s)
[INFO] Uploading to apache.snapshots.https: https://repository.apache.org/content/repositories/snapshots/org/apache/myfaces/core/myfaces-api/3.0.0-SNAPSHOT/myfaces-api-3.0.0-20181020.231936-19.pom
[INFO] Uploaded to apache.snapshots.https: https://repository.apache.org/content/repositories/snapshots/org/apache/myfaces/core/myfaces-api/3.0.0-SNAPSHOT/myfaces-api-3.0.0-20181020.231936-19.pom (34 kB at 27 kB/s)
[INFO] Downloading from apache.snapshots.https: https://repository.apache.org/content/repositories/snapshots/org/apache/myfaces/core/myfaces-api/maven-metadata.xml
[INFO] Downloaded from apache.snapshots.https: https://repository.apache.org/content/repositories/snapshots/org/apache/myfaces/core/myfaces-api/maven-metadata.xml (653 B at 1.1 kB/s)
[INFO] Uploading to apache.snapshots.https: https://repository.apache.org/content/repositories/snapshots/org/apache/myfaces/core/myfaces-api/3.0.0-SNAPSHOT/maven-metadata.xml
[INFO] Uploaded to apache.snapshots.https: https://repository.apache.org/content/repositories/snapshots/org/apache/myfaces/core/myfaces-api/3.0.0-SNAPSHOT/maven-metadata.xml (1.2 kB at 1.1 kB/s)
[INFO] Uploading to apache.snapshots.https: https://repository.apache.org/content/repositories/snapshots/org/apache/myfaces/core/myfaces-api/maven-metadata.xml
[INFO] Uploaded to apache.snapshots.https: https://repository.apache.org/content/repositories/snapshots/org/apache/myfaces/core/myfaces-api/maven-metadata.xml (653 B at 594 B/s)
[INFO] Uploading to apache.snapshots.https: https://repository.apache.org/content/repositories/snapshots/org/apache/myfaces/core/myfaces-api/3.0.0-SNAPSHOT/myfaces-api-3.0.0-20181020.231936-19-sources.jar
[INFO] Uploaded to apache.snapshots.https: https://repository.apache.org/content/repositories/snapshots/org/apache/myfaces/core/myfaces-api/3.0.0-SNAPSHOT/myfaces-api-3.0.0-20181020.231936-19-sources.jar (972 kB at 520 kB/s)
[INFO] Uploading to apache.snapshots.https: https://repository.apache.org/content/repositories/snapshots/org/apache/myfaces/core/myfaces-api/3.0.0-SNAPSHOT/maven-metadata.xml
[INFO] Uploaded to apache.snapshots.https: https://repository.apache.org/content/repositories/snapshots/org/apache/myfaces/core/myfaces-api/3.0.0-SNAPSHOT/maven-metadata.xml (1.2 kB at 1.1 kB/s)
[INFO] Uploading to apache.snapshots.https: https://repository.apache.org/content/repositories/snapshots/org/apache/myfaces/core/myfaces-api/3.0.0-SNAPSHOT/myfaces-api-3.0.0-20181020.231936-19-tests.jar
[INFO] Uploaded to apache.snapshots.https: https://repository.apache.org/content/repositories/snapshots/org/apache/myfaces/core/myfaces-api/3.0.0-SNAPSHOT/myfaces-api-3.0.0-20181020.231936-19-tests.jar (12 kB at 10 kB/s)
[INFO] Uploading to apache.snapshots.https: https://repository.apache.org/content/repositories/snapshots/org/apache/myfaces/core/myfaces-api/3.0.0-SNAPSHOT/maven-metadata.xml
[INFO] Uploaded to apache.snapshots.https: https://repository.apache.org/content/repositories/snapshots/org/apache/myfaces/core/myfaces-api/3.0.0-SNAPSHOT/maven-metadata.xml (1.2 kB at 1.0 kB/s)
[INFO] Uploading to apache.snapshots.https: https://repository.apache.org/content/repositories/snapshots/org/apache/myfaces/core/myfaces-api/3.0.0-SNAPSHOT/myfaces-api-3.0.0-20181020.231936-19-sources.jar
[INFO] Uploaded to apache.snapshots.https: https://repository.apache.org/content/repositories/snapshots/org/apache/myfaces/core/myfaces-api/3.0.0-SNAPSHOT/myfaces-api-3.0.0-20181020.231936-19-sources.jar (972 kB at 541 kB/s)
[INFO] Uploading to apache.snapshots.https: https://repository.apache.org/content/repositories/snapshots/org/apache/myfaces/core/myfaces-api/3.0.0-SNAPSHOT/maven-metadata.xml
[INFO] Uploaded to apache.snapshots.https: https://repository.apache.org/content/repositories/snapshots/org/apache/myfaces/core/myfaces-api/3.0.0-SNAPSHOT/maven-metadata.xml (1.2 kB at 1.1 kB/s)
[INFO] Uploading to apache.snapshots.https: https://repository.apache.org/content/repositories/snapshots/org/apache/myfaces/core/myfaces-api/3.0.0-SNAPSHOT/myfaces-api-3.0.0-20181020.231936-19-tests.jar
[INFO] Uploaded to apache.snapshots.https: https://repository.apache.org/content/repositories/snapshots/org/apache/myfaces/core/myfaces-api/3.0.0-SNAPSHOT/myfaces-api-3.0.0-20181020.231936-19-tests.jar (12 kB at 11 kB/s)
[INFO] Uploading to apache.snapshots.https: https://repository.apache.org/content/repositories/snapshots/org/apache/myfaces/core/myfaces-api/3.0.0-SNAPSHOT/maven-metadata.xml
[INFO] Uploaded to apache.snapshots.https: https://repository.apache.org/content/repositories/snapshots/org/apache/myfaces/core/myfaces-api/3.0.0-SNAPSHOT/maven-metadata.xml (1.2 kB at 1.1 kB/s)
[INFO] 
[INFO] ------------------------------------------------------------------------
[INFO] Building Apache MyFaces Core 3.0 - Impl 3.0.0-SNAPSHOT
[INFO] ------------------------------------------------------------------------
[WARNING] The POM for org.apache.myfaces.test:myfaces-test30:jar:1.0.9-SNAPSHOT is missing, no dependency information available
[INFO] ------------------------------------------------------------------------
[INFO] Reactor Summary:
[INFO] 
[INFO] Apache MyFaces Core 3.0 - Parent ................... SUCCESS [ 18.340 s]
[INFO] Apache MyFaces Core 3.0 - API ...................... SUCCESS [01:07 min]
[INFO] Apache MyFaces Core 3.0 - Impl ..................... FAILURE [  0.277 s]
[INFO] Apache MyFaces Core 3.0 - OSGi Bundle .............. SKIPPED
[INFO] Apache MyFaces Core 3.0 ............................ SKIPPED
[INFO] ------------------------------------------------------------------------
[INFO] BUILD FAILURE
[INFO] ------------------------------------------------------------------------
[INFO] Total time: 01:35 min
[INFO] Finished at: 2018-10-20T16:19:58-07:00
[INFO] Final Memory: 74M/685M
[INFO] ------------------------------------------------------------------------
[ERROR] Failed to execute goal on project myfaces-impl: Could not resolve dependencies for project org.apache.myfaces.core:myfaces-impl:jar:3.0.0-SNAPSHOT: Failure to find org.apache.myfaces.test:myfaces-test30:jar:1.0.9-SNAPSHOT in http://repository.apache.org/snapshots/ was cached in the local repository, resolution will not be reattempted until the update interval of apache-snapshots has elapsed or updates are forced -> [Help 1]
[ERROR] 
[ERROR] To see the full stack trace of the errors, re-run Maven with the -e switch.
[ERROR] Re-run Maven using the -X switch to enable full debug logging.
[ERROR] 
[ERROR] For more information about the errors and possible solutions, please read the following articles:
[ERROR] [Help 1] http://cwiki.apache.org/confluence/display/MAVEN/DependencyResolutionException
[ERROR] 
[ERROR] After correcting the problems, you can resume the build with the command
[ERROR]   mvn <goals> -rf :myfaces-impl
[JENKINS] Archiving F:\jenkins\jenkins-slave\workspace\myfaces-current23\api\pom.xml to org.apache.myfaces.core/myfaces-api/3.0.0-SNAPSHOT/myfaces-api-3.0.0-SNAPSHOT.pom
[JENKINS] Archiving F:\jenkins\jenkins-slave\workspace\myfaces-current23\api\target\myfaces-api-3.0.0-SNAPSHOT.jar to org.apache.myfaces.core/myfaces-api/3.0.0-20181020.231936-19/myfaces-api-3.0.0-20181020.231936-19.jar
[JENKINS] Archiving F:\jenkins\jenkins-slave\workspace\myfaces-current23\api\target\myfaces-api-3.0.0-SNAPSHOT-sources.jar to org.apache.myfaces.core/myfaces-api/3.0.0-20181020.231936-19/myfaces-api-3.0.0-20181020.231936-19-sources.jar
[JENKINS] Archiving F:\jenkins\jenkins-slave\workspace\myfaces-current23\api\target\myfaces-api-3.0.0-SNAPSHOT-tests.jar to org.apache.myfaces.core/myfaces-api/3.0.0-20181020.231936-19/myfaces-api-3.0.0-20181020.231936-19-tests.jar
[Fast Archiver] Compressed 2.22 MB of artifacts by 29.5% relative to #359
[JENKINS] Archiving F:\jenkins\jenkins-slave\workspace\myfaces-current23\impl\pom.xml to org.apache.myfaces.core/myfaces-impl/3.0.0-SNAPSHOT/myfaces-impl-3.0.0-SNAPSHOT.pom
[JENKINS] Archiving F:\jenkins\jenkins-slave\workspace\myfaces-current23\bundle\pom.xml to org.apache.myfaces.core/myfaces-bundle/3.0.0-SNAPSHOT/myfaces-bundle-3.0.0-SNAPSHOT.pom
[JENKINS] Archiving <https://builds.apache.org/job/myfaces-current23/ws/pom.xml> to org.apache.myfaces.core/myfaces-core-module/3.0.0-SNAPSHOT/myfaces-core-module-3.0.0-SNAPSHOT.pom
[JENKINS] Archiving F:\jenkins\jenkins-slave\workspace\myfaces-current23\parent\pom.xml to org.apache.myfaces.core/myfaces-core-project/3.0.0-SNAPSHOT/myfaces-core-project-3.0.0-SNAPSHOT.pom
[JENKINS] Archiving F:\jenkins\jenkins-slave\workspace\myfaces-current23\parent\target\myfaces-core-project-3.0.0-SNAPSHOT-site.xml to org.apache.myfaces.core/myfaces-core-project/3.0.0-20181020.231834-24/myfaces-core-project-3.0.0-20181020.231834-24-site.xml
Sending e-mails to: commits@myfaces.apache.org grantsmith@apache.org tandraschko@apache.org
channel stopped
Java HotSpot(TM) 64-Bit Server VM warning: ignoring option MaxPermSize=256m; support was removed in 8.0

Build failed in Jenkins: myfaces-current23 #359

Posted by Apache Jenkins Server <je...@builds.apache.org>.
See <https://builds.apache.org/job/myfaces-current23/359/display/redirect?page=changes>

Changes:

[tandraschko] duplicate code / cast errors

[tandraschko] unused code

[tandraschko] unused code

------------------------------------------
[...truncated 121.21 KB...]
[INFO] Using 'eval' reduces the level of compression!
function (){var _r=window.eval ---> . <--- call(window,code);if(

[WARNING] [WARNING] Using 'eval' is not recommended...
[INFO] Using 'eval' reduces the level of compression!
_T[_e]||((_w.eval ---> && <--- (!_b.isBlackBerry||_b.isBlackBerry

[WARNING] [WARNING] Using 'eval' is not recommended...
[INFO] Using 'eval' reduces the level of compression!
_T[_e]||((_w.eval ---> ) <--- ?"_evalHeadAppendix":null);}if(

[WARNING] [WARNING] Using 'eval' is not recommended...
[INFO] Using 'eval' reduces the level of compression!
[_e]](c);}eval ---> . <--- call(window,c);return null

[WARNING] [WARNING] The variable _T has already been declared in the same scope...
,tv=parseFloat(dav);var _T ---> = <--- this;_T.browser={};

[WARNING] [WARNING] The variable tagNameStart has already been declared in the same scope...
,_tokenPos=0,_tokenForward=1,tagNameStart ---> = <--- (!tagNameStart)?BEGIN_TAG:tagNameStart;

[WARNING] [WARNING] The variable i has already been declared in the same scope...
&&params!=null){for(var i ---> = <--- 0,param;(param=params[

[WARNING] [WARNING] The variable param has already been declared in the same scope...
){for(var i=0,param ---> ; <--- (param=params[i]);

[WARNING] [WARNING] The symbol assigned is declared but is apparently never used.
This code can probably be written in a more efficient way.
}:function (){};var assigned ---> = <--- true;}if("function"!=typeof newCls

[WARNING] [WARNING] The symbol found is declared but is apparently never used.
This code can probably be written in a more efficient way.
obj,finalAttr,value);}var found ---> = <--- false;var prefix=(value)?

[WARNING] [WARNING] The symbol _tokenPos is declared but is apparently never used.
This code can probably be written in a more efficient way.
=-1,_contentEnd=-1,_tokenPos ---> = <--- 0,_tokenForward=1,tagNameStart=(

[WARNING] [WARNING] The symbol _tokenForward is declared but is apparently never used.
This code can probably be written in a more efficient way.
_contentEnd=-1,_tokenPos=0,_tokenForward ---> = <--- 1,tagNameStart=(!tagNameStart)?

[WARNING] [WARNING] The symbol _RT is declared but is apparently never used.
This code can probably be written in a more efficient way.
{var _Lang=this._Lang;var _RT ---> = <--- this._RT;var _Dom=this.

[WARNING] [WARNING] The symbol _Dom is declared but is apparently never used.
This code can probably be written in a more efficient way.
;var _RT=this._RT;var _Dom ---> = <--- this._Dom;try{var scopeThis=

[WARNING] [WARNING] The symbol _AJAXUTIL is declared but is apparently never used.
This code can probably be written in a more efficient way.
},getFormData:function (){var _AJAXUTIL ---> = <--- this._AJAXUTIL,myfacesOptions=this._context

[WARNING] [WARNING] The symbol myfacesOptions is declared but is apparently never used.
This code can probably be written in a more efficient way.
){var _AJAXUTIL=this._AJAXUTIL,myfacesOptions ---> = <--- this._context.myfaces;return this.

[WARNING] [WARNING] The symbol _Lang is declared but is apparently never used.
This code can probably be written in a more efficient way.
,fixViewStates:function (context){var _Lang ---> = <--- this._Lang;var mfInternal=context.

[WARNING] [WARNING] The symbol _Lang is declared but is apparently never used.
This code can probably be written in a more efficient way.
:function (context,theForm){var _Lang ---> = <--- this._Lang;var mfInternal=context.

[WARNING] [WARNING] The symbol prefix is declared but is apparently never used.
This code can probably be written in a more efficient way.
(context,value,identifier){var prefix ---> = <--- this._getPrefix(context);var sourceForm

[WARNING] [WARNING] The symbol self is declared but is apparently never used.
This code can probably be written in a more efficient way.
};var clientIdsByTokens={};var self ---> = <--- {};function Socket(channelToken,url
[INFO] jsf-minimal.js (342,554 bytes) ............................. compressed at 73%
[INFO] Object.js (3,563 bytes) .................................... compressed at 67%
[INFO] _EndImpl.js (1,552 bytes) .................................. compressed at 84%
[INFO] _ExtRuntime.js (7,643 bytes) ............................... compressed at 78%
[INFO] _RuntimeQuirks.js (2,130 bytes) ............................ compressed at 78%
[INFO] _StartImpl.js (1,729 bytes) ................................ compressed at 75%
[INFO] Messages.js (5,777 bytes) .................................. compressed at 47%
[INFO] Messages_de.js (5,949 bytes) ............................... compressed at 44%
[INFO] Messages_es.js (5,488 bytes) ............................... compressed at 39%
[INFO] Messages_fr.js (5,613 bytes) ............................... compressed at 41%
[INFO] Messages_it.js (5,179 bytes) ............................... compressed at 39%
[INFO] Messages_nl.js (5,196 bytes) ............................... compressed at 40%
[INFO] Messages_ru.js (5,935 bytes) ............................... compressed at 34%
[INFO] Messages_zh_CN.js (5,758 bytes) ............................ compressed at 52%
[INFO] Messages_zh_HK.js (6,090 bytes) ............................ compressed at 55%
[INFO] Messages_zh_TW.js (6,499 bytes) ............................ compressed at 58%
[INFO] BaseRequest.js (4,813 bytes) ............................... compressed at 82%
[INFO] FormData.js (2,588 bytes) .................................. compressed at 71%
[INFO] IFrame.js (12,067 bytes) ................................... compressed at 70%
[INFO] Xhr1.js (6,589 bytes) ...................................... compressed at 60%
[INFO] XhrConst.js (1,469 bytes) .................................. compressed at 84%
[INFO] _ExtAjaxRequest.js (2,726 bytes) ........................... compressed at 77%
[INFO] _ExtTransport.js (8,327 bytes) ............................. compressed at 85%

[WARNING] [WARNING] Found an undeclared symbol: jsf
,"partial/ajax");var viewState=decodeURIComponent(jsf ---> . <--- getViewState(this._sourceForm));viewState

[WARNING] [WARNING] The symbol jsf is declared but is apparently never used.
This code can probably be written in a more efficient way.
,"partial/ajax");var viewState=decodeURIComponent(jsf ---> . <--- getViewState(this._sourceForm));viewState
[INFO] _IFrameRequest.js (2,974 bytes) ............................ compressed at 74%
[INFO] _PartialSubmitUtils.js (5,264 bytes) ....................... compressed at 77%
[INFO] _DomExperimental.js (1,629 bytes) .......................... compressed at 75%
[INFO] _DomQuirks.js (25,781 bytes) ............................... compressed at 76%
[INFO] _ExtDom.js (13,061 bytes) .................................. compressed at 74%
[INFO] _ExtLang.js (4,363 bytes) .................................. compressed at 74%
[INFO] _LangQuirks.js (8,389 bytes) ............................... compressed at 77%
[INFO] _Logging.js (4,749 bytes) .................................. compressed at 66%
[INFO] ------------------------------------------------------------------------------
[INFO] compression saved 3,168 bytes
[INFO] 
[INFO] --- maven-compiler-plugin:3.6.1:compile (default-compile) @ myfaces-api ---
[INFO] Nothing to compile - all classes are up to date
[INFO] 
[INFO] --- maven-bundle-plugin:3.0.1:manifest (bundle-manifest) @ myfaces-api ---
[INFO] 
[INFO] --- maven-resources-plugin:2.5:testResources (default-testResources) @ myfaces-api ---
[debug] execute contextualize
[INFO] Using 'UTF-8' encoding to copy filtered resources.
[INFO] skip non existing resourceDirectory F:\jenkins\jenkins-slave\workspace\myfaces-current23\api\src\test\resources
[INFO] Copying 3 resources
[INFO] Copying 3 resources
[INFO] 
[INFO] --- maven-compiler-plugin:3.6.1:testCompile (default-testCompile) @ myfaces-api ---
[INFO] No sources to compile
[INFO] 
[INFO] --- maven-surefire-plugin:2.22.1:test (default-test) @ myfaces-api ---
[INFO] Skipping execution of surefire because it has already been run for this configuration
[JENKINS] Recording test results
[INFO] 
[INFO] --- maven-surefire-plugin:2.22.1:test (default) @ myfaces-api ---
[INFO] Skipping execution of surefire because it has already been run for this configuration
[JENKINS] Recording test results
[INFO] 
[INFO] --- maven-jar-plugin:2.2:jar (default-jar) @ myfaces-api ---
[INFO] Building jar: F:\jenkins\jenkins-slave\workspace\myfaces-current23\api\target\myfaces-api-3.0.0-SNAPSHOT.jar
[INFO] 
[INFO] >>> maven-source-plugin:2.2.1:jar (attach-source) > generate-sources @ myfaces-api >>>
[INFO] 
[INFO] --- maven-enforcer-plugin:1.4.1:enforce (enforce-maven-version) @ myfaces-api ---
[INFO] 
[INFO] --- build-helper-maven-plugin:1.9.1:parse-version (parse-version) @ myfaces-api ---
[INFO] 
[INFO] --- myfaces-builder-plugin:1.0.10:build-metadata (default) @ myfaces-api ---
[INFO] model is up to date
[INFO] 
[INFO] --- myfaces-builder-plugin:1.0.10:make-components (makecomp) @ myfaces-api ---
[INFO] generated component files are up to date
[WARNING] Failed to getClass for org.apache.maven.plugin.source.SourceJarMojo
[INFO] 
[INFO] <<< maven-source-plugin:2.2.1:jar (attach-source) < generate-sources @ myfaces-api <<<
[INFO] 
[INFO] 
[INFO] --- maven-source-plugin:2.2.1:jar (attach-source) @ myfaces-api ---
[INFO] Building jar: F:\jenkins\jenkins-slave\workspace\myfaces-current23\api\target\myfaces-api-3.0.0-SNAPSHOT-sources.jar
[INFO] 
[INFO] --- maven-site-plugin:3.3:attach-descriptor (attach-descriptor) @ myfaces-api ---
[INFO] 
[INFO] --- maven-jar-plugin:2.2:test-jar (default) @ myfaces-api ---
[INFO] Building jar: F:\jenkins\jenkins-slave\workspace\myfaces-current23\api\target\myfaces-api-3.0.0-SNAPSHOT-tests.jar
[INFO] 
[INFO] --- maven-checkstyle-plugin:2.17:check (verify-style) @ myfaces-api ---
[INFO] Starting audit...
Audit done.
[INFO] 
[INFO] --- maven-install-plugin:2.5.2:install (default-install) @ myfaces-api ---
[INFO] Installing F:\jenkins\jenkins-slave\workspace\myfaces-current23\api\target\myfaces-api-3.0.0-SNAPSHOT.jar to f:\jenkins\jenkins-slave\maven-repositories\1\org\apache\myfaces\core\myfaces-api\3.0.0-SNAPSHOT\myfaces-api-3.0.0-SNAPSHOT.jar
[INFO] Installing F:\jenkins\jenkins-slave\workspace\myfaces-current23\api\pom.xml to f:\jenkins\jenkins-slave\maven-repositories\1\org\apache\myfaces\core\myfaces-api\3.0.0-SNAPSHOT\myfaces-api-3.0.0-SNAPSHOT.pom
[INFO] Installing F:\jenkins\jenkins-slave\workspace\myfaces-current23\api\target\myfaces-api-3.0.0-SNAPSHOT-sources.jar to f:\jenkins\jenkins-slave\maven-repositories\1\org\apache\myfaces\core\myfaces-api\3.0.0-SNAPSHOT\myfaces-api-3.0.0-SNAPSHOT-sources.jar
[INFO] Installing F:\jenkins\jenkins-slave\workspace\myfaces-current23\api\target\myfaces-api-3.0.0-SNAPSHOT-tests.jar to f:\jenkins\jenkins-slave\maven-repositories\1\org\apache\myfaces\core\myfaces-api\3.0.0-SNAPSHOT\myfaces-api-3.0.0-SNAPSHOT-tests.jar
[INFO] Installing F:\jenkins\jenkins-slave\workspace\myfaces-current23\api\target\myfaces-api-3.0.0-SNAPSHOT-sources.jar to f:\jenkins\jenkins-slave\maven-repositories\1\org\apache\myfaces\core\myfaces-api\3.0.0-SNAPSHOT\myfaces-api-3.0.0-SNAPSHOT-sources.jar
[INFO] Installing F:\jenkins\jenkins-slave\workspace\myfaces-current23\api\target\myfaces-api-3.0.0-SNAPSHOT-tests.jar to f:\jenkins\jenkins-slave\maven-repositories\1\org\apache\myfaces\core\myfaces-api\3.0.0-SNAPSHOT\myfaces-api-3.0.0-SNAPSHOT-tests.jar
[INFO] 
[INFO] --- maven-deploy-plugin:2.8.2:deploy (default-deploy) @ myfaces-api ---
[INFO] Downloading from apache.snapshots.https: https://repository.apache.org/content/repositories/snapshots/org/apache/myfaces/core/myfaces-api/3.0.0-SNAPSHOT/maven-metadata.xml
[INFO] Downloaded from apache.snapshots.https: https://repository.apache.org/content/repositories/snapshots/org/apache/myfaces/core/myfaces-api/3.0.0-SNAPSHOT/maven-metadata.xml (1.2 kB at 2.0 kB/s)
[INFO] Uploading to apache.snapshots.https: https://repository.apache.org/content/repositories/snapshots/org/apache/myfaces/core/myfaces-api/3.0.0-SNAPSHOT/myfaces-api-3.0.0-20181020.230848-18.jar
[INFO] Uploaded to apache.snapshots.https: https://repository.apache.org/content/repositories/snapshots/org/apache/myfaces/core/myfaces-api/3.0.0-SNAPSHOT/myfaces-api-3.0.0-20181020.230848-18.jar (1.3 MB at 765 kB/s)
[INFO] Uploading to apache.snapshots.https: https://repository.apache.org/content/repositories/snapshots/org/apache/myfaces/core/myfaces-api/3.0.0-SNAPSHOT/myfaces-api-3.0.0-20181020.230848-18.pom
[INFO] Uploaded to apache.snapshots.https: https://repository.apache.org/content/repositories/snapshots/org/apache/myfaces/core/myfaces-api/3.0.0-SNAPSHOT/myfaces-api-3.0.0-20181020.230848-18.pom (34 kB at 28 kB/s)
[INFO] Downloading from apache.snapshots.https: https://repository.apache.org/content/repositories/snapshots/org/apache/myfaces/core/myfaces-api/maven-metadata.xml
[INFO] Downloaded from apache.snapshots.https: https://repository.apache.org/content/repositories/snapshots/org/apache/myfaces/core/myfaces-api/maven-metadata.xml (653 B at 1.1 kB/s)
[INFO] Uploading to apache.snapshots.https: https://repository.apache.org/content/repositories/snapshots/org/apache/myfaces/core/myfaces-api/3.0.0-SNAPSHOT/maven-metadata.xml
[INFO] Uploaded to apache.snapshots.https: https://repository.apache.org/content/repositories/snapshots/org/apache/myfaces/core/myfaces-api/3.0.0-SNAPSHOT/maven-metadata.xml (1.2 kB at 1.0 kB/s)
[INFO] Uploading to apache.snapshots.https: https://repository.apache.org/content/repositories/snapshots/org/apache/myfaces/core/myfaces-api/maven-metadata.xml
[INFO] Uploaded to apache.snapshots.https: https://repository.apache.org/content/repositories/snapshots/org/apache/myfaces/core/myfaces-api/maven-metadata.xml (653 B at 597 B/s)
[INFO] Uploading to apache.snapshots.https: https://repository.apache.org/content/repositories/snapshots/org/apache/myfaces/core/myfaces-api/3.0.0-SNAPSHOT/myfaces-api-3.0.0-20181020.230848-18-sources.jar
[INFO] Uploaded to apache.snapshots.https: https://repository.apache.org/content/repositories/snapshots/org/apache/myfaces/core/myfaces-api/3.0.0-SNAPSHOT/myfaces-api-3.0.0-20181020.230848-18-sources.jar (972 kB at 545 kB/s)
[INFO] Uploading to apache.snapshots.https: https://repository.apache.org/content/repositories/snapshots/org/apache/myfaces/core/myfaces-api/3.0.0-SNAPSHOT/maven-metadata.xml
[INFO] Uploaded to apache.snapshots.https: https://repository.apache.org/content/repositories/snapshots/org/apache/myfaces/core/myfaces-api/3.0.0-SNAPSHOT/maven-metadata.xml (1.2 kB at 1.0 kB/s)
[INFO] Uploading to apache.snapshots.https: https://repository.apache.org/content/repositories/snapshots/org/apache/myfaces/core/myfaces-api/3.0.0-SNAPSHOT/myfaces-api-3.0.0-20181020.230848-18-tests.jar
[INFO] Uploaded to apache.snapshots.https: https://repository.apache.org/content/repositories/snapshots/org/apache/myfaces/core/myfaces-api/3.0.0-SNAPSHOT/myfaces-api-3.0.0-20181020.230848-18-tests.jar (12 kB at 10 kB/s)
[INFO] Uploading to apache.snapshots.https: https://repository.apache.org/content/repositories/snapshots/org/apache/myfaces/core/myfaces-api/3.0.0-SNAPSHOT/maven-metadata.xml
[INFO] Uploaded to apache.snapshots.https: https://repository.apache.org/content/repositories/snapshots/org/apache/myfaces/core/myfaces-api/3.0.0-SNAPSHOT/maven-metadata.xml (1.2 kB at 1.1 kB/s)
[INFO] Uploading to apache.snapshots.https: https://repository.apache.org/content/repositories/snapshots/org/apache/myfaces/core/myfaces-api/3.0.0-SNAPSHOT/myfaces-api-3.0.0-20181020.230848-18-sources.jar
[INFO] Uploaded to apache.snapshots.https: https://repository.apache.org/content/repositories/snapshots/org/apache/myfaces/core/myfaces-api/3.0.0-SNAPSHOT/myfaces-api-3.0.0-20181020.230848-18-sources.jar (972 kB at 565 kB/s)
[INFO] Uploading to apache.snapshots.https: https://repository.apache.org/content/repositories/snapshots/org/apache/myfaces/core/myfaces-api/3.0.0-SNAPSHOT/maven-metadata.xml
[INFO] Uploaded to apache.snapshots.https: https://repository.apache.org/content/repositories/snapshots/org/apache/myfaces/core/myfaces-api/3.0.0-SNAPSHOT/maven-metadata.xml (1.2 kB at 1.1 kB/s)
[INFO] Uploading to apache.snapshots.https: https://repository.apache.org/content/repositories/snapshots/org/apache/myfaces/core/myfaces-api/3.0.0-SNAPSHOT/myfaces-api-3.0.0-20181020.230848-18-tests.jar
[INFO] Uploaded to apache.snapshots.https: https://repository.apache.org/content/repositories/snapshots/org/apache/myfaces/core/myfaces-api/3.0.0-SNAPSHOT/myfaces-api-3.0.0-20181020.230848-18-tests.jar (12 kB at 11 kB/s)
[INFO] Uploading to apache.snapshots.https: https://repository.apache.org/content/repositories/snapshots/org/apache/myfaces/core/myfaces-api/3.0.0-SNAPSHOT/maven-metadata.xml
[INFO] Uploaded to apache.snapshots.https: https://repository.apache.org/content/repositories/snapshots/org/apache/myfaces/core/myfaces-api/3.0.0-SNAPSHOT/maven-metadata.xml (1.2 kB at 1.1 kB/s)
[INFO] 
[INFO] ------------------------------------------------------------------------
[INFO] Building Apache MyFaces Core 3.0 - Impl 3.0.0-SNAPSHOT
[INFO] ------------------------------------------------------------------------
[WARNING] The POM for org.apache.myfaces.test:myfaces-test30:jar:1.0.9-SNAPSHOT is missing, no dependency information available
[INFO] ------------------------------------------------------------------------
[INFO] Reactor Summary:
[INFO] 
[INFO] Apache MyFaces Core 3.0 - Parent ................... SUCCESS [ 17.536 s]
[INFO] Apache MyFaces Core 3.0 - API ...................... SUCCESS [01:06 min]
[INFO] Apache MyFaces Core 3.0 - Impl ..................... FAILURE [  0.283 s]
[INFO] Apache MyFaces Core 3.0 - OSGi Bundle .............. SKIPPED
[INFO] Apache MyFaces Core 3.0 ............................ SKIPPED
[INFO] ------------------------------------------------------------------------
[INFO] BUILD FAILURE
[INFO] ------------------------------------------------------------------------
[INFO] Total time: 01:33 min
[INFO] Finished at: 2018-10-20T16:09:09-07:00
[INFO] Final Memory: 74M/705M
[INFO] ------------------------------------------------------------------------
[ERROR] Failed to execute goal on project myfaces-impl: Could not resolve dependencies for project org.apache.myfaces.core:myfaces-impl:jar:3.0.0-SNAPSHOT: Failure to find org.apache.myfaces.test:myfaces-test30:jar:1.0.9-SNAPSHOT in http://repository.apache.org/snapshots/ was cached in the local repository, resolution will not be reattempted until the update interval of apache-snapshots has elapsed or updates are forced -> [Help 1]
[ERROR] 
[ERROR] To see the full stack trace of the errors, re-run Maven with the -e switch.
[ERROR] Re-run Maven using the -X switch to enable full debug logging.
[ERROR] 
[ERROR] For more information about the errors and possible solutions, please read the following articles:
[ERROR] [Help 1] http://cwiki.apache.org/confluence/display/MAVEN/DependencyResolutionException
[ERROR] 
[ERROR] After correcting the problems, you can resume the build with the command
[ERROR]   mvn <goals> -rf :myfaces-impl
[JENKINS] Archiving F:\jenkins\jenkins-slave\workspace\myfaces-current23\api\pom.xml to org.apache.myfaces.core/myfaces-api/3.0.0-SNAPSHOT/myfaces-api-3.0.0-SNAPSHOT.pom
[JENKINS] Archiving F:\jenkins\jenkins-slave\workspace\myfaces-current23\api\target\myfaces-api-3.0.0-SNAPSHOT.jar to org.apache.myfaces.core/myfaces-api/3.0.0-20181020.230848-18/myfaces-api-3.0.0-20181020.230848-18.jar
[JENKINS] Archiving F:\jenkins\jenkins-slave\workspace\myfaces-current23\api\target\myfaces-api-3.0.0-SNAPSHOT-sources.jar to org.apache.myfaces.core/myfaces-api/3.0.0-20181020.230848-18/myfaces-api-3.0.0-20181020.230848-18-sources.jar
[JENKINS] Archiving F:\jenkins\jenkins-slave\workspace\myfaces-current23\api\target\myfaces-api-3.0.0-SNAPSHOT-tests.jar to org.apache.myfaces.core/myfaces-api/3.0.0-20181020.230848-18/myfaces-api-3.0.0-20181020.230848-18-tests.jar
[Fast Archiver] Compressed 2.22 MB of artifacts by 29.5% relative to #358
[JENKINS] Archiving F:\jenkins\jenkins-slave\workspace\myfaces-current23\impl\pom.xml to org.apache.myfaces.core/myfaces-impl/3.0.0-SNAPSHOT/myfaces-impl-3.0.0-SNAPSHOT.pom
[JENKINS] Archiving F:\jenkins\jenkins-slave\workspace\myfaces-current23\bundle\pom.xml to org.apache.myfaces.core/myfaces-bundle/3.0.0-SNAPSHOT/myfaces-bundle-3.0.0-SNAPSHOT.pom
[JENKINS] Archiving <https://builds.apache.org/job/myfaces-current23/ws/pom.xml> to org.apache.myfaces.core/myfaces-core-module/3.0.0-SNAPSHOT/myfaces-core-module-3.0.0-SNAPSHOT.pom
[JENKINS] Archiving F:\jenkins\jenkins-slave\workspace\myfaces-current23\parent\pom.xml to org.apache.myfaces.core/myfaces-core-project/3.0.0-SNAPSHOT/myfaces-core-project-3.0.0-SNAPSHOT.pom
[JENKINS] Archiving F:\jenkins\jenkins-slave\workspace\myfaces-current23\parent\target\myfaces-core-project-3.0.0-SNAPSHOT-site.xml to org.apache.myfaces.core/myfaces-core-project/3.0.0-20181020.230746-23/myfaces-core-project-3.0.0-20181020.230746-23-site.xml
Sending e-mails to: commits@myfaces.apache.org grantsmith@apache.org tandraschko@apache.org
channel stopped
Java HotSpot(TM) 64-Bit Server VM warning: ignoring option MaxPermSize=256m; support was removed in 8.0

Build failed in Jenkins: myfaces-current23 #358

Posted by Apache Jenkins Server <je...@builds.apache.org>.
See <https://builds.apache.org/job/myfaces-current23/358/display/redirect?page=changes>

Changes:

[tandraschko] removed unused code

------------------------------------------
[...truncated 121.22 KB...]
[INFO] Using 'eval' reduces the level of compression!
function (){var _r=window.eval ---> . <--- call(window,code);if(

[WARNING] [WARNING] Using 'eval' is not recommended...
[INFO] Using 'eval' reduces the level of compression!
_T[_e]||((_w.eval ---> && <--- (!_b.isBlackBerry||_b.isBlackBerry

[WARNING] [WARNING] Using 'eval' is not recommended...
[INFO] Using 'eval' reduces the level of compression!
_T[_e]||((_w.eval ---> ) <--- ?"_evalHeadAppendix":null);}if(

[WARNING] [WARNING] Using 'eval' is not recommended...
[INFO] Using 'eval' reduces the level of compression!
[_e]](c);}eval ---> . <--- call(window,c);return null

[WARNING] [WARNING] The variable _T has already been declared in the same scope...
,tv=parseFloat(dav);var _T ---> = <--- this;_T.browser={};

[WARNING] [WARNING] The variable tagNameStart has already been declared in the same scope...
,_tokenPos=0,_tokenForward=1,tagNameStart ---> = <--- (!tagNameStart)?BEGIN_TAG:tagNameStart;

[WARNING] [WARNING] The variable i has already been declared in the same scope...
&&params!=null){for(var i ---> = <--- 0,param;(param=params[

[WARNING] [WARNING] The variable param has already been declared in the same scope...
){for(var i=0,param ---> ; <--- (param=params[i]);

[WARNING] [WARNING] The symbol assigned is declared but is apparently never used.
This code can probably be written in a more efficient way.
}:function (){};var assigned ---> = <--- true;}if("function"!=typeof newCls

[WARNING] [WARNING] The symbol found is declared but is apparently never used.
This code can probably be written in a more efficient way.
obj,finalAttr,value);}var found ---> = <--- false;var prefix=(value)?

[WARNING] [WARNING] The symbol _tokenPos is declared but is apparently never used.
This code can probably be written in a more efficient way.
=-1,_contentEnd=-1,_tokenPos ---> = <--- 0,_tokenForward=1,tagNameStart=(

[WARNING] [WARNING] The symbol _tokenForward is declared but is apparently never used.
This code can probably be written in a more efficient way.
_contentEnd=-1,_tokenPos=0,_tokenForward ---> = <--- 1,tagNameStart=(!tagNameStart)?

[WARNING] [WARNING] The symbol _RT is declared but is apparently never used.
This code can probably be written in a more efficient way.
{var _Lang=this._Lang;var _RT ---> = <--- this._RT;var _Dom=this.

[WARNING] [WARNING] The symbol _Dom is declared but is apparently never used.
This code can probably be written in a more efficient way.
;var _RT=this._RT;var _Dom ---> = <--- this._Dom;try{var scopeThis=

[WARNING] [WARNING] The symbol _AJAXUTIL is declared but is apparently never used.
This code can probably be written in a more efficient way.
},getFormData:function (){var _AJAXUTIL ---> = <--- this._AJAXUTIL,myfacesOptions=this._context

[WARNING] [WARNING] The symbol myfacesOptions is declared but is apparently never used.
This code can probably be written in a more efficient way.
){var _AJAXUTIL=this._AJAXUTIL,myfacesOptions ---> = <--- this._context.myfaces;return this.

[WARNING] [WARNING] The symbol _Lang is declared but is apparently never used.
This code can probably be written in a more efficient way.
,fixViewStates:function (context){var _Lang ---> = <--- this._Lang;var mfInternal=context.

[WARNING] [WARNING] The symbol _Lang is declared but is apparently never used.
This code can probably be written in a more efficient way.
:function (context,theForm){var _Lang ---> = <--- this._Lang;var mfInternal=context.

[WARNING] [WARNING] The symbol prefix is declared but is apparently never used.
This code can probably be written in a more efficient way.
(context,value,identifier){var prefix ---> = <--- this._getPrefix(context);var sourceForm

[WARNING] [WARNING] The symbol self is declared but is apparently never used.
This code can probably be written in a more efficient way.
};var clientIdsByTokens={};var self ---> = <--- {};function Socket(channelToken,url
[INFO] jsf-minimal.js (342,554 bytes) ............................. compressed at 73%
[INFO] Object.js (3,563 bytes) .................................... compressed at 67%
[INFO] _EndImpl.js (1,552 bytes) .................................. compressed at 84%
[INFO] _ExtRuntime.js (7,643 bytes) ............................... compressed at 78%
[INFO] _RuntimeQuirks.js (2,130 bytes) ............................ compressed at 78%
[INFO] _StartImpl.js (1,729 bytes) ................................ compressed at 75%
[INFO] Messages.js (5,777 bytes) .................................. compressed at 47%
[INFO] Messages_de.js (5,949 bytes) ............................... compressed at 44%
[INFO] Messages_es.js (5,488 bytes) ............................... compressed at 39%
[INFO] Messages_fr.js (5,613 bytes) ............................... compressed at 41%
[INFO] Messages_it.js (5,179 bytes) ............................... compressed at 39%
[INFO] Messages_nl.js (5,196 bytes) ............................... compressed at 40%
[INFO] Messages_ru.js (5,935 bytes) ............................... compressed at 34%
[INFO] Messages_zh_CN.js (5,758 bytes) ............................ compressed at 52%
[INFO] Messages_zh_HK.js (6,090 bytes) ............................ compressed at 55%
[INFO] Messages_zh_TW.js (6,499 bytes) ............................ compressed at 58%
[INFO] BaseRequest.js (4,813 bytes) ............................... compressed at 82%
[INFO] FormData.js (2,588 bytes) .................................. compressed at 71%
[INFO] IFrame.js (12,067 bytes) ................................... compressed at 70%
[INFO] Xhr1.js (6,589 bytes) ...................................... compressed at 60%
[INFO] XhrConst.js (1,469 bytes) .................................. compressed at 84%
[INFO] _ExtAjaxRequest.js (2,726 bytes) ........................... compressed at 77%
[INFO] _ExtTransport.js (8,327 bytes) ............................. compressed at 85%

[WARNING] [WARNING] Found an undeclared symbol: jsf
,"partial/ajax");var viewState=decodeURIComponent(jsf ---> . <--- getViewState(this._sourceForm));viewState

[WARNING] [WARNING] The symbol jsf is declared but is apparently never used.
This code can probably be written in a more efficient way.
,"partial/ajax");var viewState=decodeURIComponent(jsf ---> . <--- getViewState(this._sourceForm));viewState
[INFO] _IFrameRequest.js (2,974 bytes) ............................ compressed at 74%
[INFO] _PartialSubmitUtils.js (5,264 bytes) ....................... compressed at 77%
[INFO] _DomExperimental.js (1,629 bytes) .......................... compressed at 75%
[INFO] _DomQuirks.js (25,781 bytes) ............................... compressed at 76%
[INFO] _ExtDom.js (13,061 bytes) .................................. compressed at 74%
[INFO] _ExtLang.js (4,363 bytes) .................................. compressed at 74%
[INFO] _LangQuirks.js (8,389 bytes) ............................... compressed at 77%
[INFO] _Logging.js (4,749 bytes) .................................. compressed at 66%
[INFO] ------------------------------------------------------------------------------
[INFO] compression saved 3,168 bytes
[INFO] 
[INFO] --- maven-compiler-plugin:3.6.1:compile (default-compile) @ myfaces-api ---
[INFO] Nothing to compile - all classes are up to date
[INFO] 
[INFO] --- maven-bundle-plugin:3.0.1:manifest (bundle-manifest) @ myfaces-api ---
[INFO] 
[INFO] --- maven-resources-plugin:2.5:testResources (default-testResources) @ myfaces-api ---
[debug] execute contextualize
[INFO] Using 'UTF-8' encoding to copy filtered resources.
[INFO] skip non existing resourceDirectory F:\jenkins\jenkins-slave\workspace\myfaces-current23\api\src\test\resources
[INFO] Copying 3 resources
[INFO] Copying 3 resources
[INFO] 
[INFO] --- maven-compiler-plugin:3.6.1:testCompile (default-testCompile) @ myfaces-api ---
[INFO] No sources to compile
[INFO] 
[INFO] --- maven-surefire-plugin:2.22.1:test (default-test) @ myfaces-api ---
[INFO] Skipping execution of surefire because it has already been run for this configuration
[JENKINS] Recording test results
[INFO] 
[INFO] --- maven-surefire-plugin:2.22.1:test (default) @ myfaces-api ---
[INFO] Skipping execution of surefire because it has already been run for this configuration
[JENKINS] Recording test results
[INFO] 
[INFO] --- maven-jar-plugin:2.2:jar (default-jar) @ myfaces-api ---
[INFO] Building jar: F:\jenkins\jenkins-slave\workspace\myfaces-current23\api\target\myfaces-api-3.0.0-SNAPSHOT.jar
[INFO] 
[INFO] >>> maven-source-plugin:2.2.1:jar (attach-source) > generate-sources @ myfaces-api >>>
[INFO] 
[INFO] --- maven-enforcer-plugin:1.4.1:enforce (enforce-maven-version) @ myfaces-api ---
[INFO] 
[INFO] --- build-helper-maven-plugin:1.9.1:parse-version (parse-version) @ myfaces-api ---
[INFO] 
[INFO] --- myfaces-builder-plugin:1.0.10:build-metadata (default) @ myfaces-api ---
[INFO] model is up to date
[INFO] 
[INFO] --- myfaces-builder-plugin:1.0.10:make-components (makecomp) @ myfaces-api ---
[INFO] generated component files are up to date
[WARNING] Failed to getClass for org.apache.maven.plugin.source.SourceJarMojo
[INFO] 
[INFO] <<< maven-source-plugin:2.2.1:jar (attach-source) < generate-sources @ myfaces-api <<<
[INFO] 
[INFO] 
[INFO] --- maven-source-plugin:2.2.1:jar (attach-source) @ myfaces-api ---
[INFO] Building jar: F:\jenkins\jenkins-slave\workspace\myfaces-current23\api\target\myfaces-api-3.0.0-SNAPSHOT-sources.jar
[INFO] 
[INFO] --- maven-site-plugin:3.3:attach-descriptor (attach-descriptor) @ myfaces-api ---
[INFO] 
[INFO] --- maven-jar-plugin:2.2:test-jar (default) @ myfaces-api ---
[INFO] Building jar: F:\jenkins\jenkins-slave\workspace\myfaces-current23\api\target\myfaces-api-3.0.0-SNAPSHOT-tests.jar
[INFO] 
[INFO] --- maven-checkstyle-plugin:2.17:check (verify-style) @ myfaces-api ---
[INFO] Starting audit...
Audit done.
[INFO] 
[INFO] --- maven-install-plugin:2.5.2:install (default-install) @ myfaces-api ---
[INFO] Installing F:\jenkins\jenkins-slave\workspace\myfaces-current23\api\target\myfaces-api-3.0.0-SNAPSHOT.jar to f:\jenkins\jenkins-slave\maven-repositories\1\org\apache\myfaces\core\myfaces-api\3.0.0-SNAPSHOT\myfaces-api-3.0.0-SNAPSHOT.jar
[INFO] Installing F:\jenkins\jenkins-slave\workspace\myfaces-current23\api\pom.xml to f:\jenkins\jenkins-slave\maven-repositories\1\org\apache\myfaces\core\myfaces-api\3.0.0-SNAPSHOT\myfaces-api-3.0.0-SNAPSHOT.pom
[INFO] Installing F:\jenkins\jenkins-slave\workspace\myfaces-current23\api\target\myfaces-api-3.0.0-SNAPSHOT-sources.jar to f:\jenkins\jenkins-slave\maven-repositories\1\org\apache\myfaces\core\myfaces-api\3.0.0-SNAPSHOT\myfaces-api-3.0.0-SNAPSHOT-sources.jar
[INFO] Installing F:\jenkins\jenkins-slave\workspace\myfaces-current23\api\target\myfaces-api-3.0.0-SNAPSHOT-tests.jar to f:\jenkins\jenkins-slave\maven-repositories\1\org\apache\myfaces\core\myfaces-api\3.0.0-SNAPSHOT\myfaces-api-3.0.0-SNAPSHOT-tests.jar
[INFO] Installing F:\jenkins\jenkins-slave\workspace\myfaces-current23\api\target\myfaces-api-3.0.0-SNAPSHOT-sources.jar to f:\jenkins\jenkins-slave\maven-repositories\1\org\apache\myfaces\core\myfaces-api\3.0.0-SNAPSHOT\myfaces-api-3.0.0-SNAPSHOT-sources.jar
[INFO] Installing F:\jenkins\jenkins-slave\workspace\myfaces-current23\api\target\myfaces-api-3.0.0-SNAPSHOT-tests.jar to f:\jenkins\jenkins-slave\maven-repositories\1\org\apache\myfaces\core\myfaces-api\3.0.0-SNAPSHOT\myfaces-api-3.0.0-SNAPSHOT-tests.jar
[INFO] 
[INFO] --- maven-deploy-plugin:2.8.2:deploy (default-deploy) @ myfaces-api ---
[INFO] Downloading from apache.snapshots.https: https://repository.apache.org/content/repositories/snapshots/org/apache/myfaces/core/myfaces-api/3.0.0-SNAPSHOT/maven-metadata.xml
[INFO] Downloaded from apache.snapshots.https: https://repository.apache.org/content/repositories/snapshots/org/apache/myfaces/core/myfaces-api/3.0.0-SNAPSHOT/maven-metadata.xml (1.2 kB at 2.0 kB/s)
[INFO] Uploading to apache.snapshots.https: https://repository.apache.org/content/repositories/snapshots/org/apache/myfaces/core/myfaces-api/3.0.0-SNAPSHOT/myfaces-api-3.0.0-20181020.224350-17.jar
[INFO] Uploaded to apache.snapshots.https: https://repository.apache.org/content/repositories/snapshots/org/apache/myfaces/core/myfaces-api/3.0.0-SNAPSHOT/myfaces-api-3.0.0-20181020.224350-17.jar (1.3 MB at 740 kB/s)
[INFO] Uploading to apache.snapshots.https: https://repository.apache.org/content/repositories/snapshots/org/apache/myfaces/core/myfaces-api/3.0.0-SNAPSHOT/myfaces-api-3.0.0-20181020.224350-17.pom
[INFO] Uploaded to apache.snapshots.https: https://repository.apache.org/content/repositories/snapshots/org/apache/myfaces/core/myfaces-api/3.0.0-SNAPSHOT/myfaces-api-3.0.0-20181020.224350-17.pom (34 kB at 28 kB/s)
[INFO] Downloading from apache.snapshots.https: https://repository.apache.org/content/repositories/snapshots/org/apache/myfaces/core/myfaces-api/maven-metadata.xml
[INFO] Downloaded from apache.snapshots.https: https://repository.apache.org/content/repositories/snapshots/org/apache/myfaces/core/myfaces-api/maven-metadata.xml (653 B at 1.1 kB/s)
[INFO] Uploading to apache.snapshots.https: https://repository.apache.org/content/repositories/snapshots/org/apache/myfaces/core/myfaces-api/3.0.0-SNAPSHOT/maven-metadata.xml
[INFO] Uploaded to apache.snapshots.https: https://repository.apache.org/content/repositories/snapshots/org/apache/myfaces/core/myfaces-api/3.0.0-SNAPSHOT/maven-metadata.xml (1.2 kB at 1.1 kB/s)
[INFO] Uploading to apache.snapshots.https: https://repository.apache.org/content/repositories/snapshots/org/apache/myfaces/core/myfaces-api/maven-metadata.xml
[INFO] Uploaded to apache.snapshots.https: https://repository.apache.org/content/repositories/snapshots/org/apache/myfaces/core/myfaces-api/maven-metadata.xml (653 B at 549 B/s)
[INFO] Uploading to apache.snapshots.https: https://repository.apache.org/content/repositories/snapshots/org/apache/myfaces/core/myfaces-api/3.0.0-SNAPSHOT/myfaces-api-3.0.0-20181020.224350-17-sources.jar
[INFO] Uploaded to apache.snapshots.https: https://repository.apache.org/content/repositories/snapshots/org/apache/myfaces/core/myfaces-api/3.0.0-SNAPSHOT/myfaces-api-3.0.0-20181020.224350-17-sources.jar (972 kB at 546 kB/s)
[INFO] Uploading to apache.snapshots.https: https://repository.apache.org/content/repositories/snapshots/org/apache/myfaces/core/myfaces-api/3.0.0-SNAPSHOT/maven-metadata.xml
[INFO] Uploaded to apache.snapshots.https: https://repository.apache.org/content/repositories/snapshots/org/apache/myfaces/core/myfaces-api/3.0.0-SNAPSHOT/maven-metadata.xml (1.2 kB at 1.0 kB/s)
[INFO] Uploading to apache.snapshots.https: https://repository.apache.org/content/repositories/snapshots/org/apache/myfaces/core/myfaces-api/3.0.0-SNAPSHOT/myfaces-api-3.0.0-20181020.224350-17-tests.jar
[INFO] Uploaded to apache.snapshots.https: https://repository.apache.org/content/repositories/snapshots/org/apache/myfaces/core/myfaces-api/3.0.0-SNAPSHOT/myfaces-api-3.0.0-20181020.224350-17-tests.jar (12 kB at 10 kB/s)
[INFO] Uploading to apache.snapshots.https: https://repository.apache.org/content/repositories/snapshots/org/apache/myfaces/core/myfaces-api/3.0.0-SNAPSHOT/maven-metadata.xml
[INFO] Uploaded to apache.snapshots.https: https://repository.apache.org/content/repositories/snapshots/org/apache/myfaces/core/myfaces-api/3.0.0-SNAPSHOT/maven-metadata.xml (1.2 kB at 1.1 kB/s)
[INFO] Uploading to apache.snapshots.https: https://repository.apache.org/content/repositories/snapshots/org/apache/myfaces/core/myfaces-api/3.0.0-SNAPSHOT/myfaces-api-3.0.0-20181020.224350-17-sources.jar
[INFO] Uploaded to apache.snapshots.https: https://repository.apache.org/content/repositories/snapshots/org/apache/myfaces/core/myfaces-api/3.0.0-SNAPSHOT/myfaces-api-3.0.0-20181020.224350-17-sources.jar (972 kB at 555 kB/s)
[INFO] Uploading to apache.snapshots.https: https://repository.apache.org/content/repositories/snapshots/org/apache/myfaces/core/myfaces-api/3.0.0-SNAPSHOT/maven-metadata.xml
[INFO] Uploaded to apache.snapshots.https: https://repository.apache.org/content/repositories/snapshots/org/apache/myfaces/core/myfaces-api/3.0.0-SNAPSHOT/maven-metadata.xml (1.2 kB at 1.1 kB/s)
[INFO] Uploading to apache.snapshots.https: https://repository.apache.org/content/repositories/snapshots/org/apache/myfaces/core/myfaces-api/3.0.0-SNAPSHOT/myfaces-api-3.0.0-20181020.224350-17-tests.jar
[INFO] Uploaded to apache.snapshots.https: https://repository.apache.org/content/repositories/snapshots/org/apache/myfaces/core/myfaces-api/3.0.0-SNAPSHOT/myfaces-api-3.0.0-20181020.224350-17-tests.jar (12 kB at 11 kB/s)
[INFO] Uploading to apache.snapshots.https: https://repository.apache.org/content/repositories/snapshots/org/apache/myfaces/core/myfaces-api/3.0.0-SNAPSHOT/maven-metadata.xml
[INFO] Uploaded to apache.snapshots.https: https://repository.apache.org/content/repositories/snapshots/org/apache/myfaces/core/myfaces-api/3.0.0-SNAPSHOT/maven-metadata.xml (1.2 kB at 1.1 kB/s)
[INFO] 
[INFO] ------------------------------------------------------------------------
[INFO] Building Apache MyFaces Core 3.0 - Impl 3.0.0-SNAPSHOT
[INFO] ------------------------------------------------------------------------
[WARNING] The POM for org.apache.myfaces.test:myfaces-test30:jar:1.0.9-SNAPSHOT is missing, no dependency information available
[INFO] ------------------------------------------------------------------------
[INFO] Reactor Summary:
[INFO] 
[INFO] Apache MyFaces Core 3.0 - Parent ................... SUCCESS [ 17.964 s]
[INFO] Apache MyFaces Core 3.0 - API ...................... SUCCESS [01:08 min]
[INFO] Apache MyFaces Core 3.0 - Impl ..................... FAILURE [  0.280 s]
[INFO] Apache MyFaces Core 3.0 - OSGi Bundle .............. SKIPPED
[INFO] Apache MyFaces Core 3.0 ............................ SKIPPED
[INFO] ------------------------------------------------------------------------
[INFO] BUILD FAILURE
[INFO] ------------------------------------------------------------------------
[INFO] Total time: 01:36 min
[INFO] Finished at: 2018-10-20T15:44:11-07:00
[INFO] Final Memory: 75M/778M
[INFO] ------------------------------------------------------------------------
[ERROR] Failed to execute goal on project myfaces-impl: Could not resolve dependencies for project org.apache.myfaces.core:myfaces-impl:jar:3.0.0-SNAPSHOT: Failure to find org.apache.myfaces.test:myfaces-test30:jar:1.0.9-SNAPSHOT in http://repository.apache.org/snapshots/ was cached in the local repository, resolution will not be reattempted until the update interval of apache-snapshots has elapsed or updates are forced -> [Help 1]
[ERROR] 
[ERROR] To see the full stack trace of the errors, re-run Maven with the -e switch.
[ERROR] Re-run Maven using the -X switch to enable full debug logging.
[ERROR] 
[ERROR] For more information about the errors and possible solutions, please read the following articles:
[ERROR] [Help 1] http://cwiki.apache.org/confluence/display/MAVEN/DependencyResolutionException
[ERROR] 
[ERROR] After correcting the problems, you can resume the build with the command
[ERROR]   mvn <goals> -rf :myfaces-impl
[JENKINS] Archiving F:\jenkins\jenkins-slave\workspace\myfaces-current23\api\pom.xml to org.apache.myfaces.core/myfaces-api/3.0.0-SNAPSHOT/myfaces-api-3.0.0-SNAPSHOT.pom
[JENKINS] Archiving F:\jenkins\jenkins-slave\workspace\myfaces-current23\api\target\myfaces-api-3.0.0-SNAPSHOT.jar to org.apache.myfaces.core/myfaces-api/3.0.0-20181020.224350-17/myfaces-api-3.0.0-20181020.224350-17.jar
[JENKINS] Archiving F:\jenkins\jenkins-slave\workspace\myfaces-current23\api\target\myfaces-api-3.0.0-SNAPSHOT-sources.jar to org.apache.myfaces.core/myfaces-api/3.0.0-20181020.224350-17/myfaces-api-3.0.0-20181020.224350-17-sources.jar
[JENKINS] Archiving F:\jenkins\jenkins-slave\workspace\myfaces-current23\api\target\myfaces-api-3.0.0-SNAPSHOT-tests.jar to org.apache.myfaces.core/myfaces-api/3.0.0-20181020.224350-17/myfaces-api-3.0.0-20181020.224350-17-tests.jar
[Fast Archiver] Compressed 2.22 MB of artifacts by 29.5% relative to #357
[JENKINS] Archiving F:\jenkins\jenkins-slave\workspace\myfaces-current23\impl\pom.xml to org.apache.myfaces.core/myfaces-impl/3.0.0-SNAPSHOT/myfaces-impl-3.0.0-SNAPSHOT.pom
[JENKINS] Archiving F:\jenkins\jenkins-slave\workspace\myfaces-current23\bundle\pom.xml to org.apache.myfaces.core/myfaces-bundle/3.0.0-SNAPSHOT/myfaces-bundle-3.0.0-SNAPSHOT.pom
[JENKINS] Archiving <https://builds.apache.org/job/myfaces-current23/ws/pom.xml> to org.apache.myfaces.core/myfaces-core-module/3.0.0-SNAPSHOT/myfaces-core-module-3.0.0-SNAPSHOT.pom
[JENKINS] Archiving F:\jenkins\jenkins-slave\workspace\myfaces-current23\parent\pom.xml to org.apache.myfaces.core/myfaces-core-project/3.0.0-SNAPSHOT/myfaces-core-project-3.0.0-SNAPSHOT.pom
[JENKINS] Archiving F:\jenkins\jenkins-slave\workspace\myfaces-current23\parent\target\myfaces-core-project-3.0.0-SNAPSHOT-site.xml to org.apache.myfaces.core/myfaces-core-project/3.0.0-20181020.224246-22/myfaces-core-project-3.0.0-20181020.224246-22-site.xml
Sending e-mails to: commits@myfaces.apache.org grantsmith@apache.org tandraschko@apache.org
channel stopped
Java HotSpot(TM) 64-Bit Server VM warning: ignoring option MaxPermSize=256m; support was removed in 8.0

Build failed in Jenkins: myfaces-current23 #357

Posted by Apache Jenkins Server <je...@builds.apache.org>.
See <https://builds.apache.org/job/myfaces-current23/357/display/redirect?page=changes>

Changes:

[tandraschko] removed unused code

------------------------------------------
[...truncated 127.74 KB...]
[INFO] Using 'eval' reduces the level of compression!
function (){var _r=window.eval ---> . <--- call(window,code);if(

[WARNING] [WARNING] Using 'eval' is not recommended...
[INFO] Using 'eval' reduces the level of compression!
_T[_e]||((_w.eval ---> && <--- (!_b.isBlackBerry||_b.isBlackBerry

[WARNING] [WARNING] Using 'eval' is not recommended...
[INFO] Using 'eval' reduces the level of compression!
_T[_e]||((_w.eval ---> ) <--- ?"_evalHeadAppendix":null);}if(

[WARNING] [WARNING] Using 'eval' is not recommended...
[INFO] Using 'eval' reduces the level of compression!
[_e]](c);}eval ---> . <--- call(window,c);return null

[WARNING] [WARNING] The variable _T has already been declared in the same scope...
,tv=parseFloat(dav);var _T ---> = <--- this;_T.browser={};

[WARNING] [WARNING] The variable tagNameStart has already been declared in the same scope...
,_tokenPos=0,_tokenForward=1,tagNameStart ---> = <--- (!tagNameStart)?BEGIN_TAG:tagNameStart;

[WARNING] [WARNING] The variable i has already been declared in the same scope...
&&params!=null){for(var i ---> = <--- 0,param;(param=params[

[WARNING] [WARNING] The variable param has already been declared in the same scope...
){for(var i=0,param ---> ; <--- (param=params[i]);

[WARNING] [WARNING] The symbol assigned is declared but is apparently never used.
This code can probably be written in a more efficient way.
}:function (){};var assigned ---> = <--- true;}if("function"!=typeof newCls

[WARNING] [WARNING] The symbol found is declared but is apparently never used.
This code can probably be written in a more efficient way.
obj,finalAttr,value);}var found ---> = <--- false;var prefix=(value)?

[WARNING] [WARNING] The symbol _tokenPos is declared but is apparently never used.
This code can probably be written in a more efficient way.
=-1,_contentEnd=-1,_tokenPos ---> = <--- 0,_tokenForward=1,tagNameStart=(

[WARNING] [WARNING] The symbol _tokenForward is declared but is apparently never used.
This code can probably be written in a more efficient way.
_contentEnd=-1,_tokenPos=0,_tokenForward ---> = <--- 1,tagNameStart=(!tagNameStart)?

[WARNING] [WARNING] The symbol _RT is declared but is apparently never used.
This code can probably be written in a more efficient way.
{var _Lang=this._Lang;var _RT ---> = <--- this._RT;var _Dom=this.

[WARNING] [WARNING] The symbol _Dom is declared but is apparently never used.
This code can probably be written in a more efficient way.
;var _RT=this._RT;var _Dom ---> = <--- this._Dom;try{var scopeThis=

[WARNING] [WARNING] The symbol _AJAXUTIL is declared but is apparently never used.
This code can probably be written in a more efficient way.
},getFormData:function (){var _AJAXUTIL ---> = <--- this._AJAXUTIL,myfacesOptions=this._context

[WARNING] [WARNING] The symbol myfacesOptions is declared but is apparently never used.
This code can probably be written in a more efficient way.
){var _AJAXUTIL=this._AJAXUTIL,myfacesOptions ---> = <--- this._context.myfaces;return this.

[WARNING] [WARNING] The symbol _Lang is declared but is apparently never used.
This code can probably be written in a more efficient way.
,fixViewStates:function (context){var _Lang ---> = <--- this._Lang;var mfInternal=context.

[WARNING] [WARNING] The symbol _Lang is declared but is apparently never used.
This code can probably be written in a more efficient way.
:function (context,theForm){var _Lang ---> = <--- this._Lang;var mfInternal=context.

[WARNING] [WARNING] The symbol prefix is declared but is apparently never used.
This code can probably be written in a more efficient way.
(context,value,identifier){var prefix ---> = <--- this._getPrefix(context);var sourceForm

[WARNING] [WARNING] The symbol self is declared but is apparently never used.
This code can probably be written in a more efficient way.
};var clientIdsByTokens={};var self ---> = <--- {};function Socket(channelToken,url
[INFO] jsf-minimal.js (342,554 bytes) ............................. compressed at 73%
[INFO] Object.js (3,563 bytes) .................................... compressed at 67%
[INFO] _EndImpl.js (1,552 bytes) .................................. compressed at 84%
[INFO] _ExtRuntime.js (7,643 bytes) ............................... compressed at 78%
[INFO] _RuntimeQuirks.js (2,130 bytes) ............................ compressed at 78%
[INFO] _StartImpl.js (1,729 bytes) ................................ compressed at 75%
[INFO] Messages.js (5,777 bytes) .................................. compressed at 47%
[INFO] Messages_de.js (5,949 bytes) ............................... compressed at 44%
[INFO] Messages_es.js (5,488 bytes) ............................... compressed at 39%
[INFO] Messages_fr.js (5,613 bytes) ............................... compressed at 41%
[INFO] Messages_it.js (5,179 bytes) ............................... compressed at 39%
[INFO] Messages_nl.js (5,196 bytes) ............................... compressed at 40%
[INFO] Messages_ru.js (5,935 bytes) ............................... compressed at 34%
[INFO] Messages_zh_CN.js (5,758 bytes) ............................ compressed at 52%
[INFO] Messages_zh_HK.js (6,090 bytes) ............................ compressed at 55%
[INFO] Messages_zh_TW.js (6,499 bytes) ............................ compressed at 58%
[INFO] BaseRequest.js (4,813 bytes) ............................... compressed at 82%
[INFO] FormData.js (2,588 bytes) .................................. compressed at 71%
[INFO] IFrame.js (12,067 bytes) ................................... compressed at 70%
[INFO] Xhr1.js (6,589 bytes) ...................................... compressed at 60%
[INFO] XhrConst.js (1,469 bytes) .................................. compressed at 84%
[INFO] _ExtAjaxRequest.js (2,726 bytes) ........................... compressed at 77%
[INFO] _ExtTransport.js (8,327 bytes) ............................. compressed at 85%

[WARNING] [WARNING] Found an undeclared symbol: jsf
,"partial/ajax");var viewState=decodeURIComponent(jsf ---> . <--- getViewState(this._sourceForm));viewState

[WARNING] [WARNING] The symbol jsf is declared but is apparently never used.
This code can probably be written in a more efficient way.
,"partial/ajax");var viewState=decodeURIComponent(jsf ---> . <--- getViewState(this._sourceForm));viewState
[INFO] _IFrameRequest.js (2,974 bytes) ............................ compressed at 74%
[INFO] _PartialSubmitUtils.js (5,264 bytes) ....................... compressed at 77%
[INFO] _DomExperimental.js (1,629 bytes) .......................... compressed at 75%
[INFO] _DomQuirks.js (25,781 bytes) ............................... compressed at 76%
[INFO] _ExtDom.js (13,061 bytes) .................................. compressed at 74%
[INFO] _ExtLang.js (4,363 bytes) .................................. compressed at 74%
[INFO] _LangQuirks.js (8,389 bytes) ............................... compressed at 77%
[INFO] _Logging.js (4,749 bytes) .................................. compressed at 66%
[INFO] ------------------------------------------------------------------------------
[INFO] compression saved 3,168 bytes
[INFO] 
[INFO] --- maven-compiler-plugin:3.6.1:compile (default-compile) @ myfaces-api ---
[INFO] Nothing to compile - all classes are up to date
[INFO] 
[INFO] --- maven-bundle-plugin:3.0.1:manifest (bundle-manifest) @ myfaces-api ---
[INFO] 
[INFO] --- maven-resources-plugin:2.5:testResources (default-testResources) @ myfaces-api ---
[debug] execute contextualize
[INFO] Using 'UTF-8' encoding to copy filtered resources.
[INFO] skip non existing resourceDirectory F:\jenkins\jenkins-slave\workspace\myfaces-current23\api\src\test\resources
[INFO] Copying 3 resources
[INFO] Copying 3 resources
[INFO] 
[INFO] --- maven-compiler-plugin:3.6.1:testCompile (default-testCompile) @ myfaces-api ---
[INFO] No sources to compile
[INFO] 
[INFO] --- maven-surefire-plugin:2.22.1:test (default-test) @ myfaces-api ---
[INFO] Skipping execution of surefire because it has already been run for this configuration
[JENKINS] Recording test results
[INFO] 
[INFO] --- maven-surefire-plugin:2.22.1:test (default) @ myfaces-api ---
[INFO] Skipping execution of surefire because it has already been run for this configuration
[JENKINS] Recording test results
[INFO] 
[INFO] --- maven-jar-plugin:2.2:jar (default-jar) @ myfaces-api ---
[INFO] Building jar: F:\jenkins\jenkins-slave\workspace\myfaces-current23\api\target\myfaces-api-3.0.0-SNAPSHOT.jar
[INFO] 
[INFO] >>> maven-source-plugin:2.2.1:jar (attach-source) > generate-sources @ myfaces-api >>>
[INFO] 
[INFO] --- maven-enforcer-plugin:1.4.1:enforce (enforce-maven-version) @ myfaces-api ---
[INFO] 
[INFO] --- build-helper-maven-plugin:1.9.1:parse-version (parse-version) @ myfaces-api ---
[INFO] 
[INFO] --- myfaces-builder-plugin:1.0.10:build-metadata (default) @ myfaces-api ---
[INFO] model is up to date
[INFO] 
[INFO] --- myfaces-builder-plugin:1.0.10:make-components (makecomp) @ myfaces-api ---
[INFO] generated component files are up to date
[WARNING] Failed to getClass for org.apache.maven.plugin.source.SourceJarMojo
[INFO] 
[INFO] <<< maven-source-plugin:2.2.1:jar (attach-source) < generate-sources @ myfaces-api <<<
[INFO] 
[INFO] 
[INFO] --- maven-source-plugin:2.2.1:jar (attach-source) @ myfaces-api ---
[INFO] Building jar: F:\jenkins\jenkins-slave\workspace\myfaces-current23\api\target\myfaces-api-3.0.0-SNAPSHOT-sources.jar
[INFO] 
[INFO] --- maven-site-plugin:3.3:attach-descriptor (attach-descriptor) @ myfaces-api ---
[INFO] 
[INFO] --- maven-jar-plugin:2.2:test-jar (default) @ myfaces-api ---
[INFO] Building jar: F:\jenkins\jenkins-slave\workspace\myfaces-current23\api\target\myfaces-api-3.0.0-SNAPSHOT-tests.jar
[INFO] 
[INFO] --- maven-checkstyle-plugin:2.17:check (verify-style) @ myfaces-api ---
[INFO] Starting audit...
Audit done.
[INFO] 
[INFO] --- maven-install-plugin:2.5.2:install (default-install) @ myfaces-api ---
[INFO] Installing F:\jenkins\jenkins-slave\workspace\myfaces-current23\api\target\myfaces-api-3.0.0-SNAPSHOT.jar to f:\jenkins\jenkins-slave\maven-repositories\1\org\apache\myfaces\core\myfaces-api\3.0.0-SNAPSHOT\myfaces-api-3.0.0-SNAPSHOT.jar
[INFO] Installing F:\jenkins\jenkins-slave\workspace\myfaces-current23\api\pom.xml to f:\jenkins\jenkins-slave\maven-repositories\1\org\apache\myfaces\core\myfaces-api\3.0.0-SNAPSHOT\myfaces-api-3.0.0-SNAPSHOT.pom
[INFO] Installing F:\jenkins\jenkins-slave\workspace\myfaces-current23\api\target\myfaces-api-3.0.0-SNAPSHOT-sources.jar to f:\jenkins\jenkins-slave\maven-repositories\1\org\apache\myfaces\core\myfaces-api\3.0.0-SNAPSHOT\myfaces-api-3.0.0-SNAPSHOT-sources.jar
[INFO] Installing F:\jenkins\jenkins-slave\workspace\myfaces-current23\api\target\myfaces-api-3.0.0-SNAPSHOT-tests.jar to f:\jenkins\jenkins-slave\maven-repositories\1\org\apache\myfaces\core\myfaces-api\3.0.0-SNAPSHOT\myfaces-api-3.0.0-SNAPSHOT-tests.jar
[INFO] Installing F:\jenkins\jenkins-slave\workspace\myfaces-current23\api\target\myfaces-api-3.0.0-SNAPSHOT-sources.jar to f:\jenkins\jenkins-slave\maven-repositories\1\org\apache\myfaces\core\myfaces-api\3.0.0-SNAPSHOT\myfaces-api-3.0.0-SNAPSHOT-sources.jar
[INFO] Installing F:\jenkins\jenkins-slave\workspace\myfaces-current23\api\target\myfaces-api-3.0.0-SNAPSHOT-tests.jar to f:\jenkins\jenkins-slave\maven-repositories\1\org\apache\myfaces\core\myfaces-api\3.0.0-SNAPSHOT\myfaces-api-3.0.0-SNAPSHOT-tests.jar
[INFO] 
[INFO] --- maven-deploy-plugin:2.8.2:deploy (default-deploy) @ myfaces-api ---
[INFO] Downloading from apache.snapshots.https: https://repository.apache.org/content/repositories/snapshots/org/apache/myfaces/core/myfaces-api/3.0.0-SNAPSHOT/maven-metadata.xml
[INFO] Downloaded from apache.snapshots.https: https://repository.apache.org/content/repositories/snapshots/org/apache/myfaces/core/myfaces-api/3.0.0-SNAPSHOT/maven-metadata.xml (1.2 kB at 2.1 kB/s)
[INFO] Uploading to apache.snapshots.https: https://repository.apache.org/content/repositories/snapshots/org/apache/myfaces/core/myfaces-api/3.0.0-SNAPSHOT/myfaces-api-3.0.0-20181020.185519-16.jar
[INFO] Uploaded to apache.snapshots.https: https://repository.apache.org/content/repositories/snapshots/org/apache/myfaces/core/myfaces-api/3.0.0-SNAPSHOT/myfaces-api-3.0.0-20181020.185519-16.jar (1.3 MB at 749 kB/s)
[INFO] Uploading to apache.snapshots.https: https://repository.apache.org/content/repositories/snapshots/org/apache/myfaces/core/myfaces-api/3.0.0-SNAPSHOT/myfaces-api-3.0.0-20181020.185519-16.pom
[INFO] Uploaded to apache.snapshots.https: https://repository.apache.org/content/repositories/snapshots/org/apache/myfaces/core/myfaces-api/3.0.0-SNAPSHOT/myfaces-api-3.0.0-20181020.185519-16.pom (34 kB at 28 kB/s)
[INFO] Downloading from apache.snapshots.https: https://repository.apache.org/content/repositories/snapshots/org/apache/myfaces/core/myfaces-api/maven-metadata.xml
[INFO] Downloaded from apache.snapshots.https: https://repository.apache.org/content/repositories/snapshots/org/apache/myfaces/core/myfaces-api/maven-metadata.xml (653 B at 1.1 kB/s)
[INFO] Uploading to apache.snapshots.https: https://repository.apache.org/content/repositories/snapshots/org/apache/myfaces/core/myfaces-api/3.0.0-SNAPSHOT/maven-metadata.xml
[INFO] Uploaded to apache.snapshots.https: https://repository.apache.org/content/repositories/snapshots/org/apache/myfaces/core/myfaces-api/3.0.0-SNAPSHOT/maven-metadata.xml (1.2 kB at 1.0 kB/s)
[INFO] Uploading to apache.snapshots.https: https://repository.apache.org/content/repositories/snapshots/org/apache/myfaces/core/myfaces-api/maven-metadata.xml
[INFO] Uploaded to apache.snapshots.https: https://repository.apache.org/content/repositories/snapshots/org/apache/myfaces/core/myfaces-api/maven-metadata.xml (653 B at 584 B/s)
[INFO] Uploading to apache.snapshots.https: https://repository.apache.org/content/repositories/snapshots/org/apache/myfaces/core/myfaces-api/3.0.0-SNAPSHOT/myfaces-api-3.0.0-20181020.185519-16-sources.jar
[INFO] Uploaded to apache.snapshots.https: https://repository.apache.org/content/repositories/snapshots/org/apache/myfaces/core/myfaces-api/3.0.0-SNAPSHOT/myfaces-api-3.0.0-20181020.185519-16-sources.jar (972 kB at 543 kB/s)
[INFO] Uploading to apache.snapshots.https: https://repository.apache.org/content/repositories/snapshots/org/apache/myfaces/core/myfaces-api/3.0.0-SNAPSHOT/maven-metadata.xml
[INFO] Uploaded to apache.snapshots.https: https://repository.apache.org/content/repositories/snapshots/org/apache/myfaces/core/myfaces-api/3.0.0-SNAPSHOT/maven-metadata.xml (1.2 kB at 1.0 kB/s)
[INFO] Uploading to apache.snapshots.https: https://repository.apache.org/content/repositories/snapshots/org/apache/myfaces/core/myfaces-api/3.0.0-SNAPSHOT/myfaces-api-3.0.0-20181020.185519-16-tests.jar
[INFO] Uploaded to apache.snapshots.https: https://repository.apache.org/content/repositories/snapshots/org/apache/myfaces/core/myfaces-api/3.0.0-SNAPSHOT/myfaces-api-3.0.0-20181020.185519-16-tests.jar (12 kB at 10 kB/s)
[INFO] Uploading to apache.snapshots.https: https://repository.apache.org/content/repositories/snapshots/org/apache/myfaces/core/myfaces-api/3.0.0-SNAPSHOT/maven-metadata.xml
[INFO] Uploaded to apache.snapshots.https: https://repository.apache.org/content/repositories/snapshots/org/apache/myfaces/core/myfaces-api/3.0.0-SNAPSHOT/maven-metadata.xml (1.2 kB at 1.0 kB/s)
[INFO] Uploading to apache.snapshots.https: https://repository.apache.org/content/repositories/snapshots/org/apache/myfaces/core/myfaces-api/3.0.0-SNAPSHOT/myfaces-api-3.0.0-20181020.185519-16-sources.jar
[INFO] Uploaded to apache.snapshots.https: https://repository.apache.org/content/repositories/snapshots/org/apache/myfaces/core/myfaces-api/3.0.0-SNAPSHOT/myfaces-api-3.0.0-20181020.185519-16-sources.jar (972 kB at 579 kB/s)
[INFO] Uploading to apache.snapshots.https: https://repository.apache.org/content/repositories/snapshots/org/apache/myfaces/core/myfaces-api/3.0.0-SNAPSHOT/maven-metadata.xml
[INFO] Uploaded to apache.snapshots.https: https://repository.apache.org/content/repositories/snapshots/org/apache/myfaces/core/myfaces-api/3.0.0-SNAPSHOT/maven-metadata.xml (1.2 kB at 1.1 kB/s)
[INFO] Uploading to apache.snapshots.https: https://repository.apache.org/content/repositories/snapshots/org/apache/myfaces/core/myfaces-api/3.0.0-SNAPSHOT/myfaces-api-3.0.0-20181020.185519-16-tests.jar
[INFO] Uploaded to apache.snapshots.https: https://repository.apache.org/content/repositories/snapshots/org/apache/myfaces/core/myfaces-api/3.0.0-SNAPSHOT/myfaces-api-3.0.0-20181020.185519-16-tests.jar (12 kB at 11 kB/s)
[INFO] Uploading to apache.snapshots.https: https://repository.apache.org/content/repositories/snapshots/org/apache/myfaces/core/myfaces-api/3.0.0-SNAPSHOT/maven-metadata.xml
[INFO] Uploaded to apache.snapshots.https: https://repository.apache.org/content/repositories/snapshots/org/apache/myfaces/core/myfaces-api/3.0.0-SNAPSHOT/maven-metadata.xml (1.2 kB at 1.1 kB/s)
[INFO] 
[INFO] ------------------------------------------------------------------------
[INFO] Building Apache MyFaces Core 3.0 - Impl 3.0.0-SNAPSHOT
[INFO] ------------------------------------------------------------------------
[WARNING] The POM for org.apache.myfaces.test:myfaces-test30:jar:1.0.9-SNAPSHOT is missing, no dependency information available
[INFO] ------------------------------------------------------------------------
[INFO] Reactor Summary:
[INFO] 
[INFO] Apache MyFaces Core 3.0 - Parent ................... SUCCESS [ 17.966 s]
[INFO] Apache MyFaces Core 3.0 - API ...................... SUCCESS [01:11 min]
[INFO] Apache MyFaces Core 3.0 - Impl ..................... FAILURE [  0.270 s]
[INFO] Apache MyFaces Core 3.0 - OSGi Bundle .............. SKIPPED
[INFO] Apache MyFaces Core 3.0 ............................ SKIPPED
[INFO] ------------------------------------------------------------------------
[INFO] BUILD FAILURE
[INFO] ------------------------------------------------------------------------
[INFO] Total time: 01:39 min
[INFO] Finished at: 2018-10-20T11:55:40-07:00
[INFO] Final Memory: 75M/732M
[INFO] ------------------------------------------------------------------------
[ERROR] Failed to execute goal on project myfaces-impl: Could not resolve dependencies for project org.apache.myfaces.core:myfaces-impl:jar:3.0.0-SNAPSHOT: Failure to find org.apache.myfaces.test:myfaces-test30:jar:1.0.9-SNAPSHOT in http://repository.apache.org/snapshots/ was cached in the local repository, resolution will not be reattempted until the update interval of apache-snapshots has elapsed or updates are forced -> [Help 1]
[ERROR] 
[ERROR] To see the full stack trace of the errors, re-run Maven with the -e switch.
[ERROR] Re-run Maven using the -X switch to enable full debug logging.
[ERROR] 
[ERROR] For more information about the errors and possible solutions, please read the following articles:
[ERROR] [Help 1] http://cwiki.apache.org/confluence/display/MAVEN/DependencyResolutionException
[ERROR] 
[ERROR] After correcting the problems, you can resume the build with the command
[ERROR]   mvn <goals> -rf :myfaces-impl
[JENKINS] Archiving F:\jenkins\jenkins-slave\workspace\myfaces-current23\api\pom.xml to org.apache.myfaces.core/myfaces-api/3.0.0-SNAPSHOT/myfaces-api-3.0.0-SNAPSHOT.pom
[JENKINS] Archiving F:\jenkins\jenkins-slave\workspace\myfaces-current23\api\target\myfaces-api-3.0.0-SNAPSHOT.jar to org.apache.myfaces.core/myfaces-api/3.0.0-20181020.185519-16/myfaces-api-3.0.0-20181020.185519-16.jar
[JENKINS] Archiving F:\jenkins\jenkins-slave\workspace\myfaces-current23\api\target\myfaces-api-3.0.0-SNAPSHOT-sources.jar to org.apache.myfaces.core/myfaces-api/3.0.0-20181020.185519-16/myfaces-api-3.0.0-20181020.185519-16-sources.jar
[JENKINS] Archiving F:\jenkins\jenkins-slave\workspace\myfaces-current23\api\target\myfaces-api-3.0.0-SNAPSHOT-tests.jar to org.apache.myfaces.core/myfaces-api/3.0.0-20181020.185519-16/myfaces-api-3.0.0-20181020.185519-16-tests.jar
[Fast Archiver] Compressed 2.22 MB of artifacts by 29.5% relative to #356
[JENKINS] Archiving F:\jenkins\jenkins-slave\workspace\myfaces-current23\impl\pom.xml to org.apache.myfaces.core/myfaces-impl/3.0.0-SNAPSHOT/myfaces-impl-3.0.0-SNAPSHOT.pom
[JENKINS] Archiving F:\jenkins\jenkins-slave\workspace\myfaces-current23\bundle\pom.xml to org.apache.myfaces.core/myfaces-bundle/3.0.0-SNAPSHOT/myfaces-bundle-3.0.0-SNAPSHOT.pom
[JENKINS] Archiving <https://builds.apache.org/job/myfaces-current23/ws/pom.xml> to org.apache.myfaces.core/myfaces-core-module/3.0.0-SNAPSHOT/myfaces-core-module-3.0.0-SNAPSHOT.pom
[JENKINS] Archiving F:\jenkins\jenkins-slave\workspace\myfaces-current23\parent\pom.xml to org.apache.myfaces.core/myfaces-core-project/3.0.0-SNAPSHOT/myfaces-core-project-3.0.0-SNAPSHOT.pom
[JENKINS] Archiving F:\jenkins\jenkins-slave\workspace\myfaces-current23\parent\target\myfaces-core-project-3.0.0-SNAPSHOT-site.xml to org.apache.myfaces.core/myfaces-core-project/3.0.0-20181020.185412-21/myfaces-core-project-3.0.0-20181020.185412-21-site.xml
Sending e-mails to: commits@myfaces.apache.org grantsmith@apache.org tandraschko@apache.org
channel stopped
Java HotSpot(TM) 64-Bit Server VM warning: ignoring option MaxPermSize=256m; support was removed in 8.0

Build failed in Jenkins: myfaces-current23 #356

Posted by Apache Jenkins Server <je...@builds.apache.org>.
See <https://builds.apache.org/job/myfaces-current23/356/display/redirect?page=changes>

Changes:

[tandraschko] refactored to use new junit api

[tandraschko] refactored to use new junit api

[tandraschko] renamed packages

------------------------------------------
[...truncated 121.21 KB...]
[INFO] Using 'eval' reduces the level of compression!
function (){var _r=window.eval ---> . <--- call(window,code);if(

[WARNING] [WARNING] Using 'eval' is not recommended...
[INFO] Using 'eval' reduces the level of compression!
_T[_e]||((_w.eval ---> && <--- (!_b.isBlackBerry||_b.isBlackBerry

[WARNING] [WARNING] Using 'eval' is not recommended...
[INFO] Using 'eval' reduces the level of compression!
_T[_e]||((_w.eval ---> ) <--- ?"_evalHeadAppendix":null);}if(

[WARNING] [WARNING] Using 'eval' is not recommended...
[INFO] Using 'eval' reduces the level of compression!
[_e]](c);}eval ---> . <--- call(window,c);return null

[WARNING] [WARNING] The variable _T has already been declared in the same scope...
,tv=parseFloat(dav);var _T ---> = <--- this;_T.browser={};

[WARNING] [WARNING] The variable tagNameStart has already been declared in the same scope...
,_tokenPos=0,_tokenForward=1,tagNameStart ---> = <--- (!tagNameStart)?BEGIN_TAG:tagNameStart;

[WARNING] [WARNING] The variable i has already been declared in the same scope...
&&params!=null){for(var i ---> = <--- 0,param;(param=params[

[WARNING] [WARNING] The variable param has already been declared in the same scope...
){for(var i=0,param ---> ; <--- (param=params[i]);

[WARNING] [WARNING] The symbol assigned is declared but is apparently never used.
This code can probably be written in a more efficient way.
}:function (){};var assigned ---> = <--- true;}if("function"!=typeof newCls

[WARNING] [WARNING] The symbol found is declared but is apparently never used.
This code can probably be written in a more efficient way.
obj,finalAttr,value);}var found ---> = <--- false;var prefix=(value)?

[WARNING] [WARNING] The symbol _tokenPos is declared but is apparently never used.
This code can probably be written in a more efficient way.
=-1,_contentEnd=-1,_tokenPos ---> = <--- 0,_tokenForward=1,tagNameStart=(

[WARNING] [WARNING] The symbol _tokenForward is declared but is apparently never used.
This code can probably be written in a more efficient way.
_contentEnd=-1,_tokenPos=0,_tokenForward ---> = <--- 1,tagNameStart=(!tagNameStart)?

[WARNING] [WARNING] The symbol _RT is declared but is apparently never used.
This code can probably be written in a more efficient way.
{var _Lang=this._Lang;var _RT ---> = <--- this._RT;var _Dom=this.

[WARNING] [WARNING] The symbol _Dom is declared but is apparently never used.
This code can probably be written in a more efficient way.
;var _RT=this._RT;var _Dom ---> = <--- this._Dom;try{var scopeThis=

[WARNING] [WARNING] The symbol _AJAXUTIL is declared but is apparently never used.
This code can probably be written in a more efficient way.
},getFormData:function (){var _AJAXUTIL ---> = <--- this._AJAXUTIL,myfacesOptions=this._context

[WARNING] [WARNING] The symbol myfacesOptions is declared but is apparently never used.
This code can probably be written in a more efficient way.
){var _AJAXUTIL=this._AJAXUTIL,myfacesOptions ---> = <--- this._context.myfaces;return this.

[WARNING] [WARNING] The symbol _Lang is declared but is apparently never used.
This code can probably be written in a more efficient way.
,fixViewStates:function (context){var _Lang ---> = <--- this._Lang;var mfInternal=context.

[WARNING] [WARNING] The symbol _Lang is declared but is apparently never used.
This code can probably be written in a more efficient way.
:function (context,theForm){var _Lang ---> = <--- this._Lang;var mfInternal=context.

[WARNING] [WARNING] The symbol prefix is declared but is apparently never used.
This code can probably be written in a more efficient way.
(context,value,identifier){var prefix ---> = <--- this._getPrefix(context);var sourceForm

[WARNING] [WARNING] The symbol self is declared but is apparently never used.
This code can probably be written in a more efficient way.
};var clientIdsByTokens={};var self ---> = <--- {};function Socket(channelToken,url
[INFO] jsf-minimal.js (342,554 bytes) ............................. compressed at 73%
[INFO] Object.js (3,563 bytes) .................................... compressed at 67%
[INFO] _EndImpl.js (1,552 bytes) .................................. compressed at 84%
[INFO] _ExtRuntime.js (7,643 bytes) ............................... compressed at 78%
[INFO] _RuntimeQuirks.js (2,130 bytes) ............................ compressed at 78%
[INFO] _StartImpl.js (1,729 bytes) ................................ compressed at 75%
[INFO] Messages.js (5,777 bytes) .................................. compressed at 47%
[INFO] Messages_de.js (5,949 bytes) ............................... compressed at 44%
[INFO] Messages_es.js (5,488 bytes) ............................... compressed at 39%
[INFO] Messages_fr.js (5,613 bytes) ............................... compressed at 41%
[INFO] Messages_it.js (5,179 bytes) ............................... compressed at 39%
[INFO] Messages_nl.js (5,196 bytes) ............................... compressed at 40%
[INFO] Messages_ru.js (5,935 bytes) ............................... compressed at 34%
[INFO] Messages_zh_CN.js (5,758 bytes) ............................ compressed at 52%
[INFO] Messages_zh_HK.js (6,090 bytes) ............................ compressed at 55%
[INFO] Messages_zh_TW.js (6,499 bytes) ............................ compressed at 58%
[INFO] BaseRequest.js (4,813 bytes) ............................... compressed at 82%
[INFO] FormData.js (2,588 bytes) .................................. compressed at 71%
[INFO] IFrame.js (12,067 bytes) ................................... compressed at 70%
[INFO] Xhr1.js (6,589 bytes) ...................................... compressed at 60%
[INFO] XhrConst.js (1,469 bytes) .................................. compressed at 84%
[INFO] _ExtAjaxRequest.js (2,726 bytes) ........................... compressed at 77%
[INFO] _ExtTransport.js (8,327 bytes) ............................. compressed at 85%

[WARNING] [WARNING] Found an undeclared symbol: jsf
,"partial/ajax");var viewState=decodeURIComponent(jsf ---> . <--- getViewState(this._sourceForm));viewState

[WARNING] [WARNING] The symbol jsf is declared but is apparently never used.
This code can probably be written in a more efficient way.
,"partial/ajax");var viewState=decodeURIComponent(jsf ---> . <--- getViewState(this._sourceForm));viewState
[INFO] _IFrameRequest.js (2,974 bytes) ............................ compressed at 74%
[INFO] _PartialSubmitUtils.js (5,264 bytes) ....................... compressed at 77%
[INFO] _DomExperimental.js (1,629 bytes) .......................... compressed at 75%
[INFO] _DomQuirks.js (25,781 bytes) ............................... compressed at 76%
[INFO] _ExtDom.js (13,061 bytes) .................................. compressed at 74%
[INFO] _ExtLang.js (4,363 bytes) .................................. compressed at 74%
[INFO] _LangQuirks.js (8,389 bytes) ............................... compressed at 77%
[INFO] _Logging.js (4,749 bytes) .................................. compressed at 66%
[INFO] ------------------------------------------------------------------------------
[INFO] compression saved 3,168 bytes
[INFO] 
[INFO] --- maven-compiler-plugin:3.6.1:compile (default-compile) @ myfaces-api ---
[INFO] Nothing to compile - all classes are up to date
[INFO] 
[INFO] --- maven-bundle-plugin:3.0.1:manifest (bundle-manifest) @ myfaces-api ---
[INFO] 
[INFO] --- maven-resources-plugin:2.5:testResources (default-testResources) @ myfaces-api ---
[debug] execute contextualize
[INFO] Using 'UTF-8' encoding to copy filtered resources.
[INFO] skip non existing resourceDirectory F:\jenkins\jenkins-slave\workspace\myfaces-current23\api\src\test\resources
[INFO] Copying 3 resources
[INFO] Copying 3 resources
[INFO] 
[INFO] --- maven-compiler-plugin:3.6.1:testCompile (default-testCompile) @ myfaces-api ---
[INFO] No sources to compile
[INFO] 
[INFO] --- maven-surefire-plugin:2.16:test (default-test) @ myfaces-api ---
[INFO] Skipping execution of surefire because it has already been run for this configuration
[JENKINS] Recording test results
[INFO] 
[INFO] --- maven-surefire-plugin:2.16:test (default) @ myfaces-api ---
[INFO] Skipping execution of surefire because it has already been run for this configuration
[JENKINS] Recording test results
[INFO] 
[INFO] --- maven-jar-plugin:2.2:jar (default-jar) @ myfaces-api ---
[INFO] Building jar: F:\jenkins\jenkins-slave\workspace\myfaces-current23\api\target\myfaces-api-3.0.0-SNAPSHOT.jar
[INFO] 
[INFO] >>> maven-source-plugin:2.2.1:jar (attach-source) > generate-sources @ myfaces-api >>>
[INFO] 
[INFO] --- maven-enforcer-plugin:1.4.1:enforce (enforce-maven-version) @ myfaces-api ---
[INFO] 
[INFO] --- build-helper-maven-plugin:1.9.1:parse-version (parse-version) @ myfaces-api ---
[INFO] 
[INFO] --- myfaces-builder-plugin:1.0.10:build-metadata (default) @ myfaces-api ---
[INFO] model is up to date
[INFO] 
[INFO] --- myfaces-builder-plugin:1.0.10:make-components (makecomp) @ myfaces-api ---
[INFO] generated component files are up to date
[WARNING] Failed to getClass for org.apache.maven.plugin.source.SourceJarMojo
[INFO] 
[INFO] <<< maven-source-plugin:2.2.1:jar (attach-source) < generate-sources @ myfaces-api <<<
[INFO] 
[INFO] 
[INFO] --- maven-source-plugin:2.2.1:jar (attach-source) @ myfaces-api ---
[INFO] Building jar: F:\jenkins\jenkins-slave\workspace\myfaces-current23\api\target\myfaces-api-3.0.0-SNAPSHOT-sources.jar
[INFO] 
[INFO] --- maven-site-plugin:3.3:attach-descriptor (attach-descriptor) @ myfaces-api ---
[INFO] 
[INFO] --- maven-jar-plugin:2.2:test-jar (default) @ myfaces-api ---
[INFO] Building jar: F:\jenkins\jenkins-slave\workspace\myfaces-current23\api\target\myfaces-api-3.0.0-SNAPSHOT-tests.jar
[INFO] 
[INFO] --- maven-checkstyle-plugin:2.17:check (verify-style) @ myfaces-api ---
[INFO] Starting audit...
Audit done.
[INFO] 
[INFO] --- maven-install-plugin:2.5.2:install (default-install) @ myfaces-api ---
[INFO] Installing F:\jenkins\jenkins-slave\workspace\myfaces-current23\api\target\myfaces-api-3.0.0-SNAPSHOT.jar to f:\jenkins\jenkins-slave\maven-repositories\1\org\apache\myfaces\core\myfaces-api\3.0.0-SNAPSHOT\myfaces-api-3.0.0-SNAPSHOT.jar
[INFO] Installing F:\jenkins\jenkins-slave\workspace\myfaces-current23\api\pom.xml to f:\jenkins\jenkins-slave\maven-repositories\1\org\apache\myfaces\core\myfaces-api\3.0.0-SNAPSHOT\myfaces-api-3.0.0-SNAPSHOT.pom
[INFO] Installing F:\jenkins\jenkins-slave\workspace\myfaces-current23\api\target\myfaces-api-3.0.0-SNAPSHOT-sources.jar to f:\jenkins\jenkins-slave\maven-repositories\1\org\apache\myfaces\core\myfaces-api\3.0.0-SNAPSHOT\myfaces-api-3.0.0-SNAPSHOT-sources.jar
[INFO] Installing F:\jenkins\jenkins-slave\workspace\myfaces-current23\api\target\myfaces-api-3.0.0-SNAPSHOT-tests.jar to f:\jenkins\jenkins-slave\maven-repositories\1\org\apache\myfaces\core\myfaces-api\3.0.0-SNAPSHOT\myfaces-api-3.0.0-SNAPSHOT-tests.jar
[INFO] Installing F:\jenkins\jenkins-slave\workspace\myfaces-current23\api\target\myfaces-api-3.0.0-SNAPSHOT-sources.jar to f:\jenkins\jenkins-slave\maven-repositories\1\org\apache\myfaces\core\myfaces-api\3.0.0-SNAPSHOT\myfaces-api-3.0.0-SNAPSHOT-sources.jar
[INFO] Installing F:\jenkins\jenkins-slave\workspace\myfaces-current23\api\target\myfaces-api-3.0.0-SNAPSHOT-tests.jar to f:\jenkins\jenkins-slave\maven-repositories\1\org\apache\myfaces\core\myfaces-api\3.0.0-SNAPSHOT\myfaces-api-3.0.0-SNAPSHOT-tests.jar
[INFO] 
[INFO] --- maven-deploy-plugin:2.8.2:deploy (default-deploy) @ myfaces-api ---
[INFO] Downloading from apache.snapshots.https: https://repository.apache.org/content/repositories/snapshots/org/apache/myfaces/core/myfaces-api/3.0.0-SNAPSHOT/maven-metadata.xml
[INFO] Downloaded from apache.snapshots.https: https://repository.apache.org/content/repositories/snapshots/org/apache/myfaces/core/myfaces-api/3.0.0-SNAPSHOT/maven-metadata.xml (1.2 kB at 2.1 kB/s)
[INFO] Uploading to apache.snapshots.https: https://repository.apache.org/content/repositories/snapshots/org/apache/myfaces/core/myfaces-api/3.0.0-SNAPSHOT/myfaces-api-3.0.0-20181020.181338-15.jar
[INFO] Uploaded to apache.snapshots.https: https://repository.apache.org/content/repositories/snapshots/org/apache/myfaces/core/myfaces-api/3.0.0-SNAPSHOT/myfaces-api-3.0.0-20181020.181338-15.jar (1.3 MB at 652 kB/s)
[INFO] Uploading to apache.snapshots.https: https://repository.apache.org/content/repositories/snapshots/org/apache/myfaces/core/myfaces-api/3.0.0-SNAPSHOT/myfaces-api-3.0.0-20181020.181338-15.pom
[INFO] Uploaded to apache.snapshots.https: https://repository.apache.org/content/repositories/snapshots/org/apache/myfaces/core/myfaces-api/3.0.0-SNAPSHOT/myfaces-api-3.0.0-20181020.181338-15.pom (34 kB at 27 kB/s)
[INFO] Downloading from apache.snapshots.https: https://repository.apache.org/content/repositories/snapshots/org/apache/myfaces/core/myfaces-api/maven-metadata.xml
[INFO] Downloaded from apache.snapshots.https: https://repository.apache.org/content/repositories/snapshots/org/apache/myfaces/core/myfaces-api/maven-metadata.xml (653 B at 1.1 kB/s)
[INFO] Uploading to apache.snapshots.https: https://repository.apache.org/content/repositories/snapshots/org/apache/myfaces/core/myfaces-api/3.0.0-SNAPSHOT/maven-metadata.xml
[INFO] Uploaded to apache.snapshots.https: https://repository.apache.org/content/repositories/snapshots/org/apache/myfaces/core/myfaces-api/3.0.0-SNAPSHOT/maven-metadata.xml (1.2 kB at 986 B/s)
[INFO] Uploading to apache.snapshots.https: https://repository.apache.org/content/repositories/snapshots/org/apache/myfaces/core/myfaces-api/maven-metadata.xml
[INFO] Uploaded to apache.snapshots.https: https://repository.apache.org/content/repositories/snapshots/org/apache/myfaces/core/myfaces-api/maven-metadata.xml (653 B at 538 B/s)
[INFO] Uploading to apache.snapshots.https: https://repository.apache.org/content/repositories/snapshots/org/apache/myfaces/core/myfaces-api/3.0.0-SNAPSHOT/myfaces-api-3.0.0-20181020.181338-15-sources.jar
[INFO] Uploaded to apache.snapshots.https: https://repository.apache.org/content/repositories/snapshots/org/apache/myfaces/core/myfaces-api/3.0.0-SNAPSHOT/myfaces-api-3.0.0-20181020.181338-15-sources.jar (972 kB at 543 kB/s)
[INFO] Uploading to apache.snapshots.https: https://repository.apache.org/content/repositories/snapshots/org/apache/myfaces/core/myfaces-api/3.0.0-SNAPSHOT/maven-metadata.xml
[INFO] Uploaded to apache.snapshots.https: https://repository.apache.org/content/repositories/snapshots/org/apache/myfaces/core/myfaces-api/3.0.0-SNAPSHOT/maven-metadata.xml (1.2 kB at 1.0 kB/s)
[INFO] Uploading to apache.snapshots.https: https://repository.apache.org/content/repositories/snapshots/org/apache/myfaces/core/myfaces-api/3.0.0-SNAPSHOT/myfaces-api-3.0.0-20181020.181338-15-tests.jar
[INFO] Uploaded to apache.snapshots.https: https://repository.apache.org/content/repositories/snapshots/org/apache/myfaces/core/myfaces-api/3.0.0-SNAPSHOT/myfaces-api-3.0.0-20181020.181338-15-tests.jar (12 kB at 11 kB/s)
[INFO] Uploading to apache.snapshots.https: https://repository.apache.org/content/repositories/snapshots/org/apache/myfaces/core/myfaces-api/3.0.0-SNAPSHOT/maven-metadata.xml
[INFO] Uploaded to apache.snapshots.https: https://repository.apache.org/content/repositories/snapshots/org/apache/myfaces/core/myfaces-api/3.0.0-SNAPSHOT/maven-metadata.xml (1.2 kB at 1.0 kB/s)
[INFO] Uploading to apache.snapshots.https: https://repository.apache.org/content/repositories/snapshots/org/apache/myfaces/core/myfaces-api/3.0.0-SNAPSHOT/myfaces-api-3.0.0-20181020.181338-15-sources.jar
[INFO] Uploaded to apache.snapshots.https: https://repository.apache.org/content/repositories/snapshots/org/apache/myfaces/core/myfaces-api/3.0.0-SNAPSHOT/myfaces-api-3.0.0-20181020.181338-15-sources.jar (972 kB at 551 kB/s)
[INFO] Uploading to apache.snapshots.https: https://repository.apache.org/content/repositories/snapshots/org/apache/myfaces/core/myfaces-api/3.0.0-SNAPSHOT/maven-metadata.xml
[INFO] Uploaded to apache.snapshots.https: https://repository.apache.org/content/repositories/snapshots/org/apache/myfaces/core/myfaces-api/3.0.0-SNAPSHOT/maven-metadata.xml (1.2 kB at 1.1 kB/s)
[INFO] Uploading to apache.snapshots.https: https://repository.apache.org/content/repositories/snapshots/org/apache/myfaces/core/myfaces-api/3.0.0-SNAPSHOT/myfaces-api-3.0.0-20181020.181338-15-tests.jar
[INFO] Uploaded to apache.snapshots.https: https://repository.apache.org/content/repositories/snapshots/org/apache/myfaces/core/myfaces-api/3.0.0-SNAPSHOT/myfaces-api-3.0.0-20181020.181338-15-tests.jar (12 kB at 10 kB/s)
[INFO] Uploading to apache.snapshots.https: https://repository.apache.org/content/repositories/snapshots/org/apache/myfaces/core/myfaces-api/3.0.0-SNAPSHOT/maven-metadata.xml
[INFO] Uploaded to apache.snapshots.https: https://repository.apache.org/content/repositories/snapshots/org/apache/myfaces/core/myfaces-api/3.0.0-SNAPSHOT/maven-metadata.xml (1.2 kB at 1.1 kB/s)
[INFO] 
[INFO] ------------------------------------------------------------------------
[INFO] Building Apache MyFaces Core 3.0 - Impl 3.0.0-SNAPSHOT
[INFO] ------------------------------------------------------------------------
[WARNING] The POM for org.apache.myfaces.test:myfaces-test30:jar:1.0.9-SNAPSHOT is missing, no dependency information available
[INFO] ------------------------------------------------------------------------
[INFO] Reactor Summary:
[INFO] 
[INFO] Apache MyFaces Core 3.0 - Parent ................... SUCCESS [ 17.759 s]
[INFO] Apache MyFaces Core 3.0 - API ...................... SUCCESS [01:08 min]
[INFO] Apache MyFaces Core 3.0 - Impl ..................... FAILURE [  0.276 s]
[INFO] Apache MyFaces Core 3.0 - OSGi Bundle .............. SKIPPED
[INFO] Apache MyFaces Core 3.0 ............................ SKIPPED
[INFO] ------------------------------------------------------------------------
[INFO] BUILD FAILURE
[INFO] ------------------------------------------------------------------------
[INFO] Total time: 01:36 min
[INFO] Finished at: 2018-10-20T11:13:59-07:00
[INFO] Final Memory: 74M/744M
[INFO] ------------------------------------------------------------------------
[ERROR] Failed to execute goal on project myfaces-impl: Could not resolve dependencies for project org.apache.myfaces.core:myfaces-impl:jar:3.0.0-SNAPSHOT: Failure to find org.apache.myfaces.test:myfaces-test30:jar:1.0.9-SNAPSHOT in http://repository.apache.org/snapshots/ was cached in the local repository, resolution will not be reattempted until the update interval of apache-snapshots has elapsed or updates are forced -> [Help 1]
[ERROR] 
[ERROR] To see the full stack trace of the errors, re-run Maven with the -e switch.
[ERROR] Re-run Maven using the -X switch to enable full debug logging.
[ERROR] 
[ERROR] For more information about the errors and possible solutions, please read the following articles:
[ERROR] [Help 1] http://cwiki.apache.org/confluence/display/MAVEN/DependencyResolutionException
[ERROR] 
[ERROR] After correcting the problems, you can resume the build with the command
[ERROR]   mvn <goals> -rf :myfaces-impl
[JENKINS] Archiving F:\jenkins\jenkins-slave\workspace\myfaces-current23\api\pom.xml to org.apache.myfaces.core/myfaces-api/3.0.0-SNAPSHOT/myfaces-api-3.0.0-SNAPSHOT.pom
[JENKINS] Archiving F:\jenkins\jenkins-slave\workspace\myfaces-current23\api\target\myfaces-api-3.0.0-SNAPSHOT.jar to org.apache.myfaces.core/myfaces-api/3.0.0-20181020.181338-15/myfaces-api-3.0.0-20181020.181338-15.jar
[JENKINS] Archiving F:\jenkins\jenkins-slave\workspace\myfaces-current23\api\target\myfaces-api-3.0.0-SNAPSHOT-sources.jar to org.apache.myfaces.core/myfaces-api/3.0.0-20181020.181338-15/myfaces-api-3.0.0-20181020.181338-15-sources.jar
[JENKINS] Archiving F:\jenkins\jenkins-slave\workspace\myfaces-current23\api\target\myfaces-api-3.0.0-SNAPSHOT-tests.jar to org.apache.myfaces.core/myfaces-api/3.0.0-20181020.181338-15/myfaces-api-3.0.0-20181020.181338-15-tests.jar
[Fast Archiver] Compressed 2.22 MB of artifacts by 29.5% relative to #355
[JENKINS] Archiving F:\jenkins\jenkins-slave\workspace\myfaces-current23\impl\pom.xml to org.apache.myfaces.core/myfaces-impl/3.0.0-SNAPSHOT/myfaces-impl-3.0.0-SNAPSHOT.pom
[JENKINS] Archiving F:\jenkins\jenkins-slave\workspace\myfaces-current23\bundle\pom.xml to org.apache.myfaces.core/myfaces-bundle/3.0.0-SNAPSHOT/myfaces-bundle-3.0.0-SNAPSHOT.pom
[JENKINS] Archiving <https://builds.apache.org/job/myfaces-current23/ws/pom.xml> to org.apache.myfaces.core/myfaces-core-module/3.0.0-SNAPSHOT/myfaces-core-module-3.0.0-SNAPSHOT.pom
[JENKINS] Archiving F:\jenkins\jenkins-slave\workspace\myfaces-current23\parent\pom.xml to org.apache.myfaces.core/myfaces-core-project/3.0.0-SNAPSHOT/myfaces-core-project-3.0.0-SNAPSHOT.pom
[JENKINS] Archiving F:\jenkins\jenkins-slave\workspace\myfaces-current23\parent\target\myfaces-core-project-3.0.0-SNAPSHOT-site.xml to org.apache.myfaces.core/myfaces-core-project/3.0.0-20181020.181235-20/myfaces-core-project-3.0.0-20181020.181235-20-site.xml
Sending e-mails to: commits@myfaces.apache.org grantsmith@apache.org tandraschko@apache.org
channel stopped
Java HotSpot(TM) 64-Bit Server VM warning: ignoring option MaxPermSize=256m; support was removed in 8.0

Build failed in Jenkins: myfaces-current23 #355

Posted by Apache Jenkins Server <je...@builds.apache.org>.
See <https://builds.apache.org/job/myfaces-current23/355/display/redirect?page=changes>

Changes:

[tandraschko] merged impl-test to impl

------------------------------------------
[...truncated 121.22 KB...]
[INFO] Using 'eval' reduces the level of compression!
function (){var _r=window.eval ---> . <--- call(window,code);if(

[WARNING] [WARNING] Using 'eval' is not recommended...
[INFO] Using 'eval' reduces the level of compression!
_T[_e]||((_w.eval ---> && <--- (!_b.isBlackBerry||_b.isBlackBerry

[WARNING] [WARNING] Using 'eval' is not recommended...
[INFO] Using 'eval' reduces the level of compression!
_T[_e]||((_w.eval ---> ) <--- ?"_evalHeadAppendix":null);}if(

[WARNING] [WARNING] Using 'eval' is not recommended...
[INFO] Using 'eval' reduces the level of compression!
[_e]](c);}eval ---> . <--- call(window,c);return null

[WARNING] [WARNING] The variable _T has already been declared in the same scope...
,tv=parseFloat(dav);var _T ---> = <--- this;_T.browser={};

[WARNING] [WARNING] The variable tagNameStart has already been declared in the same scope...
,_tokenPos=0,_tokenForward=1,tagNameStart ---> = <--- (!tagNameStart)?BEGIN_TAG:tagNameStart;

[WARNING] [WARNING] The variable i has already been declared in the same scope...
&&params!=null){for(var i ---> = <--- 0,param;(param=params[

[WARNING] [WARNING] The variable param has already been declared in the same scope...
){for(var i=0,param ---> ; <--- (param=params[i]);

[WARNING] [WARNING] The symbol assigned is declared but is apparently never used.
This code can probably be written in a more efficient way.
}:function (){};var assigned ---> = <--- true;}if("function"!=typeof newCls

[WARNING] [WARNING] The symbol found is declared but is apparently never used.
This code can probably be written in a more efficient way.
obj,finalAttr,value);}var found ---> = <--- false;var prefix=(value)?

[WARNING] [WARNING] The symbol _tokenPos is declared but is apparently never used.
This code can probably be written in a more efficient way.
=-1,_contentEnd=-1,_tokenPos ---> = <--- 0,_tokenForward=1,tagNameStart=(

[WARNING] [WARNING] The symbol _tokenForward is declared but is apparently never used.
This code can probably be written in a more efficient way.
_contentEnd=-1,_tokenPos=0,_tokenForward ---> = <--- 1,tagNameStart=(!tagNameStart)?

[WARNING] [WARNING] The symbol _RT is declared but is apparently never used.
This code can probably be written in a more efficient way.
{var _Lang=this._Lang;var _RT ---> = <--- this._RT;var _Dom=this.

[WARNING] [WARNING] The symbol _Dom is declared but is apparently never used.
This code can probably be written in a more efficient way.
;var _RT=this._RT;var _Dom ---> = <--- this._Dom;try{var scopeThis=

[WARNING] [WARNING] The symbol _AJAXUTIL is declared but is apparently never used.
This code can probably be written in a more efficient way.
},getFormData:function (){var _AJAXUTIL ---> = <--- this._AJAXUTIL,myfacesOptions=this._context

[WARNING] [WARNING] The symbol myfacesOptions is declared but is apparently never used.
This code can probably be written in a more efficient way.
){var _AJAXUTIL=this._AJAXUTIL,myfacesOptions ---> = <--- this._context.myfaces;return this.

[WARNING] [WARNING] The symbol _Lang is declared but is apparently never used.
This code can probably be written in a more efficient way.
,fixViewStates:function (context){var _Lang ---> = <--- this._Lang;var mfInternal=context.

[WARNING] [WARNING] The symbol _Lang is declared but is apparently never used.
This code can probably be written in a more efficient way.
:function (context,theForm){var _Lang ---> = <--- this._Lang;var mfInternal=context.

[WARNING] [WARNING] The symbol prefix is declared but is apparently never used.
This code can probably be written in a more efficient way.
(context,value,identifier){var prefix ---> = <--- this._getPrefix(context);var sourceForm

[WARNING] [WARNING] The symbol self is declared but is apparently never used.
This code can probably be written in a more efficient way.
};var clientIdsByTokens={};var self ---> = <--- {};function Socket(channelToken,url
[INFO] jsf-minimal.js (342,554 bytes) ............................. compressed at 73%
[INFO] Object.js (3,563 bytes) .................................... compressed at 67%
[INFO] _EndImpl.js (1,552 bytes) .................................. compressed at 84%
[INFO] _ExtRuntime.js (7,643 bytes) ............................... compressed at 78%
[INFO] _RuntimeQuirks.js (2,130 bytes) ............................ compressed at 78%
[INFO] _StartImpl.js (1,729 bytes) ................................ compressed at 75%
[INFO] Messages.js (5,777 bytes) .................................. compressed at 47%
[INFO] Messages_de.js (5,949 bytes) ............................... compressed at 44%
[INFO] Messages_es.js (5,488 bytes) ............................... compressed at 39%
[INFO] Messages_fr.js (5,613 bytes) ............................... compressed at 41%
[INFO] Messages_it.js (5,179 bytes) ............................... compressed at 39%
[INFO] Messages_nl.js (5,196 bytes) ............................... compressed at 40%
[INFO] Messages_ru.js (5,935 bytes) ............................... compressed at 34%
[INFO] Messages_zh_CN.js (5,758 bytes) ............................ compressed at 52%
[INFO] Messages_zh_HK.js (6,090 bytes) ............................ compressed at 55%
[INFO] Messages_zh_TW.js (6,499 bytes) ............................ compressed at 58%
[INFO] BaseRequest.js (4,813 bytes) ............................... compressed at 82%
[INFO] FormData.js (2,588 bytes) .................................. compressed at 71%
[INFO] IFrame.js (12,067 bytes) ................................... compressed at 70%
[INFO] Xhr1.js (6,589 bytes) ...................................... compressed at 60%
[INFO] XhrConst.js (1,469 bytes) .................................. compressed at 84%
[INFO] _ExtAjaxRequest.js (2,726 bytes) ........................... compressed at 77%
[INFO] _ExtTransport.js (8,327 bytes) ............................. compressed at 85%

[WARNING] [WARNING] Found an undeclared symbol: jsf
,"partial/ajax");var viewState=decodeURIComponent(jsf ---> . <--- getViewState(this._sourceForm));viewState

[WARNING] [WARNING] The symbol jsf is declared but is apparently never used.
This code can probably be written in a more efficient way.
,"partial/ajax");var viewState=decodeURIComponent(jsf ---> . <--- getViewState(this._sourceForm));viewState
[INFO] _IFrameRequest.js (2,974 bytes) ............................ compressed at 74%
[INFO] _PartialSubmitUtils.js (5,264 bytes) ....................... compressed at 77%
[INFO] _DomExperimental.js (1,629 bytes) .......................... compressed at 75%
[INFO] _DomQuirks.js (25,781 bytes) ............................... compressed at 76%
[INFO] _ExtDom.js (13,061 bytes) .................................. compressed at 74%
[INFO] _ExtLang.js (4,363 bytes) .................................. compressed at 74%
[INFO] _LangQuirks.js (8,389 bytes) ............................... compressed at 77%
[INFO] _Logging.js (4,749 bytes) .................................. compressed at 66%
[INFO] ------------------------------------------------------------------------------
[INFO] compression saved 3,168 bytes
[INFO] 
[INFO] --- maven-compiler-plugin:3.6.1:compile (default-compile) @ myfaces-api ---
[INFO] Nothing to compile - all classes are up to date
[INFO] 
[INFO] --- maven-bundle-plugin:3.0.1:manifest (bundle-manifest) @ myfaces-api ---
[INFO] 
[INFO] --- maven-resources-plugin:2.5:testResources (default-testResources) @ myfaces-api ---
[debug] execute contextualize
[INFO] Using 'UTF-8' encoding to copy filtered resources.
[INFO] skip non existing resourceDirectory F:\jenkins\jenkins-slave\workspace\myfaces-current23\api\src\test\resources
[INFO] Copying 3 resources
[INFO] Copying 3 resources
[INFO] 
[INFO] --- maven-compiler-plugin:3.6.1:testCompile (default-testCompile) @ myfaces-api ---
[INFO] No sources to compile
[INFO] 
[INFO] --- maven-surefire-plugin:2.16:test (default-test) @ myfaces-api ---
[INFO] Skipping execution of surefire because it has already been run for this configuration
[JENKINS] Recording test results
[INFO] 
[INFO] --- maven-surefire-plugin:2.16:test (default) @ myfaces-api ---
[INFO] Skipping execution of surefire because it has already been run for this configuration
[JENKINS] Recording test results
[INFO] 
[INFO] --- maven-jar-plugin:2.2:jar (default-jar) @ myfaces-api ---
[INFO] Building jar: F:\jenkins\jenkins-slave\workspace\myfaces-current23\api\target\myfaces-api-3.0.0-SNAPSHOT.jar
[INFO] 
[INFO] >>> maven-source-plugin:2.2.1:jar (attach-source) > generate-sources @ myfaces-api >>>
[INFO] 
[INFO] --- maven-enforcer-plugin:1.4.1:enforce (enforce-maven-version) @ myfaces-api ---
[INFO] 
[INFO] --- build-helper-maven-plugin:1.9.1:parse-version (parse-version) @ myfaces-api ---
[INFO] 
[INFO] --- myfaces-builder-plugin:1.0.10:build-metadata (default) @ myfaces-api ---
[INFO] model is up to date
[INFO] 
[INFO] --- myfaces-builder-plugin:1.0.10:make-components (makecomp) @ myfaces-api ---
[INFO] generated component files are up to date
[WARNING] Failed to getClass for org.apache.maven.plugin.source.SourceJarMojo
[INFO] 
[INFO] <<< maven-source-plugin:2.2.1:jar (attach-source) < generate-sources @ myfaces-api <<<
[INFO] 
[INFO] 
[INFO] --- maven-source-plugin:2.2.1:jar (attach-source) @ myfaces-api ---
[INFO] Building jar: F:\jenkins\jenkins-slave\workspace\myfaces-current23\api\target\myfaces-api-3.0.0-SNAPSHOT-sources.jar
[INFO] 
[INFO] --- maven-site-plugin:3.3:attach-descriptor (attach-descriptor) @ myfaces-api ---
[INFO] 
[INFO] --- maven-jar-plugin:2.2:test-jar (default) @ myfaces-api ---
[INFO] Building jar: F:\jenkins\jenkins-slave\workspace\myfaces-current23\api\target\myfaces-api-3.0.0-SNAPSHOT-tests.jar
[INFO] 
[INFO] --- maven-checkstyle-plugin:2.17:check (verify-style) @ myfaces-api ---
[INFO] Starting audit...
Audit done.
[INFO] 
[INFO] --- maven-install-plugin:2.5.2:install (default-install) @ myfaces-api ---
[INFO] Installing F:\jenkins\jenkins-slave\workspace\myfaces-current23\api\target\myfaces-api-3.0.0-SNAPSHOT.jar to f:\jenkins\jenkins-slave\maven-repositories\1\org\apache\myfaces\core\myfaces-api\3.0.0-SNAPSHOT\myfaces-api-3.0.0-SNAPSHOT.jar
[INFO] Installing F:\jenkins\jenkins-slave\workspace\myfaces-current23\api\pom.xml to f:\jenkins\jenkins-slave\maven-repositories\1\org\apache\myfaces\core\myfaces-api\3.0.0-SNAPSHOT\myfaces-api-3.0.0-SNAPSHOT.pom
[INFO] Installing F:\jenkins\jenkins-slave\workspace\myfaces-current23\api\target\myfaces-api-3.0.0-SNAPSHOT-sources.jar to f:\jenkins\jenkins-slave\maven-repositories\1\org\apache\myfaces\core\myfaces-api\3.0.0-SNAPSHOT\myfaces-api-3.0.0-SNAPSHOT-sources.jar
[INFO] Installing F:\jenkins\jenkins-slave\workspace\myfaces-current23\api\target\myfaces-api-3.0.0-SNAPSHOT-tests.jar to f:\jenkins\jenkins-slave\maven-repositories\1\org\apache\myfaces\core\myfaces-api\3.0.0-SNAPSHOT\myfaces-api-3.0.0-SNAPSHOT-tests.jar
[INFO] Installing F:\jenkins\jenkins-slave\workspace\myfaces-current23\api\target\myfaces-api-3.0.0-SNAPSHOT-sources.jar to f:\jenkins\jenkins-slave\maven-repositories\1\org\apache\myfaces\core\myfaces-api\3.0.0-SNAPSHOT\myfaces-api-3.0.0-SNAPSHOT-sources.jar
[INFO] Installing F:\jenkins\jenkins-slave\workspace\myfaces-current23\api\target\myfaces-api-3.0.0-SNAPSHOT-tests.jar to f:\jenkins\jenkins-slave\maven-repositories\1\org\apache\myfaces\core\myfaces-api\3.0.0-SNAPSHOT\myfaces-api-3.0.0-SNAPSHOT-tests.jar
[INFO] 
[INFO] --- maven-deploy-plugin:2.8.2:deploy (default-deploy) @ myfaces-api ---
[INFO] Downloading from apache.snapshots.https: https://repository.apache.org/content/repositories/snapshots/org/apache/myfaces/core/myfaces-api/3.0.0-SNAPSHOT/maven-metadata.xml
[INFO] Downloaded from apache.snapshots.https: https://repository.apache.org/content/repositories/snapshots/org/apache/myfaces/core/myfaces-api/3.0.0-SNAPSHOT/maven-metadata.xml (1.2 kB at 2.1 kB/s)
[INFO] Uploading to apache.snapshots.https: https://repository.apache.org/content/repositories/snapshots/org/apache/myfaces/core/myfaces-api/3.0.0-SNAPSHOT/myfaces-api-3.0.0-20181020.175023-14.jar
[INFO] Uploaded to apache.snapshots.https: https://repository.apache.org/content/repositories/snapshots/org/apache/myfaces/core/myfaces-api/3.0.0-SNAPSHOT/myfaces-api-3.0.0-20181020.175023-14.jar (1.3 MB at 758 kB/s)
[INFO] Uploading to apache.snapshots.https: https://repository.apache.org/content/repositories/snapshots/org/apache/myfaces/core/myfaces-api/3.0.0-SNAPSHOT/myfaces-api-3.0.0-20181020.175023-14.pom
[INFO] Uploaded to apache.snapshots.https: https://repository.apache.org/content/repositories/snapshots/org/apache/myfaces/core/myfaces-api/3.0.0-SNAPSHOT/myfaces-api-3.0.0-20181020.175023-14.pom (34 kB at 26 kB/s)
[INFO] Downloading from apache.snapshots.https: https://repository.apache.org/content/repositories/snapshots/org/apache/myfaces/core/myfaces-api/maven-metadata.xml
[INFO] Downloaded from apache.snapshots.https: https://repository.apache.org/content/repositories/snapshots/org/apache/myfaces/core/myfaces-api/maven-metadata.xml (653 B at 1.1 kB/s)
[INFO] Uploading to apache.snapshots.https: https://repository.apache.org/content/repositories/snapshots/org/apache/myfaces/core/myfaces-api/3.0.0-SNAPSHOT/maven-metadata.xml
[INFO] Uploaded to apache.snapshots.https: https://repository.apache.org/content/repositories/snapshots/org/apache/myfaces/core/myfaces-api/3.0.0-SNAPSHOT/maven-metadata.xml (1.2 kB at 1.1 kB/s)
[INFO] Uploading to apache.snapshots.https: https://repository.apache.org/content/repositories/snapshots/org/apache/myfaces/core/myfaces-api/maven-metadata.xml
[INFO] Uploaded to apache.snapshots.https: https://repository.apache.org/content/repositories/snapshots/org/apache/myfaces/core/myfaces-api/maven-metadata.xml (653 B at 563 B/s)
[INFO] Uploading to apache.snapshots.https: https://repository.apache.org/content/repositories/snapshots/org/apache/myfaces/core/myfaces-api/3.0.0-SNAPSHOT/myfaces-api-3.0.0-20181020.175023-14-sources.jar
[INFO] Uploaded to apache.snapshots.https: https://repository.apache.org/content/repositories/snapshots/org/apache/myfaces/core/myfaces-api/3.0.0-SNAPSHOT/myfaces-api-3.0.0-20181020.175023-14-sources.jar (972 kB at 568 kB/s)
[INFO] Uploading to apache.snapshots.https: https://repository.apache.org/content/repositories/snapshots/org/apache/myfaces/core/myfaces-api/3.0.0-SNAPSHOT/maven-metadata.xml
[INFO] Uploaded to apache.snapshots.https: https://repository.apache.org/content/repositories/snapshots/org/apache/myfaces/core/myfaces-api/3.0.0-SNAPSHOT/maven-metadata.xml (1.2 kB at 1.1 kB/s)
[INFO] Uploading to apache.snapshots.https: https://repository.apache.org/content/repositories/snapshots/org/apache/myfaces/core/myfaces-api/3.0.0-SNAPSHOT/myfaces-api-3.0.0-20181020.175023-14-tests.jar
[INFO] Uploaded to apache.snapshots.https: https://repository.apache.org/content/repositories/snapshots/org/apache/myfaces/core/myfaces-api/3.0.0-SNAPSHOT/myfaces-api-3.0.0-20181020.175023-14-tests.jar (12 kB at 11 kB/s)
[INFO] Uploading to apache.snapshots.https: https://repository.apache.org/content/repositories/snapshots/org/apache/myfaces/core/myfaces-api/3.0.0-SNAPSHOT/maven-metadata.xml
[INFO] Uploaded to apache.snapshots.https: https://repository.apache.org/content/repositories/snapshots/org/apache/myfaces/core/myfaces-api/3.0.0-SNAPSHOT/maven-metadata.xml (1.2 kB at 1.1 kB/s)
[INFO] Uploading to apache.snapshots.https: https://repository.apache.org/content/repositories/snapshots/org/apache/myfaces/core/myfaces-api/3.0.0-SNAPSHOT/myfaces-api-3.0.0-20181020.175023-14-sources.jar
[INFO] Uploaded to apache.snapshots.https: https://repository.apache.org/content/repositories/snapshots/org/apache/myfaces/core/myfaces-api/3.0.0-SNAPSHOT/myfaces-api-3.0.0-20181020.175023-14-sources.jar (972 kB at 554 kB/s)
[INFO] Uploading to apache.snapshots.https: https://repository.apache.org/content/repositories/snapshots/org/apache/myfaces/core/myfaces-api/3.0.0-SNAPSHOT/maven-metadata.xml
[INFO] Uploaded to apache.snapshots.https: https://repository.apache.org/content/repositories/snapshots/org/apache/myfaces/core/myfaces-api/3.0.0-SNAPSHOT/maven-metadata.xml (1.2 kB at 1.0 kB/s)
[INFO] Uploading to apache.snapshots.https: https://repository.apache.org/content/repositories/snapshots/org/apache/myfaces/core/myfaces-api/3.0.0-SNAPSHOT/myfaces-api-3.0.0-20181020.175023-14-tests.jar
[INFO] Uploaded to apache.snapshots.https: https://repository.apache.org/content/repositories/snapshots/org/apache/myfaces/core/myfaces-api/3.0.0-SNAPSHOT/myfaces-api-3.0.0-20181020.175023-14-tests.jar (12 kB at 9.9 kB/s)
[INFO] Uploading to apache.snapshots.https: https://repository.apache.org/content/repositories/snapshots/org/apache/myfaces/core/myfaces-api/3.0.0-SNAPSHOT/maven-metadata.xml
[INFO] Uploaded to apache.snapshots.https: https://repository.apache.org/content/repositories/snapshots/org/apache/myfaces/core/myfaces-api/3.0.0-SNAPSHOT/maven-metadata.xml (1.2 kB at 1.0 kB/s)
[INFO] 
[INFO] ------------------------------------------------------------------------
[INFO] Building Apache MyFaces Core 3.0 - Impl 3.0.0-SNAPSHOT
[INFO] ------------------------------------------------------------------------
[WARNING] The POM for org.apache.myfaces.test:myfaces-test30:jar:1.0.9-SNAPSHOT is missing, no dependency information available
[INFO] ------------------------------------------------------------------------
[INFO] Reactor Summary:
[INFO] 
[INFO] Apache MyFaces Core 3.0 - Parent ................... SUCCESS [ 17.892 s]
[INFO] Apache MyFaces Core 3.0 - API ...................... SUCCESS [01:10 min]
[INFO] Apache MyFaces Core 3.0 - Impl ..................... FAILURE [  0.296 s]
[INFO] Apache MyFaces Core 3.0 - OSGi Bundle .............. SKIPPED
[INFO] Apache MyFaces Core 3.0 ............................ SKIPPED
[INFO] ------------------------------------------------------------------------
[INFO] BUILD FAILURE
[INFO] ------------------------------------------------------------------------
[INFO] Total time: 01:37 min
[INFO] Finished at: 2018-10-20T10:50:44-07:00
[INFO] Final Memory: 73M/684M
[INFO] ------------------------------------------------------------------------
[ERROR] Failed to execute goal on project myfaces-impl: Could not resolve dependencies for project org.apache.myfaces.core:myfaces-impl:jar:3.0.0-SNAPSHOT: Failure to find org.apache.myfaces.test:myfaces-test30:jar:1.0.9-SNAPSHOT in http://repository.apache.org/snapshots/ was cached in the local repository, resolution will not be reattempted until the update interval of apache-snapshots has elapsed or updates are forced -> [Help 1]
[ERROR] 
[ERROR] To see the full stack trace of the errors, re-run Maven with the -e switch.
[ERROR] Re-run Maven using the -X switch to enable full debug logging.
[ERROR] 
[ERROR] For more information about the errors and possible solutions, please read the following articles:
[ERROR] [Help 1] http://cwiki.apache.org/confluence/display/MAVEN/DependencyResolutionException
[ERROR] 
[ERROR] After correcting the problems, you can resume the build with the command
[ERROR]   mvn <goals> -rf :myfaces-impl
[JENKINS] Archiving F:\jenkins\jenkins-slave\workspace\myfaces-current23\api\pom.xml to org.apache.myfaces.core/myfaces-api/3.0.0-SNAPSHOT/myfaces-api-3.0.0-SNAPSHOT.pom
[JENKINS] Archiving F:\jenkins\jenkins-slave\workspace\myfaces-current23\api\target\myfaces-api-3.0.0-SNAPSHOT.jar to org.apache.myfaces.core/myfaces-api/3.0.0-20181020.175023-14/myfaces-api-3.0.0-20181020.175023-14.jar
[JENKINS] Archiving F:\jenkins\jenkins-slave\workspace\myfaces-current23\api\target\myfaces-api-3.0.0-SNAPSHOT-sources.jar to org.apache.myfaces.core/myfaces-api/3.0.0-20181020.175023-14/myfaces-api-3.0.0-20181020.175023-14-sources.jar
[JENKINS] Archiving F:\jenkins\jenkins-slave\workspace\myfaces-current23\api\target\myfaces-api-3.0.0-SNAPSHOT-tests.jar to org.apache.myfaces.core/myfaces-api/3.0.0-20181020.175023-14/myfaces-api-3.0.0-20181020.175023-14-tests.jar
[Fast Archiver] Compressed 2.22 MB of artifacts by 29.5% relative to #354
[JENKINS] Archiving F:\jenkins\jenkins-slave\workspace\myfaces-current23\impl\pom.xml to org.apache.myfaces.core/myfaces-impl/3.0.0-SNAPSHOT/myfaces-impl-3.0.0-SNAPSHOT.pom
[JENKINS] Archiving F:\jenkins\jenkins-slave\workspace\myfaces-current23\bundle\pom.xml to org.apache.myfaces.core/myfaces-bundle/3.0.0-SNAPSHOT/myfaces-bundle-3.0.0-SNAPSHOT.pom
[JENKINS] Archiving <https://builds.apache.org/job/myfaces-current23/ws/pom.xml> to org.apache.myfaces.core/myfaces-core-module/3.0.0-SNAPSHOT/myfaces-core-module-3.0.0-SNAPSHOT.pom
[JENKINS] Archiving F:\jenkins\jenkins-slave\workspace\myfaces-current23\parent\pom.xml to org.apache.myfaces.core/myfaces-core-project/3.0.0-SNAPSHOT/myfaces-core-project-3.0.0-SNAPSHOT.pom
[JENKINS] Archiving F:\jenkins\jenkins-slave\workspace\myfaces-current23\parent\target\myfaces-core-project-3.0.0-SNAPSHOT-site.xml to org.apache.myfaces.core/myfaces-core-project/3.0.0-20181020.174917-19/myfaces-core-project-3.0.0-20181020.174917-19-site.xml
Sending e-mails to: commits@myfaces.apache.org grantsmith@apache.org tandraschko@apache.org
channel stopped
Java HotSpot(TM) 64-Bit Server VM warning: ignoring option MaxPermSize=256m; support was removed in 8.0

Build failed in Jenkins: myfaces-current23 #354

Posted by Apache Jenkins Server <je...@builds.apache.org>.
See <https://builds.apache.org/job/myfaces-current23/354/display/redirect?page=changes>

Changes:

[tandraschko] merged shared and shared public to impl

------------------------------------------
[...truncated 122.90 KB...]
_T[_e]||((_w.eval ---> ) <--- ?"_evalHeadAppendix":null);}if(

[WARNING] [WARNING] Using 'eval' is not recommended...
[INFO] Using 'eval' reduces the level of compression!
[_e]](c);}eval ---> . <--- call(window,c);return null

[WARNING] [WARNING] The variable _T has already been declared in the same scope...
,tv=parseFloat(dav);var _T ---> = <--- this;_T.browser={};

[WARNING] [WARNING] The variable tagNameStart has already been declared in the same scope...
,_tokenPos=0,_tokenForward=1,tagNameStart ---> = <--- (!tagNameStart)?BEGIN_TAG:tagNameStart;

[WARNING] [WARNING] The variable i has already been declared in the same scope...
&&params!=null){for(var i ---> = <--- 0,param;(param=params[

[WARNING] [WARNING] The variable param has already been declared in the same scope...
){for(var i=0,param ---> ; <--- (param=params[i]);

[WARNING] [WARNING] The symbol assigned is declared but is apparently never used.
This code can probably be written in a more efficient way.
}:function (){};var assigned ---> = <--- true;}if("function"!=typeof newCls

[WARNING] [WARNING] The symbol found is declared but is apparently never used.
This code can probably be written in a more efficient way.
obj,finalAttr,value);}var found ---> = <--- false;var prefix=(value)?

[WARNING] [WARNING] The symbol _tokenPos is declared but is apparently never used.
This code can probably be written in a more efficient way.
=-1,_contentEnd=-1,_tokenPos ---> = <--- 0,_tokenForward=1,tagNameStart=(

[WARNING] [WARNING] The symbol _tokenForward is declared but is apparently never used.
This code can probably be written in a more efficient way.
_contentEnd=-1,_tokenPos=0,_tokenForward ---> = <--- 1,tagNameStart=(!tagNameStart)?

[WARNING] [WARNING] The symbol _RT is declared but is apparently never used.
This code can probably be written in a more efficient way.
{var _Lang=this._Lang;var _RT ---> = <--- this._RT;var _Dom=this.

[WARNING] [WARNING] The symbol _Dom is declared but is apparently never used.
This code can probably be written in a more efficient way.
;var _RT=this._RT;var _Dom ---> = <--- this._Dom;try{var scopeThis=

[WARNING] [WARNING] The symbol _AJAXUTIL is declared but is apparently never used.
This code can probably be written in a more efficient way.
},getFormData:function (){var _AJAXUTIL ---> = <--- this._AJAXUTIL,myfacesOptions=this._context

[WARNING] [WARNING] The symbol myfacesOptions is declared but is apparently never used.
This code can probably be written in a more efficient way.
){var _AJAXUTIL=this._AJAXUTIL,myfacesOptions ---> = <--- this._context.myfaces;return this.

[WARNING] [WARNING] The symbol _Lang is declared but is apparently never used.
This code can probably be written in a more efficient way.
,fixViewStates:function (context){var _Lang ---> = <--- this._Lang;var mfInternal=context.

[WARNING] [WARNING] The symbol _Lang is declared but is apparently never used.
This code can probably be written in a more efficient way.
:function (context,theForm){var _Lang ---> = <--- this._Lang;var mfInternal=context.

[WARNING] [WARNING] The symbol prefix is declared but is apparently never used.
This code can probably be written in a more efficient way.
(context,value,identifier){var prefix ---> = <--- this._getPrefix(context);var sourceForm

[WARNING] [WARNING] The symbol self is declared but is apparently never used.
This code can probably be written in a more efficient way.
};var clientIdsByTokens={};var self ---> = <--- {};function Socket(channelToken,url
[INFO] jsf-minimal.js (342,554 bytes) ............................. compressed at 73%
[INFO] Object.js (3,563 bytes) .................................... compressed at 67%
[INFO] _EndImpl.js (1,552 bytes) .................................. compressed at 84%
[INFO] _ExtRuntime.js (7,643 bytes) ............................... compressed at 78%
[INFO] _RuntimeQuirks.js (2,130 bytes) ............................ compressed at 78%
[INFO] _StartImpl.js (1,729 bytes) ................................ compressed at 75%
[INFO] Messages.js (5,777 bytes) .................................. compressed at 47%
[INFO] Messages_de.js (5,949 bytes) ............................... compressed at 44%
[INFO] Messages_es.js (5,488 bytes) ............................... compressed at 39%
[INFO] Messages_fr.js (5,613 bytes) ............................... compressed at 41%
[INFO] Messages_it.js (5,179 bytes) ............................... compressed at 39%
[INFO] Messages_nl.js (5,196 bytes) ............................... compressed at 40%
[INFO] Messages_ru.js (5,935 bytes) ............................... compressed at 34%
[INFO] Messages_zh_CN.js (5,758 bytes) ............................ compressed at 52%
[INFO] Messages_zh_HK.js (6,090 bytes) ............................ compressed at 55%
[INFO] Messages_zh_TW.js (6,499 bytes) ............................ compressed at 58%
[INFO] BaseRequest.js (4,813 bytes) ............................... compressed at 82%
[INFO] FormData.js (2,588 bytes) .................................. compressed at 71%
[INFO] IFrame.js (12,067 bytes) ................................... compressed at 70%
[INFO] Xhr1.js (6,589 bytes) ...................................... compressed at 60%
[INFO] XhrConst.js (1,469 bytes) .................................. compressed at 84%
[INFO] _ExtAjaxRequest.js (2,726 bytes) ........................... compressed at 77%
[INFO] _ExtTransport.js (8,327 bytes) ............................. compressed at 85%

[WARNING] [WARNING] Found an undeclared symbol: jsf
,"partial/ajax");var viewState=decodeURIComponent(jsf ---> . <--- getViewState(this._sourceForm));viewState

[WARNING] [WARNING] The symbol jsf is declared but is apparently never used.
This code can probably be written in a more efficient way.
,"partial/ajax");var viewState=decodeURIComponent(jsf ---> . <--- getViewState(this._sourceForm));viewState
[INFO] _IFrameRequest.js (2,974 bytes) ............................ compressed at 74%
[INFO] _PartialSubmitUtils.js (5,264 bytes) ....................... compressed at 77%
[INFO] _DomExperimental.js (1,629 bytes) .......................... compressed at 75%
[INFO] _DomQuirks.js (25,781 bytes) ............................... compressed at 76%
[INFO] _ExtDom.js (13,061 bytes) .................................. compressed at 74%
[INFO] _ExtLang.js (4,363 bytes) .................................. compressed at 74%
[INFO] _LangQuirks.js (8,389 bytes) ............................... compressed at 77%
[INFO] _Logging.js (4,749 bytes) .................................. compressed at 66%
[INFO] ------------------------------------------------------------------------------
[INFO] compression saved 3,168 bytes
[INFO] 
[INFO] --- maven-compiler-plugin:3.6.1:compile (default-compile) @ myfaces-api ---
[INFO] Nothing to compile - all classes are up to date
[INFO] 
[INFO] --- maven-bundle-plugin:3.0.1:manifest (bundle-manifest) @ myfaces-api ---
[INFO] 
[INFO] --- maven-resources-plugin:2.5:testResources (default-testResources) @ myfaces-api ---
[debug] execute contextualize
[INFO] Using 'UTF-8' encoding to copy filtered resources.
[INFO] skip non existing resourceDirectory F:\jenkins\jenkins-slave\workspace\myfaces-current23\api\src\test\resources
[INFO] Copying 3 resources
[INFO] Copying 3 resources
[INFO] 
[INFO] --- maven-compiler-plugin:3.6.1:testCompile (default-testCompile) @ myfaces-api ---
[INFO] No sources to compile
[INFO] 
[INFO] --- maven-surefire-plugin:2.16:test (default-test) @ myfaces-api ---
[INFO] Skipping execution of surefire because it has already been run for this configuration
[JENKINS] Recording test results
[INFO] 
[INFO] --- maven-surefire-plugin:2.16:test (default) @ myfaces-api ---
[INFO] Skipping execution of surefire because it has already been run for this configuration
[JENKINS] Recording test results
[INFO] 
[INFO] --- maven-jar-plugin:2.2:jar (default-jar) @ myfaces-api ---
[INFO] Building jar: F:\jenkins\jenkins-slave\workspace\myfaces-current23\api\target\myfaces-api-3.0.0-SNAPSHOT.jar
[INFO] 
[INFO] >>> maven-source-plugin:2.2.1:jar (attach-source) > generate-sources @ myfaces-api >>>
[INFO] 
[INFO] --- maven-enforcer-plugin:1.4.1:enforce (enforce-maven-version) @ myfaces-api ---
[INFO] 
[INFO] --- build-helper-maven-plugin:1.9.1:parse-version (parse-version) @ myfaces-api ---
[INFO] 
[INFO] --- myfaces-builder-plugin:1.0.10:build-metadata (default) @ myfaces-api ---
[INFO] model is up to date
[INFO] 
[INFO] --- myfaces-builder-plugin:1.0.10:make-components (makecomp) @ myfaces-api ---
[INFO] generated component files are up to date
[WARNING] Failed to getClass for org.apache.maven.plugin.source.SourceJarMojo
[INFO] 
[INFO] <<< maven-source-plugin:2.2.1:jar (attach-source) < generate-sources @ myfaces-api <<<
[INFO] 
[INFO] 
[INFO] --- maven-source-plugin:2.2.1:jar (attach-source) @ myfaces-api ---
[INFO] Building jar: F:\jenkins\jenkins-slave\workspace\myfaces-current23\api\target\myfaces-api-3.0.0-SNAPSHOT-sources.jar
[INFO] 
[INFO] --- maven-site-plugin:3.3:attach-descriptor (attach-descriptor) @ myfaces-api ---
[INFO] 
[INFO] --- maven-jar-plugin:2.2:test-jar (default) @ myfaces-api ---
[INFO] Building jar: F:\jenkins\jenkins-slave\workspace\myfaces-current23\api\target\myfaces-api-3.0.0-SNAPSHOT-tests.jar
[INFO] 
[INFO] --- maven-checkstyle-plugin:2.17:check (verify-style) @ myfaces-api ---
[INFO] Starting audit...
Audit done.
[INFO] 
[INFO] --- maven-install-plugin:2.5.2:install (default-install) @ myfaces-api ---
[INFO] Installing F:\jenkins\jenkins-slave\workspace\myfaces-current23\api\target\myfaces-api-3.0.0-SNAPSHOT.jar to f:\jenkins\jenkins-slave\maven-repositories\1\org\apache\myfaces\core\myfaces-api\3.0.0-SNAPSHOT\myfaces-api-3.0.0-SNAPSHOT.jar
[INFO] Installing F:\jenkins\jenkins-slave\workspace\myfaces-current23\api\pom.xml to f:\jenkins\jenkins-slave\maven-repositories\1\org\apache\myfaces\core\myfaces-api\3.0.0-SNAPSHOT\myfaces-api-3.0.0-SNAPSHOT.pom
[INFO] Installing F:\jenkins\jenkins-slave\workspace\myfaces-current23\api\target\myfaces-api-3.0.0-SNAPSHOT-sources.jar to f:\jenkins\jenkins-slave\maven-repositories\1\org\apache\myfaces\core\myfaces-api\3.0.0-SNAPSHOT\myfaces-api-3.0.0-SNAPSHOT-sources.jar
[INFO] Installing F:\jenkins\jenkins-slave\workspace\myfaces-current23\api\target\myfaces-api-3.0.0-SNAPSHOT-tests.jar to f:\jenkins\jenkins-slave\maven-repositories\1\org\apache\myfaces\core\myfaces-api\3.0.0-SNAPSHOT\myfaces-api-3.0.0-SNAPSHOT-tests.jar
[INFO] Installing F:\jenkins\jenkins-slave\workspace\myfaces-current23\api\target\myfaces-api-3.0.0-SNAPSHOT-sources.jar to f:\jenkins\jenkins-slave\maven-repositories\1\org\apache\myfaces\core\myfaces-api\3.0.0-SNAPSHOT\myfaces-api-3.0.0-SNAPSHOT-sources.jar
[INFO] Installing F:\jenkins\jenkins-slave\workspace\myfaces-current23\api\target\myfaces-api-3.0.0-SNAPSHOT-tests.jar to f:\jenkins\jenkins-slave\maven-repositories\1\org\apache\myfaces\core\myfaces-api\3.0.0-SNAPSHOT\myfaces-api-3.0.0-SNAPSHOT-tests.jar
[INFO] 
[INFO] --- maven-deploy-plugin:2.8.2:deploy (default-deploy) @ myfaces-api ---
[INFO] Downloading from apache.snapshots.https: https://repository.apache.org/content/repositories/snapshots/org/apache/myfaces/core/myfaces-api/3.0.0-SNAPSHOT/maven-metadata.xml
[INFO] Downloaded from apache.snapshots.https: https://repository.apache.org/content/repositories/snapshots/org/apache/myfaces/core/myfaces-api/3.0.0-SNAPSHOT/maven-metadata.xml (1.2 kB at 2.0 kB/s)
[INFO] Uploading to apache.snapshots.https: https://repository.apache.org/content/repositories/snapshots/org/apache/myfaces/core/myfaces-api/3.0.0-SNAPSHOT/myfaces-api-3.0.0-20181020.174037-13.jar
[INFO] Uploaded to apache.snapshots.https: https://repository.apache.org/content/repositories/snapshots/org/apache/myfaces/core/myfaces-api/3.0.0-SNAPSHOT/myfaces-api-3.0.0-20181020.174037-13.jar (1.3 MB at 710 kB/s)
[INFO] Uploading to apache.snapshots.https: https://repository.apache.org/content/repositories/snapshots/org/apache/myfaces/core/myfaces-api/3.0.0-SNAPSHOT/myfaces-api-3.0.0-20181020.174037-13.pom
[INFO] Uploaded to apache.snapshots.https: https://repository.apache.org/content/repositories/snapshots/org/apache/myfaces/core/myfaces-api/3.0.0-SNAPSHOT/myfaces-api-3.0.0-20181020.174037-13.pom (34 kB at 27 kB/s)
[INFO] Downloading from apache.snapshots.https: https://repository.apache.org/content/repositories/snapshots/org/apache/myfaces/core/myfaces-api/maven-metadata.xml
[INFO] Downloaded from apache.snapshots.https: https://repository.apache.org/content/repositories/snapshots/org/apache/myfaces/core/myfaces-api/maven-metadata.xml (653 B at 1.1 kB/s)
[INFO] Uploading to apache.snapshots.https: https://repository.apache.org/content/repositories/snapshots/org/apache/myfaces/core/myfaces-api/3.0.0-SNAPSHOT/maven-metadata.xml
[INFO] Uploaded to apache.snapshots.https: https://repository.apache.org/content/repositories/snapshots/org/apache/myfaces/core/myfaces-api/3.0.0-SNAPSHOT/maven-metadata.xml (1.2 kB at 1.0 kB/s)
[INFO] Uploading to apache.snapshots.https: https://repository.apache.org/content/repositories/snapshots/org/apache/myfaces/core/myfaces-api/maven-metadata.xml
[INFO] Uploaded to apache.snapshots.https: https://repository.apache.org/content/repositories/snapshots/org/apache/myfaces/core/myfaces-api/maven-metadata.xml (653 B at 569 B/s)
[INFO] Uploading to apache.snapshots.https: https://repository.apache.org/content/repositories/snapshots/org/apache/myfaces/core/myfaces-api/3.0.0-SNAPSHOT/myfaces-api-3.0.0-20181020.174037-13-sources.jar
[INFO] Uploaded to apache.snapshots.https: https://repository.apache.org/content/repositories/snapshots/org/apache/myfaces/core/myfaces-api/3.0.0-SNAPSHOT/myfaces-api-3.0.0-20181020.174037-13-sources.jar (972 kB at 576 kB/s)
[INFO] Uploading to apache.snapshots.https: https://repository.apache.org/content/repositories/snapshots/org/apache/myfaces/core/myfaces-api/3.0.0-SNAPSHOT/maven-metadata.xml
[INFO] Uploaded to apache.snapshots.https: https://repository.apache.org/content/repositories/snapshots/org/apache/myfaces/core/myfaces-api/3.0.0-SNAPSHOT/maven-metadata.xml (1.2 kB at 1.1 kB/s)
[INFO] Uploading to apache.snapshots.https: https://repository.apache.org/content/repositories/snapshots/org/apache/myfaces/core/myfaces-api/3.0.0-SNAPSHOT/myfaces-api-3.0.0-20181020.174037-13-tests.jar
[INFO] Uploaded to apache.snapshots.https: https://repository.apache.org/content/repositories/snapshots/org/apache/myfaces/core/myfaces-api/3.0.0-SNAPSHOT/myfaces-api-3.0.0-20181020.174037-13-tests.jar (12 kB at 10.0 kB/s)
[INFO] Uploading to apache.snapshots.https: https://repository.apache.org/content/repositories/snapshots/org/apache/myfaces/core/myfaces-api/3.0.0-SNAPSHOT/maven-metadata.xml
[INFO] Uploaded to apache.snapshots.https: https://repository.apache.org/content/repositories/snapshots/org/apache/myfaces/core/myfaces-api/3.0.0-SNAPSHOT/maven-metadata.xml (1.2 kB at 1.1 kB/s)
[INFO] Uploading to apache.snapshots.https: https://repository.apache.org/content/repositories/snapshots/org/apache/myfaces/core/myfaces-api/3.0.0-SNAPSHOT/myfaces-api-3.0.0-20181020.174037-13-sources.jar
[INFO] Uploaded to apache.snapshots.https: https://repository.apache.org/content/repositories/snapshots/org/apache/myfaces/core/myfaces-api/3.0.0-SNAPSHOT/myfaces-api-3.0.0-20181020.174037-13-sources.jar (972 kB at 549 kB/s)
[INFO] Uploading to apache.snapshots.https: https://repository.apache.org/content/repositories/snapshots/org/apache/myfaces/core/myfaces-api/3.0.0-SNAPSHOT/maven-metadata.xml
[INFO] Uploaded to apache.snapshots.https: https://repository.apache.org/content/repositories/snapshots/org/apache/myfaces/core/myfaces-api/3.0.0-SNAPSHOT/maven-metadata.xml (1.2 kB at 1.1 kB/s)
[INFO] Uploading to apache.snapshots.https: https://repository.apache.org/content/repositories/snapshots/org/apache/myfaces/core/myfaces-api/3.0.0-SNAPSHOT/myfaces-api-3.0.0-20181020.174037-13-tests.jar
[INFO] Uploaded to apache.snapshots.https: https://repository.apache.org/content/repositories/snapshots/org/apache/myfaces/core/myfaces-api/3.0.0-SNAPSHOT/myfaces-api-3.0.0-20181020.174037-13-tests.jar (12 kB at 9.9 kB/s)
[INFO] Uploading to apache.snapshots.https: https://repository.apache.org/content/repositories/snapshots/org/apache/myfaces/core/myfaces-api/3.0.0-SNAPSHOT/maven-metadata.xml
[INFO] Uploaded to apache.snapshots.https: https://repository.apache.org/content/repositories/snapshots/org/apache/myfaces/core/myfaces-api/3.0.0-SNAPSHOT/maven-metadata.xml (1.2 kB at 1.0 kB/s)
[INFO] 
[INFO] ------------------------------------------------------------------------
[INFO] Building Apache MyFaces Core 3.0 - Impl 3.0.0-SNAPSHOT
[INFO] ------------------------------------------------------------------------
[INFO] Downloading from tomcat: http://tomcat.apache.org/dev/dist/m2-repository/org/apache/myfaces/test/myfaces-test30/1.0.9-SNAPSHOT/maven-metadata.xml
[INFO] Downloading from Nexus: http://repository.apache.org/snapshots/org/apache/myfaces/test/myfaces-test30/1.0.9-SNAPSHOT/maven-metadata.xml
[INFO] Downloading from apache-snapshots: http://repository.apache.org/snapshots/org/apache/myfaces/test/myfaces-test30/1.0.9-SNAPSHOT/maven-metadata.xml
[INFO] Downloading from apache-snapshots: http://repository.apache.org/snapshots/org/apache/myfaces/test/myfaces-test30/1.0.9-SNAPSHOT/myfaces-test30-1.0.9-SNAPSHOT.pom
[INFO] Downloading from tomcat: http://tomcat.apache.org/dev/dist/m2-repository/org/apache/myfaces/test/myfaces-test30/1.0.9-SNAPSHOT/myfaces-test30-1.0.9-SNAPSHOT.pom
[WARNING] The POM for org.apache.myfaces.test:myfaces-test30:jar:1.0.9-SNAPSHOT is missing, no dependency information available
[INFO] Downloading from apache-snapshots: http://repository.apache.org/snapshots/org/apache/myfaces/test/myfaces-test30/1.0.9-SNAPSHOT/myfaces-test30-1.0.9-SNAPSHOT.jar
[INFO] Downloading from tomcat: http://tomcat.apache.org/dev/dist/m2-repository/org/apache/myfaces/test/myfaces-test30/1.0.9-SNAPSHOT/myfaces-test30-1.0.9-SNAPSHOT.jar
[INFO] ------------------------------------------------------------------------
[INFO] Reactor Summary:
[INFO] 
[INFO] Apache MyFaces Core 3.0 - Parent ................... SUCCESS [ 25.986 s]
[INFO] Apache MyFaces Core 3.0 - API ...................... SUCCESS [01:21 min]
[INFO] Apache MyFaces Core 3.0 - Impl ..................... FAILURE [  1.745 s]
[INFO] Apache MyFaces Core 3.0 - OSGi Bundle .............. SKIPPED
[INFO] Apache MyFaces Core 3.0 - Impl Test ................ SKIPPED
[INFO] Apache MyFaces Core 3.0 ............................ SKIPPED
[INFO] ------------------------------------------------------------------------
[INFO] BUILD FAILURE
[INFO] ------------------------------------------------------------------------
[INFO] Total time: 02:03 min
[INFO] Finished at: 2018-10-20T10:41:00-07:00
[INFO] Final Memory: 73M/691M
[INFO] ------------------------------------------------------------------------
[ERROR] Failed to execute goal on project myfaces-impl: Could not resolve dependencies for project org.apache.myfaces.core:myfaces-impl:jar:3.0.0-SNAPSHOT: Could not find artifact org.apache.myfaces.test:myfaces-test30:jar:1.0.9-SNAPSHOT in apache-snapshots (http://repository.apache.org/snapshots/) -> [Help 1]
[ERROR] 
[ERROR] To see the full stack trace of the errors, re-run Maven with the -e switch.
[ERROR] Re-run Maven using the -X switch to enable full debug logging.
[ERROR] 
[ERROR] For more information about the errors and possible solutions, please read the following articles:
[ERROR] [Help 1] http://cwiki.apache.org/confluence/display/MAVEN/DependencyResolutionException
[ERROR] 
[ERROR] After correcting the problems, you can resume the build with the command
[ERROR]   mvn <goals> -rf :myfaces-impl
[JENKINS] Archiving F:\jenkins\jenkins-slave\workspace\myfaces-current23\api\pom.xml to org.apache.myfaces.core/myfaces-api/3.0.0-SNAPSHOT/myfaces-api-3.0.0-SNAPSHOT.pom
[JENKINS] Archiving F:\jenkins\jenkins-slave\workspace\myfaces-current23\api\target\myfaces-api-3.0.0-SNAPSHOT.jar to org.apache.myfaces.core/myfaces-api/3.0.0-20181020.174037-13/myfaces-api-3.0.0-20181020.174037-13.jar
[JENKINS] Archiving F:\jenkins\jenkins-slave\workspace\myfaces-current23\api\target\myfaces-api-3.0.0-SNAPSHOT-sources.jar to org.apache.myfaces.core/myfaces-api/3.0.0-20181020.174037-13/myfaces-api-3.0.0-20181020.174037-13-sources.jar
[JENKINS] Archiving F:\jenkins\jenkins-slave\workspace\myfaces-current23\api\target\myfaces-api-3.0.0-SNAPSHOT-tests.jar to org.apache.myfaces.core/myfaces-api/3.0.0-20181020.174037-13/myfaces-api-3.0.0-20181020.174037-13-tests.jar
[Fast Archiver] Compressed 2.22 MB of artifacts by 29.5% relative to #353
[JENKINS] Archiving F:\jenkins\jenkins-slave\workspace\myfaces-current23\impl\pom.xml to org.apache.myfaces.core/myfaces-impl/3.0.0-SNAPSHOT/myfaces-impl-3.0.0-SNAPSHOT.pom
[JENKINS] Archiving F:\jenkins\jenkins-slave\workspace\myfaces-current23\bundle\pom.xml to org.apache.myfaces.core/myfaces-bundle/3.0.0-SNAPSHOT/myfaces-bundle-3.0.0-SNAPSHOT.pom
[JENKINS] Archiving <https://builds.apache.org/job/myfaces-current23/ws/pom.xml> to org.apache.myfaces.core/myfaces-core-module/3.0.0-SNAPSHOT/myfaces-core-module-3.0.0-SNAPSHOT.pom
[JENKINS] Archiving F:\jenkins\jenkins-slave\workspace\myfaces-current23\impl-test\pom.xml to org.apache.myfaces.core/myfaces-impl-test/3.0.0-SNAPSHOT/myfaces-impl-test-3.0.0-SNAPSHOT.pom
[JENKINS] Archiving F:\jenkins\jenkins-slave\workspace\myfaces-current23\parent\pom.xml to org.apache.myfaces.core/myfaces-core-project/3.0.0-SNAPSHOT/myfaces-core-project-3.0.0-SNAPSHOT.pom
[JENKINS] Archiving F:\jenkins\jenkins-slave\workspace\myfaces-current23\parent\target\myfaces-core-project-3.0.0-SNAPSHOT-site.xml to org.apache.myfaces.core/myfaces-core-project/3.0.0-20181020.173921-18/myfaces-core-project-3.0.0-20181020.173921-18-site.xml
Sending e-mails to: commits@myfaces.apache.org grantsmith@apache.org tandraschko@apache.org
channel stopped
Java HotSpot(TM) 64-Bit Server VM warning: ignoring option MaxPermSize=256m; support was removed in 8.0

Build failed in Jenkins: myfaces-current23 #353

Posted by Apache Jenkins Server <je...@builds.apache.org>.
See <https://builds.apache.org/job/myfaces-current23/353/display/redirect?page=changes>

Changes:

[tandraschko] first step to non-shaded-impl -> removed seperate oamSubmit.js support

------------------------------------------
[...truncated 124.03 KB...]
[WARNING] [WARNING] Using 'eval' is not recommended...
[INFO] Using 'eval' reduces the level of compression!
_T[_e]||((_w.eval ---> ) <--- ?"_evalHeadAppendix":null);}if(

[WARNING] [WARNING] Using 'eval' is not recommended...
[INFO] Using 'eval' reduces the level of compression!
[_e]](c);}eval ---> . <--- call(window,c);return null

[WARNING] [WARNING] The variable _T has already been declared in the same scope...
,tv=parseFloat(dav);var _T ---> = <--- this;_T.browser={};

[WARNING] [WARNING] The variable tagNameStart has already been declared in the same scope...
,_tokenPos=0,_tokenForward=1,tagNameStart ---> = <--- (!tagNameStart)?BEGIN_TAG:tagNameStart;

[WARNING] [WARNING] The variable i has already been declared in the same scope...
&&params!=null){for(var i ---> = <--- 0,param;(param=params[

[WARNING] [WARNING] The variable param has already been declared in the same scope...
){for(var i=0,param ---> ; <--- (param=params[i]);

[WARNING] [WARNING] The symbol assigned is declared but is apparently never used.
This code can probably be written in a more efficient way.
}:function (){};var assigned ---> = <--- true;}if("function"!=typeof newCls

[WARNING] [WARNING] The symbol found is declared but is apparently never used.
This code can probably be written in a more efficient way.
obj,finalAttr,value);}var found ---> = <--- false;var prefix=(value)?

[WARNING] [WARNING] The symbol _tokenPos is declared but is apparently never used.
This code can probably be written in a more efficient way.
=-1,_contentEnd=-1,_tokenPos ---> = <--- 0,_tokenForward=1,tagNameStart=(

[WARNING] [WARNING] The symbol _tokenForward is declared but is apparently never used.
This code can probably be written in a more efficient way.
_contentEnd=-1,_tokenPos=0,_tokenForward ---> = <--- 1,tagNameStart=(!tagNameStart)?

[WARNING] [WARNING] The symbol _RT is declared but is apparently never used.
This code can probably be written in a more efficient way.
{var _Lang=this._Lang;var _RT ---> = <--- this._RT;var _Dom=this.

[WARNING] [WARNING] The symbol _Dom is declared but is apparently never used.
This code can probably be written in a more efficient way.
;var _RT=this._RT;var _Dom ---> = <--- this._Dom;try{var scopeThis=

[WARNING] [WARNING] The symbol _AJAXUTIL is declared but is apparently never used.
This code can probably be written in a more efficient way.
},getFormData:function (){var _AJAXUTIL ---> = <--- this._AJAXUTIL,myfacesOptions=this._context

[WARNING] [WARNING] The symbol myfacesOptions is declared but is apparently never used.
This code can probably be written in a more efficient way.
){var _AJAXUTIL=this._AJAXUTIL,myfacesOptions ---> = <--- this._context.myfaces;return this.

[WARNING] [WARNING] The symbol _Lang is declared but is apparently never used.
This code can probably be written in a more efficient way.
,fixViewStates:function (context){var _Lang ---> = <--- this._Lang;var mfInternal=context.

[WARNING] [WARNING] The symbol _Lang is declared but is apparently never used.
This code can probably be written in a more efficient way.
:function (context,theForm){var _Lang ---> = <--- this._Lang;var mfInternal=context.

[WARNING] [WARNING] The symbol prefix is declared but is apparently never used.
This code can probably be written in a more efficient way.
(context,value,identifier){var prefix ---> = <--- this._getPrefix(context);var sourceForm

[WARNING] [WARNING] The symbol self is declared but is apparently never used.
This code can probably be written in a more efficient way.
};var clientIdsByTokens={};var self ---> = <--- {};function Socket(channelToken,url
[INFO] jsf-minimal.js (342,554 bytes) ............................. compressed at 73%
[INFO] Object.js (3,563 bytes) .................................... compressed at 67%
[INFO] _EndImpl.js (1,552 bytes) .................................. compressed at 84%
[INFO] _ExtRuntime.js (7,643 bytes) ............................... compressed at 78%
[INFO] _RuntimeQuirks.js (2,130 bytes) ............................ compressed at 78%
[INFO] _StartImpl.js (1,729 bytes) ................................ compressed at 75%
[INFO] Messages.js (5,777 bytes) .................................. compressed at 47%
[INFO] Messages_de.js (5,949 bytes) ............................... compressed at 44%
[INFO] Messages_es.js (5,488 bytes) ............................... compressed at 39%
[INFO] Messages_fr.js (5,613 bytes) ............................... compressed at 41%
[INFO] Messages_it.js (5,179 bytes) ............................... compressed at 39%
[INFO] Messages_nl.js (5,196 bytes) ............................... compressed at 40%
[INFO] Messages_ru.js (5,935 bytes) ............................... compressed at 34%
[INFO] Messages_zh_CN.js (5,758 bytes) ............................ compressed at 52%
[INFO] Messages_zh_HK.js (6,090 bytes) ............................ compressed at 55%
[INFO] Messages_zh_TW.js (6,499 bytes) ............................ compressed at 58%
[INFO] BaseRequest.js (4,813 bytes) ............................... compressed at 82%
[INFO] FormData.js (2,588 bytes) .................................. compressed at 71%
[INFO] IFrame.js (12,067 bytes) ................................... compressed at 70%
[INFO] Xhr1.js (6,589 bytes) ...................................... compressed at 60%
[INFO] XhrConst.js (1,469 bytes) .................................. compressed at 84%
[INFO] _ExtAjaxRequest.js (2,726 bytes) ........................... compressed at 77%
[INFO] _ExtTransport.js (8,327 bytes) ............................. compressed at 85%

[WARNING] [WARNING] Found an undeclared symbol: jsf
,"partial/ajax");var viewState=decodeURIComponent(jsf ---> . <--- getViewState(this._sourceForm));viewState

[WARNING] [WARNING] The symbol jsf is declared but is apparently never used.
This code can probably be written in a more efficient way.
,"partial/ajax");var viewState=decodeURIComponent(jsf ---> . <--- getViewState(this._sourceForm));viewState
[INFO] _IFrameRequest.js (2,974 bytes) ............................ compressed at 74%
[INFO] _PartialSubmitUtils.js (5,264 bytes) ....................... compressed at 77%
[INFO] _DomExperimental.js (1,629 bytes) .......................... compressed at 75%
[INFO] _DomQuirks.js (25,781 bytes) ............................... compressed at 76%
[INFO] _ExtDom.js (13,061 bytes) .................................. compressed at 74%
[INFO] _ExtLang.js (4,363 bytes) .................................. compressed at 74%
[INFO] _LangQuirks.js (8,389 bytes) ............................... compressed at 77%
[INFO] _Logging.js (4,749 bytes) .................................. compressed at 66%
[INFO] ------------------------------------------------------------------------------
[INFO] compression saved 3,168 bytes
[INFO] 
[INFO] --- maven-compiler-plugin:3.6.1:compile (default-compile) @ myfaces-api ---
[INFO] Nothing to compile - all classes are up to date
[INFO] 
[INFO] --- maven-bundle-plugin:3.0.1:manifest (bundle-manifest) @ myfaces-api ---
[INFO] 
[INFO] --- maven-resources-plugin:2.5:testResources (default-testResources) @ myfaces-api ---
[debug] execute contextualize
[INFO] Using 'UTF-8' encoding to copy filtered resources.
[INFO] skip non existing resourceDirectory F:\jenkins\jenkins-slave\workspace\myfaces-current23\api\src\test\resources
[INFO] Copying 3 resources
[INFO] Copying 3 resources
[INFO] 
[INFO] --- maven-compiler-plugin:3.6.1:testCompile (default-testCompile) @ myfaces-api ---
[INFO] No sources to compile
[INFO] 
[INFO] --- maven-surefire-plugin:2.16:test (default-test) @ myfaces-api ---
[INFO] Skipping execution of surefire because it has already been run for this configuration
[JENKINS] Recording test results
[INFO] 
[INFO] --- maven-surefire-plugin:2.16:test (default) @ myfaces-api ---
[INFO] Skipping execution of surefire because it has already been run for this configuration
[JENKINS] Recording test results
[INFO] 
[INFO] --- maven-jar-plugin:2.2:jar (default-jar) @ myfaces-api ---
[INFO] Building jar: F:\jenkins\jenkins-slave\workspace\myfaces-current23\api\target\myfaces-api-3.0.0-SNAPSHOT.jar
[INFO] 
[INFO] >>> maven-source-plugin:2.2.1:jar (attach-source) > generate-sources @ myfaces-api >>>
[INFO] 
[INFO] --- maven-enforcer-plugin:1.4.1:enforce (enforce-maven-version) @ myfaces-api ---
[INFO] 
[INFO] --- build-helper-maven-plugin:1.9.1:parse-version (parse-version) @ myfaces-api ---
[INFO] 
[INFO] --- myfaces-builder-plugin:1.0.10:build-metadata (default) @ myfaces-api ---
[INFO] model is up to date
[INFO] 
[INFO] --- myfaces-builder-plugin:1.0.10:make-components (makecomp) @ myfaces-api ---
[INFO] generated component files are up to date
[WARNING] Failed to getClass for org.apache.maven.plugin.source.SourceJarMojo
[INFO] 
[INFO] <<< maven-source-plugin:2.2.1:jar (attach-source) < generate-sources @ myfaces-api <<<
[INFO] 
[INFO] 
[INFO] --- maven-source-plugin:2.2.1:jar (attach-source) @ myfaces-api ---
[INFO] Building jar: F:\jenkins\jenkins-slave\workspace\myfaces-current23\api\target\myfaces-api-3.0.0-SNAPSHOT-sources.jar
[INFO] 
[INFO] --- maven-site-plugin:3.3:attach-descriptor (attach-descriptor) @ myfaces-api ---
[INFO] 
[INFO] --- maven-jar-plugin:2.2:test-jar (default) @ myfaces-api ---
[INFO] Building jar: F:\jenkins\jenkins-slave\workspace\myfaces-current23\api\target\myfaces-api-3.0.0-SNAPSHOT-tests.jar
[INFO] 
[INFO] --- maven-checkstyle-plugin:2.17:check (verify-style) @ myfaces-api ---
[INFO] Starting audit...
Audit done.
[INFO] 
[INFO] --- maven-install-plugin:2.5.2:install (default-install) @ myfaces-api ---
[INFO] Installing F:\jenkins\jenkins-slave\workspace\myfaces-current23\api\target\myfaces-api-3.0.0-SNAPSHOT.jar to f:\jenkins\jenkins-slave\maven-repositories\0\org\apache\myfaces\core\myfaces-api\3.0.0-SNAPSHOT\myfaces-api-3.0.0-SNAPSHOT.jar
[INFO] Installing F:\jenkins\jenkins-slave\workspace\myfaces-current23\api\pom.xml to f:\jenkins\jenkins-slave\maven-repositories\0\org\apache\myfaces\core\myfaces-api\3.0.0-SNAPSHOT\myfaces-api-3.0.0-SNAPSHOT.pom
[INFO] Installing F:\jenkins\jenkins-slave\workspace\myfaces-current23\api\target\myfaces-api-3.0.0-SNAPSHOT-sources.jar to f:\jenkins\jenkins-slave\maven-repositories\0\org\apache\myfaces\core\myfaces-api\3.0.0-SNAPSHOT\myfaces-api-3.0.0-SNAPSHOT-sources.jar
[INFO] Installing F:\jenkins\jenkins-slave\workspace\myfaces-current23\api\target\myfaces-api-3.0.0-SNAPSHOT-tests.jar to f:\jenkins\jenkins-slave\maven-repositories\0\org\apache\myfaces\core\myfaces-api\3.0.0-SNAPSHOT\myfaces-api-3.0.0-SNAPSHOT-tests.jar
[INFO] Installing F:\jenkins\jenkins-slave\workspace\myfaces-current23\api\target\myfaces-api-3.0.0-SNAPSHOT-sources.jar to f:\jenkins\jenkins-slave\maven-repositories\0\org\apache\myfaces\core\myfaces-api\3.0.0-SNAPSHOT\myfaces-api-3.0.0-SNAPSHOT-sources.jar
[INFO] Installing F:\jenkins\jenkins-slave\workspace\myfaces-current23\api\target\myfaces-api-3.0.0-SNAPSHOT-tests.jar to f:\jenkins\jenkins-slave\maven-repositories\0\org\apache\myfaces\core\myfaces-api\3.0.0-SNAPSHOT\myfaces-api-3.0.0-SNAPSHOT-tests.jar
[INFO] 
[INFO] --- maven-deploy-plugin:2.8.2:deploy (default-deploy) @ myfaces-api ---
[INFO] Downloading from apache.snapshots.https: https://repository.apache.org/content/repositories/snapshots/org/apache/myfaces/core/myfaces-api/3.0.0-SNAPSHOT/maven-metadata.xml
[INFO] Downloaded from apache.snapshots.https: https://repository.apache.org/content/repositories/snapshots/org/apache/myfaces/core/myfaces-api/3.0.0-SNAPSHOT/maven-metadata.xml (1.2 kB at 2.1 kB/s)
[INFO] Uploading to apache.snapshots.https: https://repository.apache.org/content/repositories/snapshots/org/apache/myfaces/core/myfaces-api/3.0.0-SNAPSHOT/myfaces-api-3.0.0-20181020.112055-12.jar
[INFO] Uploaded to apache.snapshots.https: https://repository.apache.org/content/repositories/snapshots/org/apache/myfaces/core/myfaces-api/3.0.0-SNAPSHOT/myfaces-api-3.0.0-20181020.112055-12.jar (1.3 MB at 731 kB/s)
[INFO] Uploading to apache.snapshots.https: https://repository.apache.org/content/repositories/snapshots/org/apache/myfaces/core/myfaces-api/3.0.0-SNAPSHOT/myfaces-api-3.0.0-20181020.112055-12.pom
[INFO] Uploaded to apache.snapshots.https: https://repository.apache.org/content/repositories/snapshots/org/apache/myfaces/core/myfaces-api/3.0.0-SNAPSHOT/myfaces-api-3.0.0-20181020.112055-12.pom (34 kB at 28 kB/s)
[INFO] Downloading from apache.snapshots.https: https://repository.apache.org/content/repositories/snapshots/org/apache/myfaces/core/myfaces-api/maven-metadata.xml
[INFO] Downloaded from apache.snapshots.https: https://repository.apache.org/content/repositories/snapshots/org/apache/myfaces/core/myfaces-api/maven-metadata.xml (653 B at 1.1 kB/s)
[INFO] Uploading to apache.snapshots.https: https://repository.apache.org/content/repositories/snapshots/org/apache/myfaces/core/myfaces-api/3.0.0-SNAPSHOT/maven-metadata.xml
[INFO] Uploaded to apache.snapshots.https: https://repository.apache.org/content/repositories/snapshots/org/apache/myfaces/core/myfaces-api/3.0.0-SNAPSHOT/maven-metadata.xml (1.2 kB at 1.1 kB/s)
[INFO] Uploading to apache.snapshots.https: https://repository.apache.org/content/repositories/snapshots/org/apache/myfaces/core/myfaces-api/maven-metadata.xml
[INFO] Uploaded to apache.snapshots.https: https://repository.apache.org/content/repositories/snapshots/org/apache/myfaces/core/myfaces-api/maven-metadata.xml (653 B at 528 B/s)
[INFO] Uploading to apache.snapshots.https: https://repository.apache.org/content/repositories/snapshots/org/apache/myfaces/core/myfaces-api/3.0.0-SNAPSHOT/myfaces-api-3.0.0-20181020.112055-12-sources.jar
[INFO] Uploaded to apache.snapshots.https: https://repository.apache.org/content/repositories/snapshots/org/apache/myfaces/core/myfaces-api/3.0.0-SNAPSHOT/myfaces-api-3.0.0-20181020.112055-12-sources.jar (972 kB at 546 kB/s)
[INFO] Uploading to apache.snapshots.https: https://repository.apache.org/content/repositories/snapshots/org/apache/myfaces/core/myfaces-api/3.0.0-SNAPSHOT/maven-metadata.xml
[INFO] Uploaded to apache.snapshots.https: https://repository.apache.org/content/repositories/snapshots/org/apache/myfaces/core/myfaces-api/3.0.0-SNAPSHOT/maven-metadata.xml (1.2 kB at 1.1 kB/s)
[INFO] Uploading to apache.snapshots.https: https://repository.apache.org/content/repositories/snapshots/org/apache/myfaces/core/myfaces-api/3.0.0-SNAPSHOT/myfaces-api-3.0.0-20181020.112055-12-tests.jar
[INFO] Uploaded to apache.snapshots.https: https://repository.apache.org/content/repositories/snapshots/org/apache/myfaces/core/myfaces-api/3.0.0-SNAPSHOT/myfaces-api-3.0.0-20181020.112055-12-tests.jar (12 kB at 11 kB/s)
[INFO] Uploading to apache.snapshots.https: https://repository.apache.org/content/repositories/snapshots/org/apache/myfaces/core/myfaces-api/3.0.0-SNAPSHOT/maven-metadata.xml
[INFO] Uploaded to apache.snapshots.https: https://repository.apache.org/content/repositories/snapshots/org/apache/myfaces/core/myfaces-api/3.0.0-SNAPSHOT/maven-metadata.xml (1.2 kB at 1.1 kB/s)
[INFO] Uploading to apache.snapshots.https: https://repository.apache.org/content/repositories/snapshots/org/apache/myfaces/core/myfaces-api/3.0.0-SNAPSHOT/myfaces-api-3.0.0-20181020.112055-12-sources.jar
[INFO] Uploaded to apache.snapshots.https: https://repository.apache.org/content/repositories/snapshots/org/apache/myfaces/core/myfaces-api/3.0.0-SNAPSHOT/myfaces-api-3.0.0-20181020.112055-12-sources.jar (972 kB at 560 kB/s)
[INFO] Uploading to apache.snapshots.https: https://repository.apache.org/content/repositories/snapshots/org/apache/myfaces/core/myfaces-api/3.0.0-SNAPSHOT/maven-metadata.xml
[INFO] Uploaded to apache.snapshots.https: https://repository.apache.org/content/repositories/snapshots/org/apache/myfaces/core/myfaces-api/3.0.0-SNAPSHOT/maven-metadata.xml (1.2 kB at 1.1 kB/s)
[INFO] Uploading to apache.snapshots.https: https://repository.apache.org/content/repositories/snapshots/org/apache/myfaces/core/myfaces-api/3.0.0-SNAPSHOT/myfaces-api-3.0.0-20181020.112055-12-tests.jar
[INFO] Uploaded to apache.snapshots.https: https://repository.apache.org/content/repositories/snapshots/org/apache/myfaces/core/myfaces-api/3.0.0-SNAPSHOT/myfaces-api-3.0.0-20181020.112055-12-tests.jar (12 kB at 11 kB/s)
[INFO] Uploading to apache.snapshots.https: https://repository.apache.org/content/repositories/snapshots/org/apache/myfaces/core/myfaces-api/3.0.0-SNAPSHOT/maven-metadata.xml
[INFO] Uploaded to apache.snapshots.https: https://repository.apache.org/content/repositories/snapshots/org/apache/myfaces/core/myfaces-api/3.0.0-SNAPSHOT/maven-metadata.xml (1.2 kB at 1.1 kB/s)
[INFO] 
[INFO] ------------------------------------------------------------------------
[INFO] Building Apache MyFaces Core 3.0 - Impl Shared Public 3.0.0-SNAPSHOT
[INFO] ------------------------------------------------------------------------
[WARNING] The POM for org.apache.myfaces.test:myfaces-test30:jar:1.0.9-SNAPSHOT is missing, no dependency information available
[INFO] ------------------------------------------------------------------------
[INFO] Reactor Summary:
[INFO] 
[INFO] Apache MyFaces Core 3.0 - Parent ................... SUCCESS [ 17.910 s]
[INFO] Apache MyFaces Core 3.0 - API ...................... SUCCESS [01:12 min]
[INFO] Apache MyFaces Core 3.0 - Impl Shared Public ....... FAILURE [  0.172 s]
[INFO] Apache MyFaces Core 3.0 - Impl Shared .............. SKIPPED
[INFO] Apache MyFaces Core 3.0 - Impl ..................... SKIPPED
[INFO] Apache MyFaces Core 3.0 - OSGi Bundle .............. SKIPPED
[INFO] Apache MyFaces Core 3.0 - Impl Test ................ SKIPPED
[INFO] Apache MyFaces Core 3.0 ............................ SKIPPED
[INFO] ------------------------------------------------------------------------
[INFO] BUILD FAILURE
[INFO] ------------------------------------------------------------------------
[INFO] Total time: 01:40 min
[INFO] Finished at: 2018-10-20T04:21:16-07:00
[INFO] Final Memory: 73M/677M
[INFO] ------------------------------------------------------------------------
[ERROR] Failed to execute goal on project myfaces-impl-shared-public: Could not resolve dependencies for project org.apache.myfaces.core.internal:myfaces-impl-shared-public:jar:3.0.0-SNAPSHOT: Failure to find org.apache.myfaces.test:myfaces-test30:jar:1.0.9-SNAPSHOT in http://repository.apache.org/snapshots/ was cached in the local repository, resolution will not be reattempted until the update interval of apache-snapshots has elapsed or updates are forced -> [Help 1]
[ERROR] 
[ERROR] To see the full stack trace of the errors, re-run Maven with the -e switch.
[ERROR] Re-run Maven using the -X switch to enable full debug logging.
[ERROR] 
[ERROR] For more information about the errors and possible solutions, please read the following articles:
[ERROR] [Help 1] http://cwiki.apache.org/confluence/display/MAVEN/DependencyResolutionException
[ERROR] 
[ERROR] After correcting the problems, you can resume the build with the command
[ERROR]   mvn <goals> -rf :myfaces-impl-shared-public
[JENKINS] Archiving F:\jenkins\jenkins-slave\workspace\myfaces-current23\api\pom.xml to org.apache.myfaces.core/myfaces-api/3.0.0-SNAPSHOT/myfaces-api-3.0.0-SNAPSHOT.pom
[JENKINS] Archiving F:\jenkins\jenkins-slave\workspace\myfaces-current23\api\target\myfaces-api-3.0.0-SNAPSHOT.jar to org.apache.myfaces.core/myfaces-api/3.0.0-20181020.112055-12/myfaces-api-3.0.0-20181020.112055-12.jar
[JENKINS] Archiving F:\jenkins\jenkins-slave\workspace\myfaces-current23\api\target\myfaces-api-3.0.0-SNAPSHOT-sources.jar to org.apache.myfaces.core/myfaces-api/3.0.0-20181020.112055-12/myfaces-api-3.0.0-20181020.112055-12-sources.jar
[JENKINS] Archiving F:\jenkins\jenkins-slave\workspace\myfaces-current23\api\target\myfaces-api-3.0.0-SNAPSHOT-tests.jar to org.apache.myfaces.core/myfaces-api/3.0.0-20181020.112055-12/myfaces-api-3.0.0-20181020.112055-12-tests.jar
[Fast Archiver] Compressed 2.22 MB of artifacts by 28.1% relative to #352
[JENKINS] Archiving F:\jenkins\jenkins-slave\workspace\myfaces-current23\shared\pom.xml to org.apache.myfaces.core.internal/myfaces-impl-shared/3.0.0-SNAPSHOT/myfaces-impl-shared-3.0.0-SNAPSHOT.pom
[JENKINS] Archiving F:\jenkins\jenkins-slave\workspace\myfaces-current23\impl\pom.xml to org.apache.myfaces.core/myfaces-impl/3.0.0-SNAPSHOT/myfaces-impl-3.0.0-SNAPSHOT.pom
[Fast Archiver] Compressed 66.65 KB of artifacts by 48.0% relative to #346
[JENKINS] Archiving F:\jenkins\jenkins-slave\workspace\myfaces-current23\bundle\pom.xml to org.apache.myfaces.core/myfaces-bundle/3.0.0-SNAPSHOT/myfaces-bundle-3.0.0-SNAPSHOT.pom
[JENKINS] Archiving <https://builds.apache.org/job/myfaces-current23/ws/pom.xml> to org.apache.myfaces.core/myfaces-core-module/3.0.0-SNAPSHOT/myfaces-core-module-3.0.0-SNAPSHOT.pom
[JENKINS] Archiving F:\jenkins\jenkins-slave\workspace\myfaces-current23\shared-public\pom.xml to org.apache.myfaces.core.internal/myfaces-impl-shared-public/3.0.0-SNAPSHOT/myfaces-impl-shared-public-3.0.0-SNAPSHOT.pom
[JENKINS] Archiving F:\jenkins\jenkins-slave\workspace\myfaces-current23\impl-test\pom.xml to org.apache.myfaces.core/myfaces-impl-test/3.0.0-SNAPSHOT/myfaces-impl-test-3.0.0-SNAPSHOT.pom
[JENKINS] Archiving F:\jenkins\jenkins-slave\workspace\myfaces-current23\parent\pom.xml to org.apache.myfaces.core/myfaces-core-project/3.0.0-SNAPSHOT/myfaces-core-project-3.0.0-SNAPSHOT.pom
[JENKINS] Archiving F:\jenkins\jenkins-slave\workspace\myfaces-current23\parent\target\myfaces-core-project-3.0.0-SNAPSHOT-site.xml to org.apache.myfaces.core/myfaces-core-project/3.0.0-20181020.111947-17/myfaces-core-project-3.0.0-20181020.111947-17-site.xml
Sending e-mails to: commits@myfaces.apache.org grantsmith@apache.org tandraschko@apache.org
channel stopped
Java HotSpot(TM) 64-Bit Server VM warning: ignoring option MaxPermSize=256m; support was removed in 8.0

Build failed in Jenkins: myfaces-current23 #352

Posted by Apache Jenkins Server <je...@builds.apache.org>.
See <https://builds.apache.org/job/myfaces-current23/352/display/redirect?page=changes>

Changes:

[tandraschko] duplicate code

------------------------------------------
[...truncated 123.98 KB...]
[WARNING] [WARNING] Using 'eval' is not recommended...
[INFO] Using 'eval' reduces the level of compression!
_T[_e]||((_w.eval ---> ) <--- ?"_evalHeadAppendix":null);}if(

[WARNING] [WARNING] Using 'eval' is not recommended...
[INFO] Using 'eval' reduces the level of compression!
[_e]](c);}eval ---> . <--- call(window,c);return null

[WARNING] [WARNING] The variable _T has already been declared in the same scope...
,tv=parseFloat(dav);var _T ---> = <--- this;_T.browser={};

[WARNING] [WARNING] The variable tagNameStart has already been declared in the same scope...
,_tokenPos=0,_tokenForward=1,tagNameStart ---> = <--- (!tagNameStart)?BEGIN_TAG:tagNameStart;

[WARNING] [WARNING] The variable i has already been declared in the same scope...
&&params!=null){for(var i ---> = <--- 0,param;(param=params[

[WARNING] [WARNING] The variable param has already been declared in the same scope...
){for(var i=0,param ---> ; <--- (param=params[i]);

[WARNING] [WARNING] The symbol assigned is declared but is apparently never used.
This code can probably be written in a more efficient way.
}:function (){};var assigned ---> = <--- true;}if("function"!=typeof newCls

[WARNING] [WARNING] The symbol found is declared but is apparently never used.
This code can probably be written in a more efficient way.
obj,finalAttr,value);}var found ---> = <--- false;var prefix=(value)?

[WARNING] [WARNING] The symbol _tokenPos is declared but is apparently never used.
This code can probably be written in a more efficient way.
=-1,_contentEnd=-1,_tokenPos ---> = <--- 0,_tokenForward=1,tagNameStart=(

[WARNING] [WARNING] The symbol _tokenForward is declared but is apparently never used.
This code can probably be written in a more efficient way.
_contentEnd=-1,_tokenPos=0,_tokenForward ---> = <--- 1,tagNameStart=(!tagNameStart)?

[WARNING] [WARNING] The symbol _RT is declared but is apparently never used.
This code can probably be written in a more efficient way.
{var _Lang=this._Lang;var _RT ---> = <--- this._RT;var _Dom=this.

[WARNING] [WARNING] The symbol _Dom is declared but is apparently never used.
This code can probably be written in a more efficient way.
;var _RT=this._RT;var _Dom ---> = <--- this._Dom;try{var scopeThis=

[WARNING] [WARNING] The symbol _AJAXUTIL is declared but is apparently never used.
This code can probably be written in a more efficient way.
},getFormData:function (){var _AJAXUTIL ---> = <--- this._AJAXUTIL,myfacesOptions=this._context

[WARNING] [WARNING] The symbol myfacesOptions is declared but is apparently never used.
This code can probably be written in a more efficient way.
){var _AJAXUTIL=this._AJAXUTIL,myfacesOptions ---> = <--- this._context.myfaces;return this.

[WARNING] [WARNING] The symbol _Lang is declared but is apparently never used.
This code can probably be written in a more efficient way.
,fixViewStates:function (context){var _Lang ---> = <--- this._Lang;var mfInternal=context.

[WARNING] [WARNING] The symbol _Lang is declared but is apparently never used.
This code can probably be written in a more efficient way.
:function (context,theForm){var _Lang ---> = <--- this._Lang;var mfInternal=context.

[WARNING] [WARNING] The symbol prefix is declared but is apparently never used.
This code can probably be written in a more efficient way.
(context,value,identifier){var prefix ---> = <--- this._getPrefix(context);var sourceForm

[WARNING] [WARNING] The symbol self is declared but is apparently never used.
This code can probably be written in a more efficient way.
};var clientIdsByTokens={};var self ---> = <--- {};function Socket(channelToken,url
[INFO] jsf-minimal.js (342,554 bytes) ............................. compressed at 73%
[INFO] Object.js (3,563 bytes) .................................... compressed at 67%
[INFO] _EndImpl.js (1,552 bytes) .................................. compressed at 84%
[INFO] _ExtRuntime.js (7,643 bytes) ............................... compressed at 78%
[INFO] _RuntimeQuirks.js (2,130 bytes) ............................ compressed at 78%
[INFO] _StartImpl.js (1,729 bytes) ................................ compressed at 75%
[INFO] Messages.js (5,777 bytes) .................................. compressed at 47%
[INFO] Messages_de.js (5,949 bytes) ............................... compressed at 44%
[INFO] Messages_es.js (5,488 bytes) ............................... compressed at 39%
[INFO] Messages_fr.js (5,613 bytes) ............................... compressed at 41%
[INFO] Messages_it.js (5,179 bytes) ............................... compressed at 39%
[INFO] Messages_nl.js (5,196 bytes) ............................... compressed at 40%
[INFO] Messages_ru.js (5,935 bytes) ............................... compressed at 34%
[INFO] Messages_zh_CN.js (5,758 bytes) ............................ compressed at 52%
[INFO] Messages_zh_HK.js (6,090 bytes) ............................ compressed at 55%
[INFO] Messages_zh_TW.js (6,499 bytes) ............................ compressed at 58%
[INFO] BaseRequest.js (4,813 bytes) ............................... compressed at 82%
[INFO] FormData.js (2,588 bytes) .................................. compressed at 71%
[INFO] IFrame.js (12,067 bytes) ................................... compressed at 70%
[INFO] Xhr1.js (6,589 bytes) ...................................... compressed at 60%
[INFO] XhrConst.js (1,469 bytes) .................................. compressed at 84%
[INFO] _ExtAjaxRequest.js (2,726 bytes) ........................... compressed at 77%
[INFO] _ExtTransport.js (8,327 bytes) ............................. compressed at 85%

[WARNING] [WARNING] Found an undeclared symbol: jsf
,"partial/ajax");var viewState=decodeURIComponent(jsf ---> . <--- getViewState(this._sourceForm));viewState

[WARNING] [WARNING] The symbol jsf is declared but is apparently never used.
This code can probably be written in a more efficient way.
,"partial/ajax");var viewState=decodeURIComponent(jsf ---> . <--- getViewState(this._sourceForm));viewState
[INFO] _IFrameRequest.js (2,974 bytes) ............................ compressed at 74%
[INFO] _PartialSubmitUtils.js (5,264 bytes) ....................... compressed at 77%
[INFO] _DomExperimental.js (1,629 bytes) .......................... compressed at 75%
[INFO] _DomQuirks.js (25,781 bytes) ............................... compressed at 76%
[INFO] _ExtDom.js (13,061 bytes) .................................. compressed at 74%
[INFO] _ExtLang.js (4,363 bytes) .................................. compressed at 74%
[INFO] _LangQuirks.js (8,389 bytes) ............................... compressed at 77%
[INFO] _Logging.js (4,749 bytes) .................................. compressed at 66%
[INFO] ------------------------------------------------------------------------------
[INFO] compression saved 3,168 bytes
[INFO] 
[INFO] --- maven-compiler-plugin:3.6.1:compile (default-compile) @ myfaces-api ---
[INFO] Nothing to compile - all classes are up to date
[INFO] 
[INFO] --- maven-bundle-plugin:3.0.1:manifest (bundle-manifest) @ myfaces-api ---
[INFO] 
[INFO] --- maven-resources-plugin:2.5:testResources (default-testResources) @ myfaces-api ---
[debug] execute contextualize
[INFO] Using 'UTF-8' encoding to copy filtered resources.
[INFO] skip non existing resourceDirectory F:\jenkins\jenkins-slave\workspace\myfaces-current23\api\src\test\resources
[INFO] Copying 3 resources
[INFO] Copying 3 resources
[INFO] 
[INFO] --- maven-compiler-plugin:3.6.1:testCompile (default-testCompile) @ myfaces-api ---
[INFO] No sources to compile
[INFO] 
[INFO] --- maven-surefire-plugin:2.16:test (default-test) @ myfaces-api ---
[INFO] Skipping execution of surefire because it has already been run for this configuration
[JENKINS] Recording test results
[INFO] 
[INFO] --- maven-surefire-plugin:2.16:test (default) @ myfaces-api ---
[INFO] Skipping execution of surefire because it has already been run for this configuration
[JENKINS] Recording test results
[INFO] 
[INFO] --- maven-jar-plugin:2.2:jar (default-jar) @ myfaces-api ---
[INFO] Building jar: F:\jenkins\jenkins-slave\workspace\myfaces-current23\api\target\myfaces-api-3.0.0-SNAPSHOT.jar
[INFO] 
[INFO] >>> maven-source-plugin:2.2.1:jar (attach-source) > generate-sources @ myfaces-api >>>
[INFO] 
[INFO] --- maven-enforcer-plugin:1.4.1:enforce (enforce-maven-version) @ myfaces-api ---
[INFO] 
[INFO] --- build-helper-maven-plugin:1.9.1:parse-version (parse-version) @ myfaces-api ---
[INFO] 
[INFO] --- myfaces-builder-plugin:1.0.10:build-metadata (default) @ myfaces-api ---
[INFO] model is up to date
[INFO] 
[INFO] --- myfaces-builder-plugin:1.0.10:make-components (makecomp) @ myfaces-api ---
[INFO] generated component files are up to date
[WARNING] Failed to getClass for org.apache.maven.plugin.source.SourceJarMojo
[INFO] 
[INFO] <<< maven-source-plugin:2.2.1:jar (attach-source) < generate-sources @ myfaces-api <<<
[INFO] 
[INFO] 
[INFO] --- maven-source-plugin:2.2.1:jar (attach-source) @ myfaces-api ---
[INFO] Building jar: F:\jenkins\jenkins-slave\workspace\myfaces-current23\api\target\myfaces-api-3.0.0-SNAPSHOT-sources.jar
[INFO] 
[INFO] --- maven-site-plugin:3.3:attach-descriptor (attach-descriptor) @ myfaces-api ---
[INFO] 
[INFO] --- maven-jar-plugin:2.2:test-jar (default) @ myfaces-api ---
[INFO] Building jar: F:\jenkins\jenkins-slave\workspace\myfaces-current23\api\target\myfaces-api-3.0.0-SNAPSHOT-tests.jar
[INFO] 
[INFO] --- maven-checkstyle-plugin:2.17:check (verify-style) @ myfaces-api ---
[INFO] Starting audit...
Audit done.
[INFO] 
[INFO] --- maven-install-plugin:2.5.2:install (default-install) @ myfaces-api ---
[INFO] Installing F:\jenkins\jenkins-slave\workspace\myfaces-current23\api\target\myfaces-api-3.0.0-SNAPSHOT.jar to f:\jenkins\jenkins-slave\maven-repositories\0\org\apache\myfaces\core\myfaces-api\3.0.0-SNAPSHOT\myfaces-api-3.0.0-SNAPSHOT.jar
[INFO] Installing F:\jenkins\jenkins-slave\workspace\myfaces-current23\api\pom.xml to f:\jenkins\jenkins-slave\maven-repositories\0\org\apache\myfaces\core\myfaces-api\3.0.0-SNAPSHOT\myfaces-api-3.0.0-SNAPSHOT.pom
[INFO] Installing F:\jenkins\jenkins-slave\workspace\myfaces-current23\api\target\myfaces-api-3.0.0-SNAPSHOT-sources.jar to f:\jenkins\jenkins-slave\maven-repositories\0\org\apache\myfaces\core\myfaces-api\3.0.0-SNAPSHOT\myfaces-api-3.0.0-SNAPSHOT-sources.jar
[INFO] Installing F:\jenkins\jenkins-slave\workspace\myfaces-current23\api\target\myfaces-api-3.0.0-SNAPSHOT-tests.jar to f:\jenkins\jenkins-slave\maven-repositories\0\org\apache\myfaces\core\myfaces-api\3.0.0-SNAPSHOT\myfaces-api-3.0.0-SNAPSHOT-tests.jar
[INFO] Installing F:\jenkins\jenkins-slave\workspace\myfaces-current23\api\target\myfaces-api-3.0.0-SNAPSHOT-sources.jar to f:\jenkins\jenkins-slave\maven-repositories\0\org\apache\myfaces\core\myfaces-api\3.0.0-SNAPSHOT\myfaces-api-3.0.0-SNAPSHOT-sources.jar
[INFO] Installing F:\jenkins\jenkins-slave\workspace\myfaces-current23\api\target\myfaces-api-3.0.0-SNAPSHOT-tests.jar to f:\jenkins\jenkins-slave\maven-repositories\0\org\apache\myfaces\core\myfaces-api\3.0.0-SNAPSHOT\myfaces-api-3.0.0-SNAPSHOT-tests.jar
[INFO] 
[INFO] --- maven-deploy-plugin:2.8.2:deploy (default-deploy) @ myfaces-api ---
[INFO] Downloading from apache.snapshots.https: https://repository.apache.org/content/repositories/snapshots/org/apache/myfaces/core/myfaces-api/3.0.0-SNAPSHOT/maven-metadata.xml
[INFO] Downloaded from apache.snapshots.https: https://repository.apache.org/content/repositories/snapshots/org/apache/myfaces/core/myfaces-api/3.0.0-SNAPSHOT/maven-metadata.xml (1.2 kB at 2.0 kB/s)
[INFO] Uploading to apache.snapshots.https: https://repository.apache.org/content/repositories/snapshots/org/apache/myfaces/core/myfaces-api/3.0.0-SNAPSHOT/myfaces-api-3.0.0-20181020.105126-11.jar
[INFO] Uploaded to apache.snapshots.https: https://repository.apache.org/content/repositories/snapshots/org/apache/myfaces/core/myfaces-api/3.0.0-SNAPSHOT/myfaces-api-3.0.0-20181020.105126-11.jar (1.3 MB at 740 kB/s)
[INFO] Uploading to apache.snapshots.https: https://repository.apache.org/content/repositories/snapshots/org/apache/myfaces/core/myfaces-api/3.0.0-SNAPSHOT/myfaces-api-3.0.0-20181020.105126-11.pom
[INFO] Uploaded to apache.snapshots.https: https://repository.apache.org/content/repositories/snapshots/org/apache/myfaces/core/myfaces-api/3.0.0-SNAPSHOT/myfaces-api-3.0.0-20181020.105126-11.pom (34 kB at 28 kB/s)
[INFO] Downloading from apache.snapshots.https: https://repository.apache.org/content/repositories/snapshots/org/apache/myfaces/core/myfaces-api/maven-metadata.xml
[INFO] Downloaded from apache.snapshots.https: https://repository.apache.org/content/repositories/snapshots/org/apache/myfaces/core/myfaces-api/maven-metadata.xml (653 B at 1.1 kB/s)
[INFO] Uploading to apache.snapshots.https: https://repository.apache.org/content/repositories/snapshots/org/apache/myfaces/core/myfaces-api/3.0.0-SNAPSHOT/maven-metadata.xml
[INFO] Uploaded to apache.snapshots.https: https://repository.apache.org/content/repositories/snapshots/org/apache/myfaces/core/myfaces-api/3.0.0-SNAPSHOT/maven-metadata.xml (1.2 kB at 1.0 kB/s)
[INFO] Uploading to apache.snapshots.https: https://repository.apache.org/content/repositories/snapshots/org/apache/myfaces/core/myfaces-api/maven-metadata.xml
[INFO] Uploaded to apache.snapshots.https: https://repository.apache.org/content/repositories/snapshots/org/apache/myfaces/core/myfaces-api/maven-metadata.xml (653 B at 529 B/s)
[INFO] Uploading to apache.snapshots.https: https://repository.apache.org/content/repositories/snapshots/org/apache/myfaces/core/myfaces-api/3.0.0-SNAPSHOT/myfaces-api-3.0.0-20181020.105126-11-sources.jar
[INFO] Uploaded to apache.snapshots.https: https://repository.apache.org/content/repositories/snapshots/org/apache/myfaces/core/myfaces-api/3.0.0-SNAPSHOT/myfaces-api-3.0.0-20181020.105126-11-sources.jar (972 kB at 552 kB/s)
[INFO] Uploading to apache.snapshots.https: https://repository.apache.org/content/repositories/snapshots/org/apache/myfaces/core/myfaces-api/3.0.0-SNAPSHOT/maven-metadata.xml
[INFO] Uploaded to apache.snapshots.https: https://repository.apache.org/content/repositories/snapshots/org/apache/myfaces/core/myfaces-api/3.0.0-SNAPSHOT/maven-metadata.xml (1.2 kB at 1.1 kB/s)
[INFO] Uploading to apache.snapshots.https: https://repository.apache.org/content/repositories/snapshots/org/apache/myfaces/core/myfaces-api/3.0.0-SNAPSHOT/myfaces-api-3.0.0-20181020.105126-11-tests.jar
[INFO] Uploaded to apache.snapshots.https: https://repository.apache.org/content/repositories/snapshots/org/apache/myfaces/core/myfaces-api/3.0.0-SNAPSHOT/myfaces-api-3.0.0-20181020.105126-11-tests.jar (12 kB at 11 kB/s)
[INFO] Uploading to apache.snapshots.https: https://repository.apache.org/content/repositories/snapshots/org/apache/myfaces/core/myfaces-api/3.0.0-SNAPSHOT/maven-metadata.xml
[INFO] Uploaded to apache.snapshots.https: https://repository.apache.org/content/repositories/snapshots/org/apache/myfaces/core/myfaces-api/3.0.0-SNAPSHOT/maven-metadata.xml (1.2 kB at 1.1 kB/s)
[INFO] Uploading to apache.snapshots.https: https://repository.apache.org/content/repositories/snapshots/org/apache/myfaces/core/myfaces-api/3.0.0-SNAPSHOT/myfaces-api-3.0.0-20181020.105126-11-sources.jar
[INFO] Uploaded to apache.snapshots.https: https://repository.apache.org/content/repositories/snapshots/org/apache/myfaces/core/myfaces-api/3.0.0-SNAPSHOT/myfaces-api-3.0.0-20181020.105126-11-sources.jar (972 kB at 565 kB/s)
[INFO] Uploading to apache.snapshots.https: https://repository.apache.org/content/repositories/snapshots/org/apache/myfaces/core/myfaces-api/3.0.0-SNAPSHOT/maven-metadata.xml
[INFO] Uploaded to apache.snapshots.https: https://repository.apache.org/content/repositories/snapshots/org/apache/myfaces/core/myfaces-api/3.0.0-SNAPSHOT/maven-metadata.xml (1.2 kB at 1.1 kB/s)
[INFO] Uploading to apache.snapshots.https: https://repository.apache.org/content/repositories/snapshots/org/apache/myfaces/core/myfaces-api/3.0.0-SNAPSHOT/myfaces-api-3.0.0-20181020.105126-11-tests.jar
[INFO] Uploaded to apache.snapshots.https: https://repository.apache.org/content/repositories/snapshots/org/apache/myfaces/core/myfaces-api/3.0.0-SNAPSHOT/myfaces-api-3.0.0-20181020.105126-11-tests.jar (12 kB at 11 kB/s)
[INFO] Uploading to apache.snapshots.https: https://repository.apache.org/content/repositories/snapshots/org/apache/myfaces/core/myfaces-api/3.0.0-SNAPSHOT/maven-metadata.xml
[INFO] Uploaded to apache.snapshots.https: https://repository.apache.org/content/repositories/snapshots/org/apache/myfaces/core/myfaces-api/3.0.0-SNAPSHOT/maven-metadata.xml (1.2 kB at 1.0 kB/s)
[INFO] 
[INFO] ------------------------------------------------------------------------
[INFO] Building Apache MyFaces Core 3.0 - Impl Shared Public 3.0.0-SNAPSHOT
[INFO] ------------------------------------------------------------------------
[WARNING] The POM for org.apache.myfaces.test:myfaces-test30:jar:1.0.9-SNAPSHOT is missing, no dependency information available
[INFO] ------------------------------------------------------------------------
[INFO] Reactor Summary:
[INFO] 
[INFO] Apache MyFaces Core 3.0 - Parent ................... SUCCESS [ 18.223 s]
[INFO] Apache MyFaces Core 3.0 - API ...................... SUCCESS [01:09 min]
[INFO] Apache MyFaces Core 3.0 - Impl Shared Public ....... FAILURE [  0.234 s]
[INFO] Apache MyFaces Core 3.0 - Impl Shared .............. SKIPPED
[INFO] Apache MyFaces Core 3.0 - Impl ..................... SKIPPED
[INFO] Apache MyFaces Core 3.0 - OSGi Bundle .............. SKIPPED
[INFO] Apache MyFaces Core 3.0 - Impl Test ................ SKIPPED
[INFO] Apache MyFaces Core 3.0 ............................ SKIPPED
[INFO] ------------------------------------------------------------------------
[INFO] BUILD FAILURE
[INFO] ------------------------------------------------------------------------
[INFO] Total time: 01:36 min
[INFO] Finished at: 2018-10-20T03:51:47-07:00
[INFO] Final Memory: 74M/726M
[INFO] ------------------------------------------------------------------------
[ERROR] Failed to execute goal on project myfaces-impl-shared-public: Could not resolve dependencies for project org.apache.myfaces.core.internal:myfaces-impl-shared-public:jar:3.0.0-SNAPSHOT: Failure to find org.apache.myfaces.test:myfaces-test30:jar:1.0.9-SNAPSHOT in http://repository.apache.org/snapshots/ was cached in the local repository, resolution will not be reattempted until the update interval of apache-snapshots has elapsed or updates are forced -> [Help 1]
[ERROR] 
[ERROR] To see the full stack trace of the errors, re-run Maven with the -e switch.
[ERROR] Re-run Maven using the -X switch to enable full debug logging.
[ERROR] 
[ERROR] For more information about the errors and possible solutions, please read the following articles:
[ERROR] [Help 1] http://cwiki.apache.org/confluence/display/MAVEN/DependencyResolutionException
[ERROR] 
[ERROR] After correcting the problems, you can resume the build with the command
[ERROR]   mvn <goals> -rf :myfaces-impl-shared-public
[JENKINS] Archiving F:\jenkins\jenkins-slave\workspace\myfaces-current23\api\pom.xml to org.apache.myfaces.core/myfaces-api/3.0.0-SNAPSHOT/myfaces-api-3.0.0-SNAPSHOT.pom
[JENKINS] Archiving F:\jenkins\jenkins-slave\workspace\myfaces-current23\api\target\myfaces-api-3.0.0-SNAPSHOT.jar to org.apache.myfaces.core/myfaces-api/3.0.0-20181020.105126-11/myfaces-api-3.0.0-20181020.105126-11.jar
[JENKINS] Archiving F:\jenkins\jenkins-slave\workspace\myfaces-current23\api\target\myfaces-api-3.0.0-SNAPSHOT-sources.jar to org.apache.myfaces.core/myfaces-api/3.0.0-20181020.105126-11/myfaces-api-3.0.0-20181020.105126-11-sources.jar
[JENKINS] Archiving F:\jenkins\jenkins-slave\workspace\myfaces-current23\api\target\myfaces-api-3.0.0-SNAPSHOT-tests.jar to org.apache.myfaces.core/myfaces-api/3.0.0-20181020.105126-11/myfaces-api-3.0.0-20181020.105126-11-tests.jar
[Fast Archiver] Compressed 2.23 MB of artifacts by 29.5% relative to #351
[JENKINS] Archiving F:\jenkins\jenkins-slave\workspace\myfaces-current23\shared\pom.xml to org.apache.myfaces.core.internal/myfaces-impl-shared/3.0.0-SNAPSHOT/myfaces-impl-shared-3.0.0-SNAPSHOT.pom
[JENKINS] Archiving F:\jenkins\jenkins-slave\workspace\myfaces-current23\impl\pom.xml to org.apache.myfaces.core/myfaces-impl/3.0.0-SNAPSHOT/myfaces-impl-3.0.0-SNAPSHOT.pom
[Fast Archiver] Compressed 66.65 KB of artifacts by 48.0% relative to #346
[JENKINS] Archiving F:\jenkins\jenkins-slave\workspace\myfaces-current23\bundle\pom.xml to org.apache.myfaces.core/myfaces-bundle/3.0.0-SNAPSHOT/myfaces-bundle-3.0.0-SNAPSHOT.pom
[JENKINS] Archiving <https://builds.apache.org/job/myfaces-current23/ws/pom.xml> to org.apache.myfaces.core/myfaces-core-module/3.0.0-SNAPSHOT/myfaces-core-module-3.0.0-SNAPSHOT.pom
[JENKINS] Archiving F:\jenkins\jenkins-slave\workspace\myfaces-current23\shared-public\pom.xml to org.apache.myfaces.core.internal/myfaces-impl-shared-public/3.0.0-SNAPSHOT/myfaces-impl-shared-public-3.0.0-SNAPSHOT.pom
[JENKINS] Archiving F:\jenkins\jenkins-slave\workspace\myfaces-current23\impl-test\pom.xml to org.apache.myfaces.core/myfaces-impl-test/3.0.0-SNAPSHOT/myfaces-impl-test-3.0.0-SNAPSHOT.pom
[JENKINS] Archiving F:\jenkins\jenkins-slave\workspace\myfaces-current23\parent\pom.xml to org.apache.myfaces.core/myfaces-core-project/3.0.0-SNAPSHOT/myfaces-core-project-3.0.0-SNAPSHOT.pom
[JENKINS] Archiving F:\jenkins\jenkins-slave\workspace\myfaces-current23\parent\target\myfaces-core-project-3.0.0-SNAPSHOT-site.xml to org.apache.myfaces.core/myfaces-core-project/3.0.0-20181020.105022-16/myfaces-core-project-3.0.0-20181020.105022-16-site.xml
Sending e-mails to: commits@myfaces.apache.org grantsmith@apache.org tandraschko@apache.org
channel stopped
Java HotSpot(TM) 64-Bit Server VM warning: ignoring option MaxPermSize=256m; support was removed in 8.0

Build failed in Jenkins: myfaces-current23 #351

Posted by Apache Jenkins Server <je...@builds.apache.org>.
See <https://builds.apache.org/job/myfaces-current23/351/display/redirect?page=changes>

Changes:

[tandraschko] Moved API tests to Impl, to make API buildable, without depending on

------------------------------------------
[...truncated 124.67 KB...]

[WARNING] [WARNING] The variable _T has already been declared in the same scope...
,tv=parseFloat(dav);var _T ---> = <--- this;_T.browser={};

[WARNING] [WARNING] The variable tagNameStart has already been declared in the same scope...
,_tokenPos=0,_tokenForward=1,tagNameStart ---> = <--- (!tagNameStart)?BEGIN_TAG:tagNameStart;

[WARNING] [WARNING] The variable i has already been declared in the same scope...
&&params!=null){for(var i ---> = <--- 0,param;(param=params[

[WARNING] [WARNING] The variable param has already been declared in the same scope...
){for(var i=0,param ---> ; <--- (param=params[i]);

[WARNING] [WARNING] The symbol assigned is declared but is apparently never used.
This code can probably be written in a more efficient way.
}:function (){};var assigned ---> = <--- true;}if("function"!=typeof newCls

[WARNING] [WARNING] The symbol found is declared but is apparently never used.
This code can probably be written in a more efficient way.
obj,finalAttr,value);}var found ---> = <--- false;var prefix=(value)?

[WARNING] [WARNING] The symbol _tokenPos is declared but is apparently never used.
This code can probably be written in a more efficient way.
=-1,_contentEnd=-1,_tokenPos ---> = <--- 0,_tokenForward=1,tagNameStart=(

[WARNING] [WARNING] The symbol _tokenForward is declared but is apparently never used.
This code can probably be written in a more efficient way.
_contentEnd=-1,_tokenPos=0,_tokenForward ---> = <--- 1,tagNameStart=(!tagNameStart)?

[WARNING] [WARNING] The symbol _RT is declared but is apparently never used.
This code can probably be written in a more efficient way.
{var _Lang=this._Lang;var _RT ---> = <--- this._RT;var _Dom=this.

[WARNING] [WARNING] The symbol _Dom is declared but is apparently never used.
This code can probably be written in a more efficient way.
;var _RT=this._RT;var _Dom ---> = <--- this._Dom;try{var scopeThis=

[WARNING] [WARNING] The symbol _AJAXUTIL is declared but is apparently never used.
This code can probably be written in a more efficient way.
},getFormData:function (){var _AJAXUTIL ---> = <--- this._AJAXUTIL,myfacesOptions=this._context

[WARNING] [WARNING] The symbol myfacesOptions is declared but is apparently never used.
This code can probably be written in a more efficient way.
){var _AJAXUTIL=this._AJAXUTIL,myfacesOptions ---> = <--- this._context.myfaces;return this.

[WARNING] [WARNING] The symbol _Lang is declared but is apparently never used.
This code can probably be written in a more efficient way.
,fixViewStates:function (context){var _Lang ---> = <--- this._Lang;var mfInternal=context.

[WARNING] [WARNING] The symbol _Lang is declared but is apparently never used.
This code can probably be written in a more efficient way.
:function (context,theForm){var _Lang ---> = <--- this._Lang;var mfInternal=context.

[WARNING] [WARNING] The symbol prefix is declared but is apparently never used.
This code can probably be written in a more efficient way.
(context,value,identifier){var prefix ---> = <--- this._getPrefix(context);var sourceForm

[WARNING] [WARNING] The symbol self is declared but is apparently never used.
This code can probably be written in a more efficient way.
};var clientIdsByTokens={};var self ---> = <--- {};function Socket(channelToken,url
[INFO] jsf-minimal.js (342,554 bytes) ............................. compressed at 73%
[INFO] Object.js (3,563 bytes) .................................... compressed at 67%
[INFO] _EndImpl.js (1,552 bytes) .................................. compressed at 84%
[INFO] _ExtRuntime.js (7,643 bytes) ............................... compressed at 78%
[INFO] _RuntimeQuirks.js (2,130 bytes) ............................ compressed at 78%
[INFO] _StartImpl.js (1,729 bytes) ................................ compressed at 75%
[INFO] Messages.js (5,777 bytes) .................................. compressed at 47%
[INFO] Messages_de.js (5,949 bytes) ............................... compressed at 44%
[INFO] Messages_es.js (5,488 bytes) ............................... compressed at 39%
[INFO] Messages_fr.js (5,613 bytes) ............................... compressed at 41%
[INFO] Messages_it.js (5,179 bytes) ............................... compressed at 39%
[INFO] Messages_nl.js (5,196 bytes) ............................... compressed at 40%
[INFO] Messages_ru.js (5,935 bytes) ............................... compressed at 34%
[INFO] Messages_zh_CN.js (5,758 bytes) ............................ compressed at 52%
[INFO] Messages_zh_HK.js (6,090 bytes) ............................ compressed at 55%
[INFO] Messages_zh_TW.js (6,499 bytes) ............................ compressed at 58%
[INFO] BaseRequest.js (4,813 bytes) ............................... compressed at 82%
[INFO] FormData.js (2,588 bytes) .................................. compressed at 71%
[INFO] IFrame.js (12,067 bytes) ................................... compressed at 70%
[INFO] Xhr1.js (6,589 bytes) ...................................... compressed at 60%
[INFO] XhrConst.js (1,469 bytes) .................................. compressed at 84%
[INFO] _ExtAjaxRequest.js (2,726 bytes) ........................... compressed at 77%
[INFO] _ExtTransport.js (8,327 bytes) ............................. compressed at 85%

[WARNING] [WARNING] Found an undeclared symbol: jsf
,"partial/ajax");var viewState=decodeURIComponent(jsf ---> . <--- getViewState(this._sourceForm));viewState

[WARNING] [WARNING] The symbol jsf is declared but is apparently never used.
This code can probably be written in a more efficient way.
,"partial/ajax");var viewState=decodeURIComponent(jsf ---> . <--- getViewState(this._sourceForm));viewState
[INFO] _IFrameRequest.js (2,974 bytes) ............................ compressed at 74%
[INFO] _PartialSubmitUtils.js (5,264 bytes) ....................... compressed at 77%
[INFO] _DomExperimental.js (1,629 bytes) .......................... compressed at 75%
[INFO] _DomQuirks.js (25,781 bytes) ............................... compressed at 76%
[INFO] _ExtDom.js (13,061 bytes) .................................. compressed at 74%
[INFO] _ExtLang.js (4,363 bytes) .................................. compressed at 74%
[INFO] _LangQuirks.js (8,389 bytes) ............................... compressed at 77%
[INFO] _Logging.js (4,749 bytes) .................................. compressed at 66%
[INFO] ------------------------------------------------------------------------------
[INFO] compression saved 3,168 bytes
[INFO] 
[INFO] --- maven-compiler-plugin:3.6.1:compile (default-compile) @ myfaces-api ---
[INFO] Nothing to compile - all classes are up to date
[INFO] 
[INFO] --- maven-bundle-plugin:3.0.1:manifest (bundle-manifest) @ myfaces-api ---
[INFO] 
[INFO] --- maven-resources-plugin:2.5:testResources (default-testResources) @ myfaces-api ---
[debug] execute contextualize
[INFO] Using 'UTF-8' encoding to copy filtered resources.
[INFO] skip non existing resourceDirectory F:\jenkins\jenkins-slave\workspace\myfaces-current23\api\src\test\resources
[INFO] Copying 3 resources
[INFO] Copying 3 resources
[INFO] 
[INFO] --- maven-compiler-plugin:3.6.1:testCompile (default-testCompile) @ myfaces-api ---
[INFO] No sources to compile
[INFO] 
[INFO] --- maven-surefire-plugin:2.16:test (default-test) @ myfaces-api ---
[INFO] Skipping execution of surefire because it has already been run for this configuration
[JENKINS] Recording test results
[INFO] 
[INFO] --- maven-surefire-plugin:2.16:test (default) @ myfaces-api ---
[INFO] Skipping execution of surefire because it has already been run for this configuration
[JENKINS] Recording test results
[INFO] 
[INFO] --- maven-jar-plugin:2.2:jar (default-jar) @ myfaces-api ---
[INFO] Building jar: F:\jenkins\jenkins-slave\workspace\myfaces-current23\api\target\myfaces-api-3.0.0-SNAPSHOT.jar
[INFO] 
[INFO] >>> maven-source-plugin:2.2.1:jar (attach-source) > generate-sources @ myfaces-api >>>
[INFO] 
[INFO] --- maven-enforcer-plugin:1.4.1:enforce (enforce-maven-version) @ myfaces-api ---
[INFO] 
[INFO] --- build-helper-maven-plugin:1.9.1:parse-version (parse-version) @ myfaces-api ---
[INFO] 
[INFO] --- myfaces-builder-plugin:1.0.10:build-metadata (default) @ myfaces-api ---
[INFO] model is up to date
[INFO] 
[INFO] --- myfaces-builder-plugin:1.0.10:make-components (makecomp) @ myfaces-api ---
[INFO] generated component files are up to date
[WARNING] Failed to getClass for org.apache.maven.plugin.source.SourceJarMojo
[INFO] 
[INFO] <<< maven-source-plugin:2.2.1:jar (attach-source) < generate-sources @ myfaces-api <<<
[INFO] 
[INFO] 
[INFO] --- maven-source-plugin:2.2.1:jar (attach-source) @ myfaces-api ---
[INFO] Building jar: F:\jenkins\jenkins-slave\workspace\myfaces-current23\api\target\myfaces-api-3.0.0-SNAPSHOT-sources.jar
[INFO] 
[INFO] --- maven-site-plugin:3.3:attach-descriptor (attach-descriptor) @ myfaces-api ---
[INFO] 
[INFO] --- maven-jar-plugin:2.2:test-jar (default) @ myfaces-api ---
[INFO] Building jar: F:\jenkins\jenkins-slave\workspace\myfaces-current23\api\target\myfaces-api-3.0.0-SNAPSHOT-tests.jar
[INFO] 
[INFO] --- maven-checkstyle-plugin:2.17:check (verify-style) @ myfaces-api ---
[INFO] Starting audit...
Audit done.
[INFO] 
[INFO] --- maven-install-plugin:2.5.2:install (default-install) @ myfaces-api ---
[INFO] Installing F:\jenkins\jenkins-slave\workspace\myfaces-current23\api\target\myfaces-api-3.0.0-SNAPSHOT.jar to f:\jenkins\jenkins-slave\maven-repositories\0\org\apache\myfaces\core\myfaces-api\3.0.0-SNAPSHOT\myfaces-api-3.0.0-SNAPSHOT.jar
[INFO] Installing F:\jenkins\jenkins-slave\workspace\myfaces-current23\api\pom.xml to f:\jenkins\jenkins-slave\maven-repositories\0\org\apache\myfaces\core\myfaces-api\3.0.0-SNAPSHOT\myfaces-api-3.0.0-SNAPSHOT.pom
[INFO] Installing F:\jenkins\jenkins-slave\workspace\myfaces-current23\api\target\myfaces-api-3.0.0-SNAPSHOT-sources.jar to f:\jenkins\jenkins-slave\maven-repositories\0\org\apache\myfaces\core\myfaces-api\3.0.0-SNAPSHOT\myfaces-api-3.0.0-SNAPSHOT-sources.jar
[INFO] Installing F:\jenkins\jenkins-slave\workspace\myfaces-current23\api\target\myfaces-api-3.0.0-SNAPSHOT-tests.jar to f:\jenkins\jenkins-slave\maven-repositories\0\org\apache\myfaces\core\myfaces-api\3.0.0-SNAPSHOT\myfaces-api-3.0.0-SNAPSHOT-tests.jar
[INFO] Installing F:\jenkins\jenkins-slave\workspace\myfaces-current23\api\target\myfaces-api-3.0.0-SNAPSHOT-sources.jar to f:\jenkins\jenkins-slave\maven-repositories\0\org\apache\myfaces\core\myfaces-api\3.0.0-SNAPSHOT\myfaces-api-3.0.0-SNAPSHOT-sources.jar
[INFO] Installing F:\jenkins\jenkins-slave\workspace\myfaces-current23\api\target\myfaces-api-3.0.0-SNAPSHOT-tests.jar to f:\jenkins\jenkins-slave\maven-repositories\0\org\apache\myfaces\core\myfaces-api\3.0.0-SNAPSHOT\myfaces-api-3.0.0-SNAPSHOT-tests.jar
[INFO] 
[INFO] --- maven-deploy-plugin:2.8.2:deploy (default-deploy) @ myfaces-api ---
[INFO] Downloading from apache.snapshots.https: https://repository.apache.org/content/repositories/snapshots/org/apache/myfaces/core/myfaces-api/3.0.0-SNAPSHOT/maven-metadata.xml
[INFO] Downloaded from apache.snapshots.https: https://repository.apache.org/content/repositories/snapshots/org/apache/myfaces/core/myfaces-api/3.0.0-SNAPSHOT/maven-metadata.xml (1.2 kB at 1.9 kB/s)
[INFO] Uploading to apache.snapshots.https: https://repository.apache.org/content/repositories/snapshots/org/apache/myfaces/core/myfaces-api/3.0.0-SNAPSHOT/myfaces-api-3.0.0-20181020.102506-10.jar
[INFO] Uploaded to apache.snapshots.https: https://repository.apache.org/content/repositories/snapshots/org/apache/myfaces/core/myfaces-api/3.0.0-SNAPSHOT/myfaces-api-3.0.0-20181020.102506-10.jar (1.3 MB at 686 kB/s)
[INFO] Uploading to apache.snapshots.https: https://repository.apache.org/content/repositories/snapshots/org/apache/myfaces/core/myfaces-api/3.0.0-SNAPSHOT/myfaces-api-3.0.0-20181020.102506-10.pom
[INFO] Uploaded to apache.snapshots.https: https://repository.apache.org/content/repositories/snapshots/org/apache/myfaces/core/myfaces-api/3.0.0-SNAPSHOT/myfaces-api-3.0.0-20181020.102506-10.pom (34 kB at 27 kB/s)
[INFO] Downloading from apache.snapshots.https: https://repository.apache.org/content/repositories/snapshots/org/apache/myfaces/core/myfaces-api/maven-metadata.xml
[INFO] Downloaded from apache.snapshots.https: https://repository.apache.org/content/repositories/snapshots/org/apache/myfaces/core/myfaces-api/maven-metadata.xml (674 B at 1.0 kB/s)
[INFO] Uploading to apache.snapshots.https: https://repository.apache.org/content/repositories/snapshots/org/apache/myfaces/core/myfaces-api/3.0.0-SNAPSHOT/maven-metadata.xml
[INFO] Uploaded to apache.snapshots.https: https://repository.apache.org/content/repositories/snapshots/org/apache/myfaces/core/myfaces-api/3.0.0-SNAPSHOT/maven-metadata.xml (1.2 kB at 1.0 kB/s)
[INFO] Uploading to apache.snapshots.https: https://repository.apache.org/content/repositories/snapshots/org/apache/myfaces/core/myfaces-api/maven-metadata.xml
[INFO] Uploaded to apache.snapshots.https: https://repository.apache.org/content/repositories/snapshots/org/apache/myfaces/core/myfaces-api/maven-metadata.xml (653 B at 542 B/s)
[INFO] Uploading to apache.snapshots.https: https://repository.apache.org/content/repositories/snapshots/org/apache/myfaces/core/myfaces-api/3.0.0-SNAPSHOT/myfaces-api-3.0.0-20181020.102506-10-sources.jar
[INFO] Uploaded to apache.snapshots.https: https://repository.apache.org/content/repositories/snapshots/org/apache/myfaces/core/myfaces-api/3.0.0-SNAPSHOT/myfaces-api-3.0.0-20181020.102506-10-sources.jar (972 kB at 544 kB/s)
[INFO] Uploading to apache.snapshots.https: https://repository.apache.org/content/repositories/snapshots/org/apache/myfaces/core/myfaces-api/3.0.0-SNAPSHOT/maven-metadata.xml
[INFO] Uploaded to apache.snapshots.https: https://repository.apache.org/content/repositories/snapshots/org/apache/myfaces/core/myfaces-api/3.0.0-SNAPSHOT/maven-metadata.xml (1.2 kB at 1.1 kB/s)
[INFO] Uploading to apache.snapshots.https: https://repository.apache.org/content/repositories/snapshots/org/apache/myfaces/core/myfaces-api/3.0.0-SNAPSHOT/myfaces-api-3.0.0-20181020.102506-10-tests.jar
[INFO] Uploaded to apache.snapshots.https: https://repository.apache.org/content/repositories/snapshots/org/apache/myfaces/core/myfaces-api/3.0.0-SNAPSHOT/myfaces-api-3.0.0-20181020.102506-10-tests.jar (12 kB at 10 kB/s)
[INFO] Uploading to apache.snapshots.https: https://repository.apache.org/content/repositories/snapshots/org/apache/myfaces/core/myfaces-api/3.0.0-SNAPSHOT/maven-metadata.xml
[INFO] Uploaded to apache.snapshots.https: https://repository.apache.org/content/repositories/snapshots/org/apache/myfaces/core/myfaces-api/3.0.0-SNAPSHOT/maven-metadata.xml (1.2 kB at 1.1 kB/s)
[INFO] Uploading to apache.snapshots.https: https://repository.apache.org/content/repositories/snapshots/org/apache/myfaces/core/myfaces-api/3.0.0-SNAPSHOT/myfaces-api-3.0.0-20181020.102506-10-sources.jar
[INFO] Uploaded to apache.snapshots.https: https://repository.apache.org/content/repositories/snapshots/org/apache/myfaces/core/myfaces-api/3.0.0-SNAPSHOT/myfaces-api-3.0.0-20181020.102506-10-sources.jar (972 kB at 544 kB/s)
[INFO] Uploading to apache.snapshots.https: https://repository.apache.org/content/repositories/snapshots/org/apache/myfaces/core/myfaces-api/3.0.0-SNAPSHOT/maven-metadata.xml
[INFO] Uploaded to apache.snapshots.https: https://repository.apache.org/content/repositories/snapshots/org/apache/myfaces/core/myfaces-api/3.0.0-SNAPSHOT/maven-metadata.xml (1.2 kB at 1.0 kB/s)
[INFO] Uploading to apache.snapshots.https: https://repository.apache.org/content/repositories/snapshots/org/apache/myfaces/core/myfaces-api/3.0.0-SNAPSHOT/myfaces-api-3.0.0-20181020.102506-10-tests.jar
[INFO] Uploaded to apache.snapshots.https: https://repository.apache.org/content/repositories/snapshots/org/apache/myfaces/core/myfaces-api/3.0.0-SNAPSHOT/myfaces-api-3.0.0-20181020.102506-10-tests.jar (12 kB at 10 kB/s)
[INFO] Uploading to apache.snapshots.https: https://repository.apache.org/content/repositories/snapshots/org/apache/myfaces/core/myfaces-api/3.0.0-SNAPSHOT/maven-metadata.xml
[INFO] Uploaded to apache.snapshots.https: https://repository.apache.org/content/repositories/snapshots/org/apache/myfaces/core/myfaces-api/3.0.0-SNAPSHOT/maven-metadata.xml (1.2 kB at 1.1 kB/s)
[INFO] 
[INFO] ------------------------------------------------------------------------
[INFO] Building Apache MyFaces Core 3.0 - Impl Shared Public 3.0.0-SNAPSHOT
[INFO] ------------------------------------------------------------------------
[INFO] Downloading from tomcat: http://tomcat.apache.org/dev/dist/m2-repository/org/apache/myfaces/test/myfaces-test30/1.0.9-SNAPSHOT/maven-metadata.xml
[INFO] Downloading from Nexus: http://repository.apache.org/snapshots/org/apache/myfaces/test/myfaces-test30/1.0.9-SNAPSHOT/maven-metadata.xml
[INFO] Downloading from apache-snapshots: http://repository.apache.org/snapshots/org/apache/myfaces/test/myfaces-test30/1.0.9-SNAPSHOT/maven-metadata.xml
[INFO] Downloading from apache-snapshots: http://repository.apache.org/snapshots/org/apache/myfaces/test/myfaces-test30/1.0.9-SNAPSHOT/myfaces-test30-1.0.9-SNAPSHOT.pom
[INFO] Downloading from tomcat: http://tomcat.apache.org/dev/dist/m2-repository/org/apache/myfaces/test/myfaces-test30/1.0.9-SNAPSHOT/myfaces-test30-1.0.9-SNAPSHOT.pom
[WARNING] The POM for org.apache.myfaces.test:myfaces-test30:jar:1.0.9-SNAPSHOT is missing, no dependency information available
[INFO] Downloading from apache-snapshots: http://repository.apache.org/snapshots/org/apache/myfaces/test/myfaces-test30/1.0.9-SNAPSHOT/myfaces-test30-1.0.9-SNAPSHOT.jar
[INFO] Downloading from tomcat: http://tomcat.apache.org/dev/dist/m2-repository/org/apache/myfaces/test/myfaces-test30/1.0.9-SNAPSHOT/myfaces-test30-1.0.9-SNAPSHOT.jar
[INFO] ------------------------------------------------------------------------
[INFO] Reactor Summary:
[INFO] 
[INFO] Apache MyFaces Core 3.0 - Parent ................... SUCCESS [ 25.198 s]
[INFO] Apache MyFaces Core 3.0 - API ...................... SUCCESS [01:20 min]
[INFO] Apache MyFaces Core 3.0 - Impl Shared Public ....... FAILURE [  1.199 s]
[INFO] Apache MyFaces Core 3.0 - Impl Shared .............. SKIPPED
[INFO] Apache MyFaces Core 3.0 - Impl ..................... SKIPPED
[INFO] Apache MyFaces Core 3.0 - OSGi Bundle .............. SKIPPED
[INFO] Apache MyFaces Core 3.0 - Impl Test ................ SKIPPED
[INFO] Apache MyFaces Core 3.0 ............................ SKIPPED
[INFO] ------------------------------------------------------------------------
[INFO] BUILD FAILURE
[INFO] ------------------------------------------------------------------------
[INFO] Total time: 02:01 min
[INFO] Finished at: 2018-10-20T03:25:28-07:00
[INFO] Final Memory: 74M/681M
[INFO] ------------------------------------------------------------------------
[ERROR] Failed to execute goal on project myfaces-impl-shared-public: Could not resolve dependencies for project org.apache.myfaces.core.internal:myfaces-impl-shared-public:jar:3.0.0-SNAPSHOT: Could not find artifact org.apache.myfaces.test:myfaces-test30:jar:1.0.9-SNAPSHOT in apache-snapshots (http://repository.apache.org/snapshots/) -> [Help 1]
[ERROR] 
[ERROR] To see the full stack trace of the errors, re-run Maven with the -e switch.
[ERROR] Re-run Maven using the -X switch to enable full debug logging.
[ERROR] 
[ERROR] For more information about the errors and possible solutions, please read the following articles:
[ERROR] [Help 1] http://cwiki.apache.org/confluence/display/MAVEN/DependencyResolutionException
[ERROR] 
[ERROR] After correcting the problems, you can resume the build with the command
[ERROR]   mvn <goals> -rf :myfaces-impl-shared-public
[JENKINS] Archiving F:\jenkins\jenkins-slave\workspace\myfaces-current23\api\pom.xml to org.apache.myfaces.core/myfaces-api/3.0.0-SNAPSHOT/myfaces-api-3.0.0-SNAPSHOT.pom
[JENKINS] Archiving F:\jenkins\jenkins-slave\workspace\myfaces-current23\api\target\myfaces-api-3.0.0-SNAPSHOT.jar to org.apache.myfaces.core/myfaces-api/3.0.0-20181020.102506-10/myfaces-api-3.0.0-20181020.102506-10.jar
[JENKINS] Archiving F:\jenkins\jenkins-slave\workspace\myfaces-current23\api\target\myfaces-api-3.0.0-SNAPSHOT-sources.jar to org.apache.myfaces.core/myfaces-api/3.0.0-20181020.102506-10/myfaces-api-3.0.0-20181020.102506-10-sources.jar
[JENKINS] Archiving F:\jenkins\jenkins-slave\workspace\myfaces-current23\api\target\myfaces-api-3.0.0-SNAPSHOT-tests.jar to org.apache.myfaces.core/myfaces-api/3.0.0-20181020.102506-10/myfaces-api-3.0.0-20181020.102506-10-tests.jar
[JENKINS] Archiving F:\jenkins\jenkins-slave\workspace\myfaces-current23\shared\pom.xml to org.apache.myfaces.core.internal/myfaces-impl-shared/3.0.0-SNAPSHOT/myfaces-impl-shared-3.0.0-SNAPSHOT.pom
[JENKINS] Archiving F:\jenkins\jenkins-slave\workspace\myfaces-current23\impl\pom.xml to org.apache.myfaces.core/myfaces-impl/3.0.0-SNAPSHOT/myfaces-impl-3.0.0-SNAPSHOT.pom
[Fast Archiver] Compressed 66.65 KB of artifacts by 48.0% relative to #346
[JENKINS] Archiving F:\jenkins\jenkins-slave\workspace\myfaces-current23\bundle\pom.xml to org.apache.myfaces.core/myfaces-bundle/3.0.0-SNAPSHOT/myfaces-bundle-3.0.0-SNAPSHOT.pom
[JENKINS] Archiving <https://builds.apache.org/job/myfaces-current23/ws/pom.xml> to org.apache.myfaces.core/myfaces-core-module/3.0.0-SNAPSHOT/myfaces-core-module-3.0.0-SNAPSHOT.pom
[JENKINS] Archiving F:\jenkins\jenkins-slave\workspace\myfaces-current23\shared-public\pom.xml to org.apache.myfaces.core.internal/myfaces-impl-shared-public/3.0.0-SNAPSHOT/myfaces-impl-shared-public-3.0.0-SNAPSHOT.pom
[JENKINS] Archiving F:\jenkins\jenkins-slave\workspace\myfaces-current23\impl-test\pom.xml to org.apache.myfaces.core/myfaces-impl-test/3.0.0-SNAPSHOT/myfaces-impl-test-3.0.0-SNAPSHOT.pom
[JENKINS] Archiving F:\jenkins\jenkins-slave\workspace\myfaces-current23\parent\pom.xml to org.apache.myfaces.core/myfaces-core-project/3.0.0-SNAPSHOT/myfaces-core-project-3.0.0-SNAPSHOT.pom
[JENKINS] Archiving F:\jenkins\jenkins-slave\workspace\myfaces-current23\parent\target\myfaces-core-project-3.0.0-SNAPSHOT-site.xml to org.apache.myfaces.core/myfaces-core-project/3.0.0-20181020.102351-15/myfaces-core-project-3.0.0-20181020.102351-15-site.xml
Sending e-mails to: commits@myfaces.apache.org grantsmith@apache.org tandraschko@apache.org
Sending e-mails to: commits@myfaces.apache.org grantsmith@apache.org tandraschko@apache.org
channel stopped
Java HotSpot(TM) 64-Bit Server VM warning: ignoring option MaxPermSize=256m; support was removed in 8.0