You are viewing a plain text version of this content. The canonical link for it is here.
Posted to commits@myfaces.apache.org by Apache Jenkins Server <je...@builds.apache.org> on 2014/06/22 18:24:52 UTC
Build failed in Jenkins: myfaces-current11 #1173
See <https://builds.apache.org/job/myfaces-current11/1173/>
------------------------------------------
[...truncated 1141 lines...]
Jun 22, 2014 9:24:21 AM org.apache.myfaces.shared_impl.config.MyfacesConfig getBooleanInitParameter
INFO: No context init parameter 'org.apache.myfaces.PRETTY_HTML' found, using default value true
Jun 22, 2014 9:24:21 AM org.apache.myfaces.shared_impl.config.MyfacesConfig getBooleanInitParameter
INFO: No context init parameter 'org.apache.myfaces.ALLOW_JAVASCRIPT' found, using default value true
Jun 22, 2014 9:24:21 AM org.apache.myfaces.shared_impl.config.MyfacesConfig getBooleanInitParameter
INFO: No context init parameter 'org.apache.myfaces.READONLY_AS_DISABLED_FOR_SELECTS' found, using default value true
Jun 22, 2014 9:24:21 AM org.apache.myfaces.shared_impl.config.MyfacesConfig getBooleanInitParameter
INFO: No context init parameter 'org.apache.myfaces.RENDER_VIEWSTATE_ID' found, using default value true
Jun 22, 2014 9:24:21 AM org.apache.myfaces.shared_impl.config.MyfacesConfig getBooleanInitParameter
INFO: No context init parameter 'org.apache.myfaces.STRICT_XHTML_LINKS' found, using default value true
Jun 22, 2014 9:24:21 AM org.apache.myfaces.shared_impl.config.MyfacesConfig getLongInitParameter
INFO: No context init parameter 'org.apache.myfaces.CONFIG_REFRESH_PERIOD' found, using default value 2
Jun 22, 2014 9:24:21 AM org.apache.myfaces.shared_impl.config.MyfacesConfig createAndInitializeMyFacesConfig
INFO: Tomahawk jar not available. Autoscrolling, DetectJavascript, AddResourceClass and CheckExtensionsFilter are disabled now.
Jun 22, 2014 9:24:21 AM org.apache.myfaces.shared_impl.config.MyfacesConfig createAndInitializeMyFacesConfig
INFO: Starting up Tomahawk on the MyFaces-JSF-Implementation
Tests run: 2, Failures: 0, Errors: 0, Skipped: 0, Time elapsed: 0.013 sec
Running org.apache.myfaces.renderkit.html.HtmlSecretRendererTest
WARNING: Component _id0 just got an automatic id, because there was no id assigned yet. If this component was created dynamically (i.e. not by a JSP tag) you should assign it an explicit static id or assign it the id you get from the createUniqueId from the current UIViewRoot component right after creation!
WARNING: Component _id0 just got an automatic id, because there was no id assigned yet. If this component was created dynamically (i.e. not by a JSP tag) you should assign it an explicit static id or assign it the id you get from the createUniqueId from the current UIViewRoot component right after creation!
Tests run: 2, Failures: 0, Errors: 0, Skipped: 0, Time elapsed: 0.021 sec
Running org.apache.myfaces.renderkit.html.HtmlImageRendererTest
Jun 22, 2014 9:24:21 AM org.apache.myfaces.shared_impl.renderkit.html.HtmlImageRendererBase encodeEnd
WARNING: ALT attribute is missing for : img1
Jun 22, 2014 9:24:21 AM org.apache.myfaces.shared_impl.renderkit.html.HtmlImageRendererBase encodeEnd
WARNING: ALT attribute is missing for : img1
Jun 22, 2014 9:24:21 AM org.apache.myfaces.shared_impl.renderkit.html.HtmlImageRendererBase encodeEnd
WARNING: ALT attribute is missing for : img1
Tests run: 3, Failures: 0, Errors: 0, Skipped: 0, Time elapsed: 0.023 sec
Running org.apache.myfaces.renderkit.html.HtmlCheckboxRendererTest
WARNING: Component _id0 just got an automatic id, because there was no id assigned yet. If this component was created dynamically (i.e. not by a JSP tag) you should assign it an explicit static id or assign it the id you get from the createUniqueId from the current UIViewRoot component right after creation!
WARNING: Component _id0 just got an automatic id, because there was no id assigned yet. If this component was created dynamically (i.e. not by a JSP tag) you should assign it an explicit static id or assign it the id you get from the createUniqueId from the current UIViewRoot component right after creation!
Tests run: 2, Failures: 0, Errors: 0, Skipped: 0, Time elapsed: 0.016 sec
Running org.apache.myfaces.renderkit.html.HtmlTextareaRendererTest
WARNING: Component _id0 just got an automatic id, because there was no id assigned yet. If this component was created dynamically (i.e. not by a JSP tag) you should assign it an explicit static id or assign it the id you get from the createUniqueId from the current UIViewRoot component right after creation!
WARNING: Component _id0 just got an automatic id, because there was no id assigned yet. If this component was created dynamically (i.e. not by a JSP tag) you should assign it an explicit static id or assign it the id you get from the createUniqueId from the current UIViewRoot component right after creation!
WARNING: Component _id0 just got an automatic id, because there was no id assigned yet. If this component was created dynamically (i.e. not by a JSP tag) you should assign it an explicit static id or assign it the id you get from the createUniqueId from the current UIViewRoot component right after creation!
Tests run: 3, Failures: 0, Errors: 0, Skipped: 0, Time elapsed: 0.009 sec
Running org.apache.myfaces.renderkit.html.HtmlLabelRendererTest
WARNING: Component _id0 just got an automatic id, because there was no id assigned yet. If this component was created dynamically (i.e. not by a JSP tag) you should assign it an explicit static id or assign it the id you get from the createUniqueId from the current UIViewRoot component right after creation!
Jun 22, 2014 9:24:21 AM org.apache.myfaces.shared_impl.renderkit.RendererUtils getClientId
INFO: Unable to find component 'compId' (calling findComponent on component '_id0'). We'll try to return a guessed client-id anyways - this will be a problem if you put the referenced component into a different naming-container. If this is the case, you can always use the full client-id.
Tests run: 1, Failures: 0, Errors: 0, Skipped: 0, Time elapsed: 0.012 sec
Running org.apache.myfaces.renderkit.html.HtmlMenuRendererTest
WARNING: Component _id0 just got an automatic id, because there was no id assigned yet. If this component was created dynamically (i.e. not by a JSP tag) you should assign it an explicit static id or assign it the id you get from the createUniqueId from the current UIViewRoot component right after creation!
WARNING: Component _id0 just got an automatic id, because there was no id assigned yet. If this component was created dynamically (i.e. not by a JSP tag) you should assign it an explicit static id or assign it the id you get from the createUniqueId from the current UIViewRoot component right after creation!
Tests run: 2, Failures: 0, Errors: 0, Skipped: 0, Time elapsed: 0.014 sec
Running org.apache.myfaces.el.PropertyResolverTestCase
Tests run: 1, Failures: 0, Errors: 0, Skipped: 0, Time elapsed: 0.005 sec
Running org.apache.myfaces.renderkit.html.HtmlMessageRendererTest
WARNING: Component _id0 just got an automatic id, because there was no id assigned yet. If this component was created dynamically (i.e. not by a JSP tag) you should assign it an explicit static id or assign it the id you get from the createUniqueId from the current UIViewRoot component right after creation!
WARNING: Component _id0 just got an automatic id, because there was no id assigned yet. If this component was created dynamically (i.e. not by a JSP tag) you should assign it an explicit static id or assign it the id you get from the createUniqueId from the current UIViewRoot component right after creation!
Tests run: 2, Failures: 0, Errors: 0, Skipped: 0, Time elapsed: 0.016 sec
Results :
Tests run: 48, Failures: 0, Errors: 0, Skipped: 0
[JENKINS] Recording test results
[INFO]
[INFO] --- maven-jar-plugin:2.3.2:jar (default-jar) @ myfaces-impl ---
[INFO] Building jar: F:\jenkins\jenkins-slave\workspace\myfaces-current11\current11\core\impl\target\myfaces-impl-1.1.11-SNAPSHOT.jar
[INFO]
[INFO] --- maven-site-plugin:3.0:attach-descriptor (attach-descriptor) @ myfaces-impl ---
[INFO]
[INFO] >>> maven-source-plugin:2.0.4:jar (attach-source) @ myfaces-impl >>>
[INFO]
[INFO] --- myfaces-builder-plugin:1.0.10:build-metadata (makemyfacesmetadata) @ myfaces-impl ---
[INFO] model is up to date
[INFO]
[INFO] --- myfaces-builder-plugin:1.0.10:make-config (makefacesconfig) @ myfaces-impl ---
[INFO] generated file standard-faces-config.xml is up to date
[INFO]
[INFO] --- myfaces-builder-plugin:1.0.10:make-tags (make_tags) @ myfaces-impl ---
[INFO] generated component tag files are up to date
[INFO]
[INFO] --- myfaces-builder-plugin:1.0.10:make-config (makecoretld) @ myfaces-impl ---
[INFO] generated file myfaces_core.tld is up to date
[INFO]
[INFO] --- myfaces-builder-plugin:1.0.10:make-config (makehtmltld) @ myfaces-impl ---
[INFO] generated file myfaces_html.tld is up to date
[WARNING] Failed to getClass for org.apache.maven.plugin.source.SourceJarMojo
[INFO]
[INFO] <<< maven-source-plugin:2.0.4:jar (attach-source) @ myfaces-impl <<<
[INFO]
[INFO] --- maven-source-plugin:2.0.4:jar (attach-source) @ myfaces-impl ---
[INFO] Building jar: F:\jenkins\jenkins-slave\workspace\myfaces-current11\current11\core\impl\target\myfaces-impl-1.1.11-SNAPSHOT-sources.jar
[INFO]
[INFO] --- maven-checkstyle-plugin:2.6:check (verify-style) @ myfaces-impl ---
[INFO]
[INFO]
[INFO] --- maven-install-plugin:2.3.1:install (default-install) @ myfaces-impl ---
[INFO] Installing F:\jenkins\jenkins-slave\workspace\myfaces-current11\current11\core\impl\target\myfaces-impl-1.1.11-SNAPSHOT.jar to f:\jenkins\jenkins-slave\maven-repositories\0\org\apache\myfaces\core\myfaces-impl\1.1.11-SNAPSHOT\myfaces-impl-1.1.11-SNAPSHOT.jar
[INFO] Installing F:\jenkins\jenkins-slave\workspace\myfaces-current11\current11\core\impl\pom.xml to f:\jenkins\jenkins-slave\maven-repositories\0\org\apache\myfaces\core\myfaces-impl\1.1.11-SNAPSHOT\myfaces-impl-1.1.11-SNAPSHOT.pom
[INFO] Installing F:\jenkins\jenkins-slave\workspace\myfaces-current11\current11\core\impl\target\myfaces-impl-1.1.11-SNAPSHOT-sources.jar to f:\jenkins\jenkins-slave\maven-repositories\0\org\apache\myfaces\core\myfaces-impl\1.1.11-SNAPSHOT\myfaces-impl-1.1.11-SNAPSHOT-sources.jar
[INFO]
[INFO] ------------------------------------------------------------------------
[INFO] Building Build Project 1.1.8-SNAPSHOT
[INFO] ------------------------------------------------------------------------
[INFO]
[INFO] --- maven-remote-resources-plugin:1.1:process (default) @ myfaces-base ---
[INFO] Setting property: classpath.resource.loader.class => 'org.codehaus.plexus.velocity.ContextClassLoaderResourceLoader'.
[INFO] Setting property: velocimacro.messages.on => 'false'.
[INFO] Setting property: resource.loader => 'classpath'.
[INFO] Setting property: resource.manager.logwhenfound => 'false'.
[INFO]
[INFO] --- maven-install-plugin:2.3:install (default-install) @ myfaces-base ---
[INFO] Installing <https://builds.apache.org/job/myfaces-current11/ws/current11\pom.xml> to f:\jenkins\jenkins-slave\maven-repositories\0\org\apache\myfaces\myfaces-base\1.1.8-SNAPSHOT\myfaces-base-1.1.8-SNAPSHOT.pom
[INFO] ------------------------------------------------------------------------
[INFO] Reactor Summary:
[INFO]
[INFO] Apache MyFaces Shared For JSF 1.1 - Project ....... SUCCESS [21.112s]
[INFO] Apache MyFaces Shared For JSF 1.1 - Core .......... SUCCESS [22.985s]
[INFO] MyFaces Shared Impl ............................... SUCCESS [11.677s]
[INFO] MyFaces Shared Tomahawk ........................... SUCCESS [5.452s]
[INFO] Apache MyFaces Shared - Orchestra ................. SUCCESS [6.137s]
[INFO] Apache MyFaces JSF-1.1 Core Project ............... SUCCESS [8.157s]
[INFO] Apache MyFaces JSF-1.1 API ........................ SUCCESS [20.797s]
[INFO] Apache MyFaces JSF-1.1 Implementation ............. SUCCESS [18.427s]
[INFO] Build Project ..................................... SUCCESS [2.343s]
[INFO] ------------------------------------------------------------------------
[INFO] BUILD SUCCESS
[INFO] ------------------------------------------------------------------------
[INFO] Total time: 2:03.657s
[INFO] Finished at: Sun Jun 22 09:24:30 PDT 2014
[INFO] Final Memory: 31M/76M
[INFO] ------------------------------------------------------------------------
Waiting for Jenkins to finish collecting data
[JENKINS] Archiving F:\jenkins\jenkins-slave\workspace\myfaces-current11\current11\shared\shared-tomahawk\pom.xml to org.apache.myfaces.shared/myfaces-shared-tomahawk/2.0.15-SNAPSHOT/myfaces-shared-tomahawk-2.0.15-SNAPSHOT.pom
[JENKINS] Archiving F:\jenkins\jenkins-slave\workspace\myfaces-current11\current11\shared\shared-tomahawk\target\myfaces-shared-tomahawk-2.0.15-SNAPSHOT.jar to org.apache.myfaces.shared/myfaces-shared-tomahawk/2.0.15-SNAPSHOT/myfaces-shared-tomahawk-2.0.15-SNAPSHOT.jar
[JENKINS] Archiving F:\jenkins\jenkins-slave\workspace\myfaces-current11\current11\shared\shared-tomahawk\target\myfaces-shared-tomahawk-2.0.15-SNAPSHOT-sources.jar to org.apache.myfaces.shared/myfaces-shared-tomahawk/2.0.15-SNAPSHOT/myfaces-shared-tomahawk-2.0.15-SNAPSHOT-sources.jar
Sending artifact delta relative to myfaces-current11 » MyFaces Shared Tomahawk #1172
Archived 3 artifacts
Archive block size is 32768
Received 11 blocks and 128752 bytes
Compression is 73.7%
Took 0.29 sec
[JENKINS] Archiving F:\jenkins\jenkins-slave\workspace\myfaces-current11\current11\core\impl\pom.xml to org.apache.myfaces.core/myfaces-impl/1.1.11-SNAPSHOT/myfaces-impl-1.1.11-SNAPSHOT.pom
[JENKINS] Archiving F:\jenkins\jenkins-slave\workspace\myfaces-current11\current11\core\impl\target\myfaces-impl-1.1.11-SNAPSHOT.jar to org.apache.myfaces.core/myfaces-impl/1.1.11-SNAPSHOT/myfaces-impl-1.1.11-SNAPSHOT.jar
[JENKINS] Archiving F:\jenkins\jenkins-slave\workspace\myfaces-current11\current11\core\impl\target\myfaces-impl-1.1.11-SNAPSHOT-sources.jar to org.apache.myfaces.core/myfaces-impl/1.1.11-SNAPSHOT/myfaces-impl-1.1.11-SNAPSHOT-sources.jar
Sending artifact delta relative to myfaces-current11 » Apache MyFaces JSF-1.1 Implementation #1172
Archived 3 artifacts
Archive block size is 32768
Received 34 blocks and 216737 bytes
Compression is 83.7%
Took 1.9 sec
[JENKINS] Archiving F:\jenkins\jenkins-slave\workspace\myfaces-current11\current11\shared\shared-impl\pom.xml to org.apache.myfaces.shared/myfaces-shared-impl/2.0.15-SNAPSHOT/myfaces-shared-impl-2.0.15-SNAPSHOT.pom
[JENKINS] Archiving F:\jenkins\jenkins-slave\workspace\myfaces-current11\current11\shared\shared-impl\target\myfaces-shared-impl-2.0.15-SNAPSHOT.jar to org.apache.myfaces.shared/myfaces-shared-impl/2.0.15-SNAPSHOT/myfaces-shared-impl-2.0.15-SNAPSHOT.jar
[JENKINS] Archiving F:\jenkins\jenkins-slave\workspace\myfaces-current11\current11\shared\shared-impl\target\myfaces-shared-impl-2.0.15-SNAPSHOT-sources.jar to org.apache.myfaces.shared/myfaces-shared-impl/2.0.15-SNAPSHOT/myfaces-shared-impl-2.0.15-SNAPSHOT-sources.jar
Sending artifact delta relative to myfaces-current11 » MyFaces Shared Impl #1172
Archived 3 artifacts
Archive block size is 32768
Received 11 blocks and 125676 bytes
Compression is 74.1%
Took 0.32 sec
[JENKINS] Archiving F:\jenkins\jenkins-slave\workspace\myfaces-current11\current11\shared\core\pom.xml to org.apache.myfaces.shared/myfaces-shared-core/2.0.15-SNAPSHOT/myfaces-shared-core-2.0.15-SNAPSHOT.pom
[JENKINS] Archiving F:\jenkins\jenkins-slave\workspace\myfaces-current11\current11\shared\core\target\myfaces-shared-core-2.0.15-SNAPSHOT.jar to org.apache.myfaces.shared/myfaces-shared-core/2.0.15-SNAPSHOT/myfaces-shared-core-2.0.15-SNAPSHOT.jar
[JENKINS] Archiving F:\jenkins\jenkins-slave\workspace\myfaces-current11\current11\shared\core\target\myfaces-shared-core-2.0.15-SNAPSHOT-sources.jar to org.apache.myfaces.shared/myfaces-shared-core/2.0.15-SNAPSHOT/myfaces-shared-core-2.0.15-SNAPSHOT-sources.jar
Sending artifact delta relative to myfaces-current11 » Apache MyFaces Shared For JSF 1.1 - Core #1172
Archived 3 artifacts
Archive block size is 32768
Received 11 blocks and 120867 bytes
Compression is 74.9%
Took 0.24 sec
[JENKINS] Archiving F:\jenkins\jenkins-slave\workspace\myfaces-current11\current11\core\api\pom.xml to org.apache.myfaces.core/myfaces-api/1.1.11-SNAPSHOT/myfaces-api-1.1.11-SNAPSHOT.pom
[JENKINS] Archiving F:\jenkins\jenkins-slave\workspace\myfaces-current11\current11\core\api\target\myfaces-api-1.1.11-SNAPSHOT.jar to org.apache.myfaces.core/myfaces-api/1.1.11-SNAPSHOT/myfaces-api-1.1.11-SNAPSHOT.jar
[JENKINS] Archiving F:\jenkins\jenkins-slave\workspace\myfaces-current11\current11\core\api\target\myfaces-api-1.1.11-SNAPSHOT-sources.jar to org.apache.myfaces.core/myfaces-api/1.1.11-SNAPSHOT/myfaces-api-1.1.11-SNAPSHOT-sources.jar
Sending artifact delta relative to myfaces-current11 » Apache MyFaces JSF-1.1 API #1172
Archived 3 artifacts
Archive block size is 32768
Received 18 blocks and 178083 bytes
Compression is 76.8%
Took 0.46 sec
[JENKINS] Archiving F:\jenkins\jenkins-slave\workspace\myfaces-current11\current11\shared\shared-orchestra\pom.xml to org.apache.myfaces.shared/myfaces-shared-orchestra/2.0.15-SNAPSHOT/myfaces-shared-orchestra-2.0.15-SNAPSHOT.pom
[JENKINS] Archiving F:\jenkins\jenkins-slave\workspace\myfaces-current11\current11\shared\shared-orchestra\target\myfaces-shared-orchestra-2.0.15-SNAPSHOT.jar to org.apache.myfaces.shared/myfaces-shared-orchestra/2.0.15-SNAPSHOT/myfaces-shared-orchestra-2.0.15-SNAPSHOT.jar
[JENKINS] Archiving F:\jenkins\jenkins-slave\workspace\myfaces-current11\current11\shared\shared-orchestra\target\myfaces-shared-orchestra-2.0.15-SNAPSHOT-sources.jar to org.apache.myfaces.shared/myfaces-shared-orchestra/2.0.15-SNAPSHOT/myfaces-shared-orchestra-2.0.15-SNAPSHOT-sources.jar
Sending artifact delta relative to myfaces-current11 » Apache MyFaces Shared - Orchestra #1172
Archived 3 artifacts
Archive block size is 32768
Received 11 blocks and 129076 bytes
Compression is 73.6%
Took 1.8 sec
[JENKINS] Archiving F:\jenkins\jenkins-slave\workspace\myfaces-current11\current11\shared\pom.xml to org.apache.myfaces.shared/myfaces-shared-project/2.0.15-SNAPSHOT/myfaces-shared-project-2.0.15-SNAPSHOT.pom
[JENKINS] Archiving F:\jenkins\jenkins-slave\workspace\myfaces-current11\current11\shared\target\myfaces-shared-project-2.0.15-SNAPSHOT-site.xml to org.apache.myfaces.shared/myfaces-shared-project/2.0.15-SNAPSHOT/myfaces-shared-project-2.0.15-SNAPSHOT-site.xml
Sending artifact delta relative to myfaces-current11 » Apache MyFaces Shared For JSF 1.1 - Project #1172
Archived 2 artifacts
Archive block size is 32768
Received 0 blocks and 10288 bytes
Compression is 0.0%
Took 91 ms
[JENKINS] Archiving F:\jenkins\jenkins-slave\workspace\myfaces-current11\current11\core\pom.xml to org.apache.myfaces.core/myfaces-core-project/1.1.11-SNAPSHOT/myfaces-core-project-1.1.11-SNAPSHOT.pom
[JENKINS] Archiving F:\jenkins\jenkins-slave\workspace\myfaces-current11\current11\core\target\myfaces-core-project-1.1.11-SNAPSHOT-site.xml to org.apache.myfaces.core/myfaces-core-project/1.1.11-SNAPSHOT/myfaces-core-project-1.1.11-SNAPSHOT-site.xml
Sending artifact delta relative to myfaces-current11 » Apache MyFaces JSF-1.1 Core Project #1172
Archived 2 artifacts
Archive block size is 32768
Received 0 blocks and 20788 bytes
Compression is 0.0%
Took 86 ms
[JENKINS] Archiving <https://builds.apache.org/job/myfaces-current11/ws/current11\pom.xml> to org.apache.myfaces/myfaces-base/1.1.8-SNAPSHOT/myfaces-base-1.1.8-SNAPSHOT.pom
Sending artifact delta relative to myfaces-current11 » Build Project #1172
Archived 1 artifacts
Archive block size is 32768
Received 0 blocks and 1172 bytes
Compression is 0.0%
Took 77 ms
channel stopped
Maven RedeployPublisher use remote windows2 maven settings from : f:\jenkins\tools\maven\latest/conf/settings.xml
[ERROR] uniqueVersion == false is not anymore supported in maven 3
[INFO] Deployment in https://repository.apache.org/content/repositories/snapshots (id=apache.snapshots.https,uniqueVersion=false)
Deploying the main artifact myfaces-base-1.1.8-SNAPSHOT.pom
Downloading: https://repository.apache.org/content/repositories/snapshots/org/apache/myfaces/myfaces-base/1.1.8-SNAPSHOT/maven-metadata.xml
Downloaded: https://repository.apache.org/content/repositories/snapshots/org/apache/myfaces/myfaces-base/1.1.8-SNAPSHOT/maven-metadata.xml (611 B at 3.1 KB/sec)
Uploading: https://repository.apache.org/content/repositories/snapshots/org/apache/myfaces/myfaces-base/1.1.8-SNAPSHOT/myfaces-base-1.1.8-20140622.162446-553.pom
ERROR: Failed to deploy artifacts: Could not transfer artifact org.apache.myfaces:myfaces-base:pom:1.1.8-20140622.162446-553 from/to apache.snapshots.https (https://repository.apache.org/content/repositories/snapshots): Failed to transfer file: https://repository.apache.org/content/repositories/snapshots/org/apache/myfaces/myfaces-base/1.1.8-SNAPSHOT/myfaces-base-1.1.8-20140622.162446-553.pom. Return code is: 401, ReasonPhrase: Unauthorized.
org.apache.maven.artifact.deployer.ArtifactDeploymentException: Failed to deploy artifacts: Could not transfer artifact org.apache.myfaces:myfaces-base:pom:1.1.8-20140622.162446-553 from/to apache.snapshots.https (https://repository.apache.org/content/repositories/snapshots): Failed to transfer file: https://repository.apache.org/content/repositories/snapshots/org/apache/myfaces/myfaces-base/1.1.8-SNAPSHOT/myfaces-base-1.1.8-20140622.162446-553.pom. Return code is: 401, ReasonPhrase: Unauthorized.
at org.apache.maven.artifact.deployer.DefaultArtifactDeployer.deploy(DefaultArtifactDeployer.java:143)
at hudson.maven.reporters.MavenArtifactRecord.deploy(MavenArtifactRecord.java:193)
at hudson.maven.RedeployPublisher.perform(RedeployPublisher.java:176)
at hudson.tasks.BuildStepMonitor$1.perform(BuildStepMonitor.java:20)
at hudson.model.AbstractBuild$AbstractBuildExecution.perform(AbstractBuild.java:804)
at hudson.model.AbstractBuild$AbstractBuildExecution.performAllBuildSteps(AbstractBuild.java:776)
at hudson.maven.MavenModuleSetBuild$MavenModuleSetBuildExecution.post2(MavenModuleSetBuild.java:1040)
at hudson.model.AbstractBuild$AbstractBuildExecution.post(AbstractBuild.java:725)
at hudson.model.Run.execute(Run.java:1701)
at hudson.maven.MavenModuleSetBuild.run(MavenModuleSetBuild.java:529)
at hudson.model.ResourceController.execute(ResourceController.java:88)
at hudson.model.Executor.run(Executor.java:231)
Caused by: org.eclipse.aether.deployment.DeploymentException: Failed to deploy artifacts: Could not transfer artifact org.apache.myfaces:myfaces-base:pom:1.1.8-20140622.162446-553 from/to apache.snapshots.https (https://repository.apache.org/content/repositories/snapshots): Failed to transfer file: https://repository.apache.org/content/repositories/snapshots/org/apache/myfaces/myfaces-base/1.1.8-SNAPSHOT/myfaces-base-1.1.8-20140622.162446-553.pom. Return code is: 401, ReasonPhrase: Unauthorized.
at org.eclipse.aether.internal.impl.DefaultDeployer.deploy(DefaultDeployer.java:341)
at org.eclipse.aether.internal.impl.DefaultDeployer.deploy(DefaultDeployer.java:269)
at org.eclipse.aether.internal.impl.DefaultRepositorySystem.deploy(DefaultRepositorySystem.java:413)
at org.apache.maven.artifact.deployer.DefaultArtifactDeployer.deploy(DefaultArtifactDeployer.java:139)
... 11 more
Caused by: org.eclipse.aether.transfer.ArtifactTransferException: Could not transfer artifact org.apache.myfaces:myfaces-base:pom:1.1.8-20140622.162446-553 from/to apache.snapshots.https (https://repository.apache.org/content/repositories/snapshots): Failed to transfer file: https://repository.apache.org/content/repositories/snapshots/org/apache/myfaces/myfaces-base/1.1.8-SNAPSHOT/myfaces-base-1.1.8-20140622.162446-553.pom. Return code is: 401, ReasonPhrase: Unauthorized.
at org.eclipse.aether.connector.wagon.WagonRepositoryConnector$6.wrap(WagonRepositoryConnector.java:1016)
at org.eclipse.aether.connector.wagon.WagonRepositoryConnector$6.wrap(WagonRepositoryConnector.java:1004)
at org.eclipse.aether.connector.wagon.WagonRepositoryConnector$PutTask.run(WagonRepositoryConnector.java:895)
at org.eclipse.aether.connector.wagon.WagonRepositoryConnector.put(WagonRepositoryConnector.java:522)
at org.eclipse.aether.internal.impl.DefaultDeployer.deploy(DefaultDeployer.java:335)
... 14 more
Caused by: org.apache.maven.wagon.TransferFailedException: Failed to transfer file: https://repository.apache.org/content/repositories/snapshots/org/apache/myfaces/myfaces-base/1.1.8-SNAPSHOT/myfaces-base-1.1.8-20140622.162446-553.pom. Return code is: 401, ReasonPhrase: Unauthorized.
at org.apache.maven.wagon.shared.http4.AbstractHttpClientWagon.put(AbstractHttpClientWagon.java:626)
at org.apache.maven.wagon.shared.http4.AbstractHttpClientWagon.put(AbstractHttpClientWagon.java:524)
at org.apache.maven.wagon.shared.http4.AbstractHttpClientWagon.put(AbstractHttpClientWagon.java:505)
at org.apache.maven.wagon.shared.http4.AbstractHttpClientWagon.put(AbstractHttpClientWagon.java:485)
at org.eclipse.aether.connector.wagon.WagonRepositoryConnector$PutTask.run(WagonRepositoryConnector.java:871)
... 16 more
[INFO] Deployment failed after 2.5 sec
Build step 'Deploy artifacts to Maven repository' changed build result to FAILURE
Jenkins build is back to normal : myfaces-current11 #1179
Posted by Apache Jenkins Server <je...@builds.apache.org>.
See <https://builds.apache.org/job/myfaces-current11/1179/>
Build failed in Jenkins: myfaces-current11 #1178
Posted by Apache Jenkins Server <je...@builds.apache.org>.
See <https://builds.apache.org/job/myfaces-current11/1178/>
------------------------------------------
[...truncated 1139 lines...]
Jun 28, 2014 3:22:24 AM org.apache.myfaces.shared_impl.config.MyfacesConfig getBooleanInitParameter
INFO: No context init parameter 'org.apache.myfaces.PRETTY_HTML' found, using default value true
Jun 28, 2014 3:22:24 AM org.apache.myfaces.shared_impl.config.MyfacesConfig getBooleanInitParameter
INFO: No context init parameter 'org.apache.myfaces.ALLOW_JAVASCRIPT' found, using default value true
Jun 28, 2014 3:22:24 AM org.apache.myfaces.shared_impl.config.MyfacesConfig getBooleanInitParameter
INFO: No context init parameter 'org.apache.myfaces.READONLY_AS_DISABLED_FOR_SELECTS' found, using default value true
Jun 28, 2014 3:22:24 AM org.apache.myfaces.shared_impl.config.MyfacesConfig getBooleanInitParameter
INFO: No context init parameter 'org.apache.myfaces.RENDER_VIEWSTATE_ID' found, using default value true
Jun 28, 2014 3:22:24 AM org.apache.myfaces.shared_impl.config.MyfacesConfig getBooleanInitParameter
INFO: No context init parameter 'org.apache.myfaces.STRICT_XHTML_LINKS' found, using default value true
Jun 28, 2014 3:22:24 AM org.apache.myfaces.shared_impl.config.MyfacesConfig getLongInitParameter
INFO: No context init parameter 'org.apache.myfaces.CONFIG_REFRESH_PERIOD' found, using default value 2
Jun 28, 2014 3:22:24 AM org.apache.myfaces.shared_impl.config.MyfacesConfig createAndInitializeMyFacesConfig
INFO: Tomahawk jar not available. Autoscrolling, DetectJavascript, AddResourceClass and CheckExtensionsFilter are disabled now.
Jun 28, 2014 3:22:24 AM org.apache.myfaces.shared_impl.config.MyfacesConfig createAndInitializeMyFacesConfig
INFO: Starting up Tomahawk on the MyFaces-JSF-Implementation
Tests run: 2, Failures: 0, Errors: 0, Skipped: 0, Time elapsed: 0.011 sec
Running org.apache.myfaces.renderkit.html.HtmlSecretRendererTest
WARNING: Component _id0 just got an automatic id, because there was no id assigned yet. If this component was created dynamically (i.e. not by a JSP tag) you should assign it an explicit static id or assign it the id you get from the createUniqueId from the current UIViewRoot component right after creation!
WARNING: Component _id0 just got an automatic id, because there was no id assigned yet. If this component was created dynamically (i.e. not by a JSP tag) you should assign it an explicit static id or assign it the id you get from the createUniqueId from the current UIViewRoot component right after creation!
Tests run: 2, Failures: 0, Errors: 0, Skipped: 0, Time elapsed: 0.02 sec
Running org.apache.myfaces.renderkit.html.HtmlImageRendererTest
Jun 28, 2014 3:22:24 AM org.apache.myfaces.shared_impl.renderkit.html.HtmlImageRendererBase encodeEnd
WARNING: ALT attribute is missing for : img1
Jun 28, 2014 3:22:24 AM org.apache.myfaces.shared_impl.renderkit.html.HtmlImageRendererBase encodeEnd
WARNING: ALT attribute is missing for : img1
Jun 28, 2014 3:22:24 AM org.apache.myfaces.shared_impl.renderkit.html.HtmlImageRendererBase encodeEnd
WARNING: ALT attribute is missing for : img1
Tests run: 3, Failures: 0, Errors: 0, Skipped: 0, Time elapsed: 0.038 sec
Running org.apache.myfaces.renderkit.html.HtmlCheckboxRendererTest
WARNING: Component _id0 just got an automatic id, because there was no id assigned yet. If this component was created dynamically (i.e. not by a JSP tag) you should assign it an explicit static id or assign it the id you get from the createUniqueId from the current UIViewRoot component right after creation!
WARNING: Component _id0 just got an automatic id, because there was no id assigned yet. If this component was created dynamically (i.e. not by a JSP tag) you should assign it an explicit static id or assign it the id you get from the createUniqueId from the current UIViewRoot component right after creation!
Tests run: 2, Failures: 0, Errors: 0, Skipped: 0, Time elapsed: 0.016 sec
Running org.apache.myfaces.renderkit.html.HtmlTextareaRendererTest
WARNING: Component _id0 just got an automatic id, because there was no id assigned yet. If this component was created dynamically (i.e. not by a JSP tag) you should assign it an explicit static id or assign it the id you get from the createUniqueId from the current UIViewRoot component right after creation!
WARNING: Component _id0 just got an automatic id, because there was no id assigned yet. If this component was created dynamically (i.e. not by a JSP tag) you should assign it an explicit static id or assign it the id you get from the createUniqueId from the current UIViewRoot component right after creation!
WARNING: Component _id0 just got an automatic id, because there was no id assigned yet. If this component was created dynamically (i.e. not by a JSP tag) you should assign it an explicit static id or assign it the id you get from the createUniqueId from the current UIViewRoot component right after creation!
Tests run: 3, Failures: 0, Errors: 0, Skipped: 0, Time elapsed: 0.011 sec
Running org.apache.myfaces.renderkit.html.HtmlLabelRendererTest
WARNING: Component _id0 just got an automatic id, because there was no id assigned yet. If this component was created dynamically (i.e. not by a JSP tag) you should assign it an explicit static id or assign it the id you get from the createUniqueId from the current UIViewRoot component right after creation!
Jun 28, 2014 3:22:24 AM org.apache.myfaces.shared_impl.renderkit.RendererUtils getClientId
INFO: Unable to find component 'compId' (calling findComponent on component '_id0'). We'll try to return a guessed client-id anyways - this will be a problem if you put the referenced component into a different naming-container. If this is the case, you can always use the full client-id.
Tests run: 1, Failures: 0, Errors: 0, Skipped: 0, Time elapsed: 0.015 sec
Running org.apache.myfaces.renderkit.html.HtmlMenuRendererTest
WARNING: Component _id0 just got an automatic id, because there was no id assigned yet. If this component was created dynamically (i.e. not by a JSP tag) you should assign it an explicit static id or assign it the id you get from the createUniqueId from the current UIViewRoot component right after creation!
WARNING: Component _id0 just got an automatic id, because there was no id assigned yet. If this component was created dynamically (i.e. not by a JSP tag) you should assign it an explicit static id or assign it the id you get from the createUniqueId from the current UIViewRoot component right after creation!
Tests run: 2, Failures: 0, Errors: 0, Skipped: 0, Time elapsed: 0.014 sec
Running org.apache.myfaces.el.PropertyResolverTestCase
Tests run: 1, Failures: 0, Errors: 0, Skipped: 0, Time elapsed: 0.006 sec
Running org.apache.myfaces.renderkit.html.HtmlMessageRendererTest
WARNING: Component _id0 just got an automatic id, because there was no id assigned yet. If this component was created dynamically (i.e. not by a JSP tag) you should assign it an explicit static id or assign it the id you get from the createUniqueId from the current UIViewRoot component right after creation!
WARNING: Component _id0 just got an automatic id, because there was no id assigned yet. If this component was created dynamically (i.e. not by a JSP tag) you should assign it an explicit static id or assign it the id you get from the createUniqueId from the current UIViewRoot component right after creation!
Tests run: 2, Failures: 0, Errors: 0, Skipped: 0, Time elapsed: 0.007 sec
Results :
Tests run: 48, Failures: 0, Errors: 0, Skipped: 0
[JENKINS] Recording test results
[INFO]
[INFO] --- maven-jar-plugin:2.3.2:jar (default-jar) @ myfaces-impl ---
[INFO] Building jar: F:\jenkins\jenkins-slave\workspace\myfaces-current11\current11\core\impl\target\myfaces-impl-1.1.11-SNAPSHOT.jar
[INFO]
[INFO] --- maven-site-plugin:3.0:attach-descriptor (attach-descriptor) @ myfaces-impl ---
[INFO]
[INFO] >>> maven-source-plugin:2.0.4:jar (attach-source) @ myfaces-impl >>>
[INFO]
[INFO] --- myfaces-builder-plugin:1.0.10:build-metadata (makemyfacesmetadata) @ myfaces-impl ---
[INFO] model is up to date
[INFO]
[INFO] --- myfaces-builder-plugin:1.0.10:make-config (makefacesconfig) @ myfaces-impl ---
[INFO] generated file standard-faces-config.xml is up to date
[INFO]
[INFO] --- myfaces-builder-plugin:1.0.10:make-tags (make_tags) @ myfaces-impl ---
[INFO] generated component tag files are up to date
[INFO]
[INFO] --- myfaces-builder-plugin:1.0.10:make-config (makecoretld) @ myfaces-impl ---
[INFO] generated file myfaces_core.tld is up to date
[INFO]
[INFO] --- myfaces-builder-plugin:1.0.10:make-config (makehtmltld) @ myfaces-impl ---
[INFO] generated file myfaces_html.tld is up to date
[WARNING] Failed to getClass for org.apache.maven.plugin.source.SourceJarMojo
[INFO]
[INFO] <<< maven-source-plugin:2.0.4:jar (attach-source) @ myfaces-impl <<<
[INFO]
[INFO] --- maven-source-plugin:2.0.4:jar (attach-source) @ myfaces-impl ---
[INFO] Building jar: F:\jenkins\jenkins-slave\workspace\myfaces-current11\current11\core\impl\target\myfaces-impl-1.1.11-SNAPSHOT-sources.jar
[INFO]
[INFO] --- maven-checkstyle-plugin:2.6:check (verify-style) @ myfaces-impl ---
[INFO]
[INFO]
[INFO] --- maven-install-plugin:2.3.1:install (default-install) @ myfaces-impl ---
[INFO] Installing F:\jenkins\jenkins-slave\workspace\myfaces-current11\current11\core\impl\target\myfaces-impl-1.1.11-SNAPSHOT.jar to f:\jenkins\jenkins-slave\maven-repositories\1\org\apache\myfaces\core\myfaces-impl\1.1.11-SNAPSHOT\myfaces-impl-1.1.11-SNAPSHOT.jar
[INFO] Installing F:\jenkins\jenkins-slave\workspace\myfaces-current11\current11\core\impl\pom.xml to f:\jenkins\jenkins-slave\maven-repositories\1\org\apache\myfaces\core\myfaces-impl\1.1.11-SNAPSHOT\myfaces-impl-1.1.11-SNAPSHOT.pom
[INFO] Installing F:\jenkins\jenkins-slave\workspace\myfaces-current11\current11\core\impl\target\myfaces-impl-1.1.11-SNAPSHOT-sources.jar to f:\jenkins\jenkins-slave\maven-repositories\1\org\apache\myfaces\core\myfaces-impl\1.1.11-SNAPSHOT\myfaces-impl-1.1.11-SNAPSHOT-sources.jar
[INFO]
[INFO] ------------------------------------------------------------------------
[INFO] Building Build Project 1.1.8-SNAPSHOT
[INFO] ------------------------------------------------------------------------
[INFO]
[INFO] --- maven-remote-resources-plugin:1.1:process (default) @ myfaces-base ---
[INFO] Setting property: classpath.resource.loader.class => 'org.codehaus.plexus.velocity.ContextClassLoaderResourceLoader'.
[INFO] Setting property: velocimacro.messages.on => 'false'.
[INFO] Setting property: resource.loader => 'classpath'.
[INFO] Setting property: resource.manager.logwhenfound => 'false'.
[INFO]
[INFO] --- maven-install-plugin:2.3:install (default-install) @ myfaces-base ---
[INFO] Installing <https://builds.apache.org/job/myfaces-current11/ws/current11\pom.xml> to f:\jenkins\jenkins-slave\maven-repositories\1\org\apache\myfaces\myfaces-base\1.1.8-SNAPSHOT\myfaces-base-1.1.8-SNAPSHOT.pom
[INFO] ------------------------------------------------------------------------
[INFO] Reactor Summary:
[INFO]
[INFO] Apache MyFaces Shared For JSF 1.1 - Project ....... SUCCESS [17.779s]
[INFO] Apache MyFaces Shared For JSF 1.1 - Core .......... SUCCESS [12.317s]
[INFO] MyFaces Shared Impl ............................... SUCCESS [7.627s]
[INFO] MyFaces Shared Tomahawk ........................... SUCCESS [6.219s]
[INFO] Apache MyFaces Shared - Orchestra ................. SUCCESS [6.708s]
[INFO] Apache MyFaces JSF-1.1 Core Project ............... SUCCESS [6.170s]
[INFO] Apache MyFaces JSF-1.1 API ........................ SUCCESS [18.924s]
[INFO] Apache MyFaces JSF-1.1 Implementation ............. SUCCESS [23.703s]
[INFO] Build Project ..................................... SUCCESS [2.059s]
[INFO] ------------------------------------------------------------------------
[INFO] BUILD SUCCESS
[INFO] ------------------------------------------------------------------------
[INFO] Total time: 1:46.648s
[INFO] Finished at: Sat Jun 28 03:22:38 PDT 2014
[INFO] Final Memory: 31M/76M
[INFO] ------------------------------------------------------------------------
Waiting for Jenkins to finish collecting data
[JENKINS] Archiving F:\jenkins\jenkins-slave\workspace\myfaces-current11\current11\shared\shared-tomahawk\pom.xml to org.apache.myfaces.shared/myfaces-shared-tomahawk/2.0.15-SNAPSHOT/myfaces-shared-tomahawk-2.0.15-SNAPSHOT.pom
[JENKINS] Archiving F:\jenkins\jenkins-slave\workspace\myfaces-current11\current11\shared\shared-tomahawk\target\myfaces-shared-tomahawk-2.0.15-SNAPSHOT.jar to org.apache.myfaces.shared/myfaces-shared-tomahawk/2.0.15-SNAPSHOT/myfaces-shared-tomahawk-2.0.15-SNAPSHOT.jar
[JENKINS] Archiving F:\jenkins\jenkins-slave\workspace\myfaces-current11\current11\shared\shared-tomahawk\target\myfaces-shared-tomahawk-2.0.15-SNAPSHOT-sources.jar to org.apache.myfaces.shared/myfaces-shared-tomahawk/2.0.15-SNAPSHOT/myfaces-shared-tomahawk-2.0.15-SNAPSHOT-sources.jar
Sending artifact delta relative to myfaces-current11 » MyFaces Shared Tomahawk #1177
Archived 3 artifacts
Archive block size is 32768
Received 11 blocks and 128752 bytes
Compression is 73.7%
Took 2.1 sec
[JENKINS] Archiving F:\jenkins\jenkins-slave\workspace\myfaces-current11\current11\core\impl\pom.xml to org.apache.myfaces.core/myfaces-impl/1.1.11-SNAPSHOT/myfaces-impl-1.1.11-SNAPSHOT.pom
[JENKINS] Archiving F:\jenkins\jenkins-slave\workspace\myfaces-current11\current11\core\impl\target\myfaces-impl-1.1.11-SNAPSHOT.jar to org.apache.myfaces.core/myfaces-impl/1.1.11-SNAPSHOT/myfaces-impl-1.1.11-SNAPSHOT.jar
[JENKINS] Archiving F:\jenkins\jenkins-slave\workspace\myfaces-current11\current11\core\impl\target\myfaces-impl-1.1.11-SNAPSHOT-sources.jar to org.apache.myfaces.core/myfaces-impl/1.1.11-SNAPSHOT/myfaces-impl-1.1.11-SNAPSHOT-sources.jar
Sending artifact delta relative to myfaces-current11 » Apache MyFaces JSF-1.1 Implementation #1177
Archived 3 artifacts
Archive block size is 32768
Received 34 blocks and 216737 bytes
Compression is 83.7%
Took 0.23 sec
[JENKINS] Archiving F:\jenkins\jenkins-slave\workspace\myfaces-current11\current11\shared\shared-impl\pom.xml to org.apache.myfaces.shared/myfaces-shared-impl/2.0.15-SNAPSHOT/myfaces-shared-impl-2.0.15-SNAPSHOT.pom
[JENKINS] Archiving F:\jenkins\jenkins-slave\workspace\myfaces-current11\current11\shared\shared-impl\target\myfaces-shared-impl-2.0.15-SNAPSHOT.jar to org.apache.myfaces.shared/myfaces-shared-impl/2.0.15-SNAPSHOT/myfaces-shared-impl-2.0.15-SNAPSHOT.jar
[JENKINS] Archiving F:\jenkins\jenkins-slave\workspace\myfaces-current11\current11\shared\shared-impl\target\myfaces-shared-impl-2.0.15-SNAPSHOT-sources.jar to org.apache.myfaces.shared/myfaces-shared-impl/2.0.15-SNAPSHOT/myfaces-shared-impl-2.0.15-SNAPSHOT-sources.jar
Sending artifact delta relative to myfaces-current11 » MyFaces Shared Impl #1177
Archived 3 artifacts
Archive block size is 32768
Received 11 blocks and 125676 bytes
Compression is 74.1%
Took 0.16 sec
[JENKINS] Archiving F:\jenkins\jenkins-slave\workspace\myfaces-current11\current11\shared\core\pom.xml to org.apache.myfaces.shared/myfaces-shared-core/2.0.15-SNAPSHOT/myfaces-shared-core-2.0.15-SNAPSHOT.pom
[JENKINS] Archiving F:\jenkins\jenkins-slave\workspace\myfaces-current11\current11\shared\core\target\myfaces-shared-core-2.0.15-SNAPSHOT.jar to org.apache.myfaces.shared/myfaces-shared-core/2.0.15-SNAPSHOT/myfaces-shared-core-2.0.15-SNAPSHOT.jar
[JENKINS] Archiving F:\jenkins\jenkins-slave\workspace\myfaces-current11\current11\shared\core\target\myfaces-shared-core-2.0.15-SNAPSHOT-sources.jar to org.apache.myfaces.shared/myfaces-shared-core/2.0.15-SNAPSHOT/myfaces-shared-core-2.0.15-SNAPSHOT-sources.jar
Sending artifact delta relative to myfaces-current11 » Apache MyFaces Shared For JSF 1.1 - Core #1177
Archived 3 artifacts
Archive block size is 32768
Received 11 blocks and 120867 bytes
Compression is 74.9%
Took 63 ms
[JENKINS] Archiving F:\jenkins\jenkins-slave\workspace\myfaces-current11\current11\core\api\pom.xml to org.apache.myfaces.core/myfaces-api/1.1.11-SNAPSHOT/myfaces-api-1.1.11-SNAPSHOT.pom
[JENKINS] Archiving F:\jenkins\jenkins-slave\workspace\myfaces-current11\current11\core\api\target\myfaces-api-1.1.11-SNAPSHOT.jar to org.apache.myfaces.core/myfaces-api/1.1.11-SNAPSHOT/myfaces-api-1.1.11-SNAPSHOT.jar
[JENKINS] Archiving F:\jenkins\jenkins-slave\workspace\myfaces-current11\current11\core\api\target\myfaces-api-1.1.11-SNAPSHOT-sources.jar to org.apache.myfaces.core/myfaces-api/1.1.11-SNAPSHOT/myfaces-api-1.1.11-SNAPSHOT-sources.jar
Sending artifact delta relative to myfaces-current11 » Apache MyFaces JSF-1.1 API #1177
Archived 3 artifacts
Archive block size is 32768
Received 18 blocks and 178083 bytes
Compression is 76.8%
Took 92 ms
[JENKINS] Archiving F:\jenkins\jenkins-slave\workspace\myfaces-current11\current11\shared\shared-orchestra\pom.xml to org.apache.myfaces.shared/myfaces-shared-orchestra/2.0.15-SNAPSHOT/myfaces-shared-orchestra-2.0.15-SNAPSHOT.pom
[JENKINS] Archiving F:\jenkins\jenkins-slave\workspace\myfaces-current11\current11\shared\shared-orchestra\target\myfaces-shared-orchestra-2.0.15-SNAPSHOT.jar to org.apache.myfaces.shared/myfaces-shared-orchestra/2.0.15-SNAPSHOT/myfaces-shared-orchestra-2.0.15-SNAPSHOT.jar
[JENKINS] Archiving F:\jenkins\jenkins-slave\workspace\myfaces-current11\current11\shared\shared-orchestra\target\myfaces-shared-orchestra-2.0.15-SNAPSHOT-sources.jar to org.apache.myfaces.shared/myfaces-shared-orchestra/2.0.15-SNAPSHOT/myfaces-shared-orchestra-2.0.15-SNAPSHOT-sources.jar
Sending artifact delta relative to myfaces-current11 » Apache MyFaces Shared - Orchestra #1177
Archived 3 artifacts
Archive block size is 32768
Received 11 blocks and 129076 bytes
Compression is 73.6%
Took 1.5 sec
[JENKINS] Archiving F:\jenkins\jenkins-slave\workspace\myfaces-current11\current11\shared\pom.xml to org.apache.myfaces.shared/myfaces-shared-project/2.0.15-SNAPSHOT/myfaces-shared-project-2.0.15-SNAPSHOT.pom
[JENKINS] Archiving F:\jenkins\jenkins-slave\workspace\myfaces-current11\current11\shared\target\myfaces-shared-project-2.0.15-SNAPSHOT-site.xml to org.apache.myfaces.shared/myfaces-shared-project/2.0.15-SNAPSHOT/myfaces-shared-project-2.0.15-SNAPSHOT-site.xml
Sending artifact delta relative to myfaces-current11 » Apache MyFaces Shared For JSF 1.1 - Project #1177
Archived 2 artifacts
Archive block size is 32768
Received 0 blocks and 10288 bytes
Compression is 0.0%
Took 56 ms
[JENKINS] Archiving F:\jenkins\jenkins-slave\workspace\myfaces-current11\current11\core\pom.xml to org.apache.myfaces.core/myfaces-core-project/1.1.11-SNAPSHOT/myfaces-core-project-1.1.11-SNAPSHOT.pom
[JENKINS] Archiving F:\jenkins\jenkins-slave\workspace\myfaces-current11\current11\core\target\myfaces-core-project-1.1.11-SNAPSHOT-site.xml to org.apache.myfaces.core/myfaces-core-project/1.1.11-SNAPSHOT/myfaces-core-project-1.1.11-SNAPSHOT-site.xml
Sending artifact delta relative to myfaces-current11 » Apache MyFaces JSF-1.1 Core Project #1177
Archived 2 artifacts
Archive block size is 32768
Received 0 blocks and 20788 bytes
Compression is 0.0%
Took 55 ms
[JENKINS] Archiving <https://builds.apache.org/job/myfaces-current11/ws/current11\pom.xml> to org.apache.myfaces/myfaces-base/1.1.8-SNAPSHOT/myfaces-base-1.1.8-SNAPSHOT.pom
Sending artifact delta relative to myfaces-current11 » Build Project #1177
Archived 1 artifacts
Archive block size is 32768
Received 0 blocks and 1172 bytes
Compression is 0.0%
Took 0.28 sec
channel stopped
Maven RedeployPublisher use remote windows2 maven settings from : f:\jenkins\tools\maven\latest/conf/settings.xml
[ERROR] uniqueVersion == false is not anymore supported in maven 3
[INFO] Deployment in https://repository.apache.org/content/repositories/snapshots (id=apache.snapshots.https,uniqueVersion=false)
Deploying the main artifact myfaces-base-1.1.8-SNAPSHOT.pom
Downloading: https://repository.apache.org/content/repositories/snapshots/org/apache/myfaces/myfaces-base/1.1.8-SNAPSHOT/maven-metadata.xml
Downloaded: https://repository.apache.org/content/repositories/snapshots/org/apache/myfaces/myfaces-base/1.1.8-SNAPSHOT/maven-metadata.xml (611 B at 0.8 KB/sec)
Uploading: https://repository.apache.org/content/repositories/snapshots/org/apache/myfaces/myfaces-base/1.1.8-SNAPSHOT/myfaces-base-1.1.8-20140628.102255-553.pom
ERROR: Failed to deploy artifacts: Could not transfer artifact org.apache.myfaces:myfaces-base:pom:1.1.8-20140628.102255-553 from/to apache.snapshots.https (https://repository.apache.org/content/repositories/snapshots): Failed to transfer file: https://repository.apache.org/content/repositories/snapshots/org/apache/myfaces/myfaces-base/1.1.8-SNAPSHOT/myfaces-base-1.1.8-20140628.102255-553.pom. Return code is: 401, ReasonPhrase: Unauthorized.
org.apache.maven.artifact.deployer.ArtifactDeploymentException: Failed to deploy artifacts: Could not transfer artifact org.apache.myfaces:myfaces-base:pom:1.1.8-20140628.102255-553 from/to apache.snapshots.https (https://repository.apache.org/content/repositories/snapshots): Failed to transfer file: https://repository.apache.org/content/repositories/snapshots/org/apache/myfaces/myfaces-base/1.1.8-SNAPSHOT/myfaces-base-1.1.8-20140628.102255-553.pom. Return code is: 401, ReasonPhrase: Unauthorized.
at org.apache.maven.artifact.deployer.DefaultArtifactDeployer.deploy(DefaultArtifactDeployer.java:143)
at hudson.maven.reporters.MavenArtifactRecord.deploy(MavenArtifactRecord.java:193)
at hudson.maven.RedeployPublisher.perform(RedeployPublisher.java:176)
at hudson.tasks.BuildStepMonitor$1.perform(BuildStepMonitor.java:20)
at hudson.model.AbstractBuild$AbstractBuildExecution.perform(AbstractBuild.java:804)
at hudson.model.AbstractBuild$AbstractBuildExecution.performAllBuildSteps(AbstractBuild.java:776)
at hudson.maven.MavenModuleSetBuild$MavenModuleSetBuildExecution.post2(MavenModuleSetBuild.java:1040)
at hudson.model.AbstractBuild$AbstractBuildExecution.post(AbstractBuild.java:725)
at hudson.model.Run.execute(Run.java:1701)
at hudson.maven.MavenModuleSetBuild.run(MavenModuleSetBuild.java:529)
at hudson.model.ResourceController.execute(ResourceController.java:88)
at hudson.model.Executor.run(Executor.java:231)
Caused by: org.eclipse.aether.deployment.DeploymentException: Failed to deploy artifacts: Could not transfer artifact org.apache.myfaces:myfaces-base:pom:1.1.8-20140628.102255-553 from/to apache.snapshots.https (https://repository.apache.org/content/repositories/snapshots): Failed to transfer file: https://repository.apache.org/content/repositories/snapshots/org/apache/myfaces/myfaces-base/1.1.8-SNAPSHOT/myfaces-base-1.1.8-20140628.102255-553.pom. Return code is: 401, ReasonPhrase: Unauthorized.
at org.eclipse.aether.internal.impl.DefaultDeployer.deploy(DefaultDeployer.java:341)
at org.eclipse.aether.internal.impl.DefaultDeployer.deploy(DefaultDeployer.java:269)
at org.eclipse.aether.internal.impl.DefaultRepositorySystem.deploy(DefaultRepositorySystem.java:413)
at org.apache.maven.artifact.deployer.DefaultArtifactDeployer.deploy(DefaultArtifactDeployer.java:139)
... 11 more
Caused by: org.eclipse.aether.transfer.ArtifactTransferException: Could not transfer artifact org.apache.myfaces:myfaces-base:pom:1.1.8-20140628.102255-553 from/to apache.snapshots.https (https://repository.apache.org/content/repositories/snapshots): Failed to transfer file: https://repository.apache.org/content/repositories/snapshots/org/apache/myfaces/myfaces-base/1.1.8-SNAPSHOT/myfaces-base-1.1.8-20140628.102255-553.pom. Return code is: 401, ReasonPhrase: Unauthorized.
at org.eclipse.aether.connector.wagon.WagonRepositoryConnector$6.wrap(WagonRepositoryConnector.java:1016)
at org.eclipse.aether.connector.wagon.WagonRepositoryConnector$6.wrap(WagonRepositoryConnector.java:1004)
at org.eclipse.aether.connector.wagon.WagonRepositoryConnector$PutTask.run(WagonRepositoryConnector.java:895)
at org.eclipse.aether.connector.wagon.WagonRepositoryConnector.put(WagonRepositoryConnector.java:522)
at org.eclipse.aether.internal.impl.DefaultDeployer.deploy(DefaultDeployer.java:335)
... 14 more
Caused by: org.apache.maven.wagon.TransferFailedException: Failed to transfer file: https://repository.apache.org/content/repositories/snapshots/org/apache/myfaces/myfaces-base/1.1.8-SNAPSHOT/myfaces-base-1.1.8-20140628.102255-553.pom. Return code is: 401, ReasonPhrase: Unauthorized.
at org.apache.maven.wagon.shared.http4.AbstractHttpClientWagon.put(AbstractHttpClientWagon.java:626)
at org.apache.maven.wagon.shared.http4.AbstractHttpClientWagon.put(AbstractHttpClientWagon.java:524)
at org.apache.maven.wagon.shared.http4.AbstractHttpClientWagon.put(AbstractHttpClientWagon.java:505)
at org.apache.maven.wagon.shared.http4.AbstractHttpClientWagon.put(AbstractHttpClientWagon.java:485)
at org.eclipse.aether.connector.wagon.WagonRepositoryConnector$PutTask.run(WagonRepositoryConnector.java:871)
... 16 more
[INFO] Deployment failed after 5.7 sec
Build step 'Deploy artifacts to Maven repository' changed build result to FAILURE
Build failed in Jenkins: myfaces-current11 #1177
Posted by Apache Jenkins Server <je...@builds.apache.org>.
See <https://builds.apache.org/job/myfaces-current11/1177/>
------------------------------------------
[...truncated 1139 lines...]
Jun 25, 2014 12:10:41 PM org.apache.myfaces.shared_impl.config.MyfacesConfig getBooleanInitParameter
INFO: No context init parameter 'org.apache.myfaces.PRETTY_HTML' found, using default value true
Jun 25, 2014 12:10:41 PM org.apache.myfaces.shared_impl.config.MyfacesConfig getBooleanInitParameter
INFO: No context init parameter 'org.apache.myfaces.ALLOW_JAVASCRIPT' found, using default value true
Jun 25, 2014 12:10:41 PM org.apache.myfaces.shared_impl.config.MyfacesConfig getBooleanInitParameter
INFO: No context init parameter 'org.apache.myfaces.READONLY_AS_DISABLED_FOR_SELECTS' found, using default value true
Jun 25, 2014 12:10:41 PM org.apache.myfaces.shared_impl.config.MyfacesConfig getBooleanInitParameter
INFO: No context init parameter 'org.apache.myfaces.RENDER_VIEWSTATE_ID' found, using default value true
Jun 25, 2014 12:10:41 PM org.apache.myfaces.shared_impl.config.MyfacesConfig getBooleanInitParameter
INFO: No context init parameter 'org.apache.myfaces.STRICT_XHTML_LINKS' found, using default value true
Jun 25, 2014 12:10:41 PM org.apache.myfaces.shared_impl.config.MyfacesConfig getLongInitParameter
INFO: No context init parameter 'org.apache.myfaces.CONFIG_REFRESH_PERIOD' found, using default value 2
Jun 25, 2014 12:10:41 PM org.apache.myfaces.shared_impl.config.MyfacesConfig createAndInitializeMyFacesConfig
INFO: Tomahawk jar not available. Autoscrolling, DetectJavascript, AddResourceClass and CheckExtensionsFilter are disabled now.
Jun 25, 2014 12:10:41 PM org.apache.myfaces.shared_impl.config.MyfacesConfig createAndInitializeMyFacesConfig
INFO: Starting up Tomahawk on the MyFaces-JSF-Implementation
Tests run: 2, Failures: 0, Errors: 0, Skipped: 0, Time elapsed: 0.013 sec
Running org.apache.myfaces.renderkit.html.HtmlSecretRendererTest
WARNING: Component _id0 just got an automatic id, because there was no id assigned yet. If this component was created dynamically (i.e. not by a JSP tag) you should assign it an explicit static id or assign it the id you get from the createUniqueId from the current UIViewRoot component right after creation!
WARNING: Component _id0 just got an automatic id, because there was no id assigned yet. If this component was created dynamically (i.e. not by a JSP tag) you should assign it an explicit static id or assign it the id you get from the createUniqueId from the current UIViewRoot component right after creation!
Tests run: 2, Failures: 0, Errors: 0, Skipped: 0, Time elapsed: 0.029 sec
Running org.apache.myfaces.renderkit.html.HtmlImageRendererTest
Jun 25, 2014 12:10:41 PM org.apache.myfaces.shared_impl.renderkit.html.HtmlImageRendererBase encodeEnd
WARNING: ALT attribute is missing for : img1
Jun 25, 2014 12:10:41 PM org.apache.myfaces.shared_impl.renderkit.html.HtmlImageRendererBase encodeEnd
WARNING: ALT attribute is missing for : img1
Jun 25, 2014 12:10:41 PM org.apache.myfaces.shared_impl.renderkit.html.HtmlImageRendererBase encodeEnd
WARNING: ALT attribute is missing for : img1
Tests run: 3, Failures: 0, Errors: 0, Skipped: 0, Time elapsed: 0.103 sec
Running org.apache.myfaces.renderkit.html.HtmlCheckboxRendererTest
WARNING: Component _id0 just got an automatic id, because there was no id assigned yet. If this component was created dynamically (i.e. not by a JSP tag) you should assign it an explicit static id or assign it the id you get from the createUniqueId from the current UIViewRoot component right after creation!
WARNING: Component _id0 just got an automatic id, because there was no id assigned yet. If this component was created dynamically (i.e. not by a JSP tag) you should assign it an explicit static id or assign it the id you get from the createUniqueId from the current UIViewRoot component right after creation!
Tests run: 2, Failures: 0, Errors: 0, Skipped: 0, Time elapsed: 0.081 sec
Running org.apache.myfaces.renderkit.html.HtmlTextareaRendererTest
WARNING: Component _id0 just got an automatic id, because there was no id assigned yet. If this component was created dynamically (i.e. not by a JSP tag) you should assign it an explicit static id or assign it the id you get from the createUniqueId from the current UIViewRoot component right after creation!
WARNING: Component _id0 just got an automatic id, because there was no id assigned yet. If this component was created dynamically (i.e. not by a JSP tag) you should assign it an explicit static id or assign it the id you get from the createUniqueId from the current UIViewRoot component right after creation!
WARNING: Component _id0 just got an automatic id, because there was no id assigned yet. If this component was created dynamically (i.e. not by a JSP tag) you should assign it an explicit static id or assign it the id you get from the createUniqueId from the current UIViewRoot component right after creation!
Tests run: 3, Failures: 0, Errors: 0, Skipped: 0, Time elapsed: 0.111 sec
Running org.apache.myfaces.renderkit.html.HtmlLabelRendererTest
WARNING: Component _id0 just got an automatic id, because there was no id assigned yet. If this component was created dynamically (i.e. not by a JSP tag) you should assign it an explicit static id or assign it the id you get from the createUniqueId from the current UIViewRoot component right after creation!
Jun 25, 2014 12:10:41 PM org.apache.myfaces.shared_impl.renderkit.RendererUtils getClientId
INFO: Unable to find component 'compId' (calling findComponent on component '_id0'). We'll try to return a guessed client-id anyways - this will be a problem if you put the referenced component into a different naming-container. If this is the case, you can always use the full client-id.
Tests run: 1, Failures: 0, Errors: 0, Skipped: 0, Time elapsed: 0.021 sec
Running org.apache.myfaces.renderkit.html.HtmlMenuRendererTest
WARNING: Component _id0 just got an automatic id, because there was no id assigned yet. If this component was created dynamically (i.e. not by a JSP tag) you should assign it an explicit static id or assign it the id you get from the createUniqueId from the current UIViewRoot component right after creation!
WARNING: Component _id0 just got an automatic id, because there was no id assigned yet. If this component was created dynamically (i.e. not by a JSP tag) you should assign it an explicit static id or assign it the id you get from the createUniqueId from the current UIViewRoot component right after creation!
Tests run: 2, Failures: 0, Errors: 0, Skipped: 0, Time elapsed: 0.029 sec
Running org.apache.myfaces.el.PropertyResolverTestCase
Tests run: 1, Failures: 0, Errors: 0, Skipped: 0, Time elapsed: 0.01 sec
Running org.apache.myfaces.renderkit.html.HtmlMessageRendererTest
WARNING: Component _id0 just got an automatic id, because there was no id assigned yet. If this component was created dynamically (i.e. not by a JSP tag) you should assign it an explicit static id or assign it the id you get from the createUniqueId from the current UIViewRoot component right after creation!
WARNING: Component _id0 just got an automatic id, because there was no id assigned yet. If this component was created dynamically (i.e. not by a JSP tag) you should assign it an explicit static id or assign it the id you get from the createUniqueId from the current UIViewRoot component right after creation!
Tests run: 2, Failures: 0, Errors: 0, Skipped: 0, Time elapsed: 0.012 sec
Results :
Tests run: 48, Failures: 0, Errors: 0, Skipped: 0
[JENKINS] Recording test results
[INFO]
[INFO] --- maven-jar-plugin:2.3.2:jar (default-jar) @ myfaces-impl ---
[INFO] Building jar: F:\jenkins\jenkins-slave\workspace\myfaces-current11\current11\core\impl\target\myfaces-impl-1.1.11-SNAPSHOT.jar
[INFO]
[INFO] --- maven-site-plugin:3.0:attach-descriptor (attach-descriptor) @ myfaces-impl ---
[INFO]
[INFO] >>> maven-source-plugin:2.0.4:jar (attach-source) @ myfaces-impl >>>
[INFO]
[INFO] --- myfaces-builder-plugin:1.0.10:build-metadata (makemyfacesmetadata) @ myfaces-impl ---
[INFO] model is up to date
[INFO]
[INFO] --- myfaces-builder-plugin:1.0.10:make-config (makefacesconfig) @ myfaces-impl ---
[INFO] generated file standard-faces-config.xml is up to date
[INFO]
[INFO] --- myfaces-builder-plugin:1.0.10:make-tags (make_tags) @ myfaces-impl ---
[INFO] generated component tag files are up to date
[INFO]
[INFO] --- myfaces-builder-plugin:1.0.10:make-config (makecoretld) @ myfaces-impl ---
[INFO] generated file myfaces_core.tld is up to date
[INFO]
[INFO] --- myfaces-builder-plugin:1.0.10:make-config (makehtmltld) @ myfaces-impl ---
[INFO] generated file myfaces_html.tld is up to date
[WARNING] Failed to getClass for org.apache.maven.plugin.source.SourceJarMojo
[INFO]
[INFO] <<< maven-source-plugin:2.0.4:jar (attach-source) @ myfaces-impl <<<
[INFO]
[INFO] --- maven-source-plugin:2.0.4:jar (attach-source) @ myfaces-impl ---
[INFO] Building jar: F:\jenkins\jenkins-slave\workspace\myfaces-current11\current11\core\impl\target\myfaces-impl-1.1.11-SNAPSHOT-sources.jar
[INFO]
[INFO] --- maven-checkstyle-plugin:2.6:check (verify-style) @ myfaces-impl ---
[INFO]
[INFO]
[INFO] --- maven-install-plugin:2.3.1:install (default-install) @ myfaces-impl ---
[INFO] Installing F:\jenkins\jenkins-slave\workspace\myfaces-current11\current11\core\impl\target\myfaces-impl-1.1.11-SNAPSHOT.jar to f:\jenkins\jenkins-slave\maven-repositories\0\org\apache\myfaces\core\myfaces-impl\1.1.11-SNAPSHOT\myfaces-impl-1.1.11-SNAPSHOT.jar
[INFO] Installing F:\jenkins\jenkins-slave\workspace\myfaces-current11\current11\core\impl\pom.xml to f:\jenkins\jenkins-slave\maven-repositories\0\org\apache\myfaces\core\myfaces-impl\1.1.11-SNAPSHOT\myfaces-impl-1.1.11-SNAPSHOT.pom
[INFO] Installing F:\jenkins\jenkins-slave\workspace\myfaces-current11\current11\core\impl\target\myfaces-impl-1.1.11-SNAPSHOT-sources.jar to f:\jenkins\jenkins-slave\maven-repositories\0\org\apache\myfaces\core\myfaces-impl\1.1.11-SNAPSHOT\myfaces-impl-1.1.11-SNAPSHOT-sources.jar
[INFO]
[INFO] ------------------------------------------------------------------------
[INFO] Building Build Project 1.1.8-SNAPSHOT
[INFO] ------------------------------------------------------------------------
[INFO]
[INFO] --- maven-remote-resources-plugin:1.1:process (default) @ myfaces-base ---
[INFO] Setting property: classpath.resource.loader.class => 'org.codehaus.plexus.velocity.ContextClassLoaderResourceLoader'.
[INFO] Setting property: velocimacro.messages.on => 'false'.
[INFO] Setting property: resource.loader => 'classpath'.
[INFO] Setting property: resource.manager.logwhenfound => 'false'.
[INFO]
[INFO] --- maven-install-plugin:2.3:install (default-install) @ myfaces-base ---
[INFO] Installing <https://builds.apache.org/job/myfaces-current11/ws/current11\pom.xml> to f:\jenkins\jenkins-slave\maven-repositories\0\org\apache\myfaces\myfaces-base\1.1.8-SNAPSHOT\myfaces-base-1.1.8-SNAPSHOT.pom
[INFO] ------------------------------------------------------------------------
[INFO] Reactor Summary:
[INFO]
[INFO] Apache MyFaces Shared For JSF 1.1 - Project ....... SUCCESS [17.231s]
[INFO] Apache MyFaces Shared For JSF 1.1 - Core .......... SUCCESS [17.772s]
[INFO] MyFaces Shared Impl ............................... SUCCESS [8.388s]
[INFO] MyFaces Shared Tomahawk ........................... SUCCESS [8.710s]
[INFO] Apache MyFaces Shared - Orchestra ................. SUCCESS [8.320s]
[INFO] Apache MyFaces JSF-1.1 Core Project ............... SUCCESS [10.035s]
[INFO] Apache MyFaces JSF-1.1 API ........................ SUCCESS [17.589s]
[INFO] Apache MyFaces JSF-1.1 Implementation ............. SUCCESS [27.348s]
[INFO] Build Project ..................................... SUCCESS [3.182s]
[INFO] ------------------------------------------------------------------------
[INFO] BUILD SUCCESS
[INFO] ------------------------------------------------------------------------
[INFO] Total time: 2:10.356s
[INFO] Finished at: Wed Jun 25 12:11:00 PDT 2014
[INFO] Final Memory: 31M/76M
[INFO] ------------------------------------------------------------------------
Waiting for Jenkins to finish collecting data
[JENKINS] Archiving F:\jenkins\jenkins-slave\workspace\myfaces-current11\current11\shared\shared-tomahawk\pom.xml to org.apache.myfaces.shared/myfaces-shared-tomahawk/2.0.15-SNAPSHOT/myfaces-shared-tomahawk-2.0.15-SNAPSHOT.pom
[JENKINS] Archiving F:\jenkins\jenkins-slave\workspace\myfaces-current11\current11\shared\shared-tomahawk\target\myfaces-shared-tomahawk-2.0.15-SNAPSHOT.jar to org.apache.myfaces.shared/myfaces-shared-tomahawk/2.0.15-SNAPSHOT/myfaces-shared-tomahawk-2.0.15-SNAPSHOT.jar
[JENKINS] Archiving F:\jenkins\jenkins-slave\workspace\myfaces-current11\current11\shared\shared-tomahawk\target\myfaces-shared-tomahawk-2.0.15-SNAPSHOT-sources.jar to org.apache.myfaces.shared/myfaces-shared-tomahawk/2.0.15-SNAPSHOT/myfaces-shared-tomahawk-2.0.15-SNAPSHOT-sources.jar
Sending artifact delta relative to myfaces-current11 » MyFaces Shared Tomahawk #1176
Archived 3 artifacts
Archive block size is 32768
Received 11 blocks and 128752 bytes
Compression is 73.7%
Took 2.5 sec
[JENKINS] Archiving F:\jenkins\jenkins-slave\workspace\myfaces-current11\current11\core\impl\pom.xml to org.apache.myfaces.core/myfaces-impl/1.1.11-SNAPSHOT/myfaces-impl-1.1.11-SNAPSHOT.pom
[JENKINS] Archiving F:\jenkins\jenkins-slave\workspace\myfaces-current11\current11\core\impl\target\myfaces-impl-1.1.11-SNAPSHOT.jar to org.apache.myfaces.core/myfaces-impl/1.1.11-SNAPSHOT/myfaces-impl-1.1.11-SNAPSHOT.jar
[JENKINS] Archiving F:\jenkins\jenkins-slave\workspace\myfaces-current11\current11\core\impl\target\myfaces-impl-1.1.11-SNAPSHOT-sources.jar to org.apache.myfaces.core/myfaces-impl/1.1.11-SNAPSHOT/myfaces-impl-1.1.11-SNAPSHOT-sources.jar
Sending artifact delta relative to myfaces-current11 » Apache MyFaces JSF-1.1 Implementation #1176
Archived 3 artifacts
Archive block size is 32768
Received 34 blocks and 216737 bytes
Compression is 83.7%
Took 2 sec
[JENKINS] Archiving F:\jenkins\jenkins-slave\workspace\myfaces-current11\current11\shared\shared-impl\pom.xml to org.apache.myfaces.shared/myfaces-shared-impl/2.0.15-SNAPSHOT/myfaces-shared-impl-2.0.15-SNAPSHOT.pom
[JENKINS] Archiving F:\jenkins\jenkins-slave\workspace\myfaces-current11\current11\shared\shared-impl\target\myfaces-shared-impl-2.0.15-SNAPSHOT.jar to org.apache.myfaces.shared/myfaces-shared-impl/2.0.15-SNAPSHOT/myfaces-shared-impl-2.0.15-SNAPSHOT.jar
[JENKINS] Archiving F:\jenkins\jenkins-slave\workspace\myfaces-current11\current11\shared\shared-impl\target\myfaces-shared-impl-2.0.15-SNAPSHOT-sources.jar to org.apache.myfaces.shared/myfaces-shared-impl/2.0.15-SNAPSHOT/myfaces-shared-impl-2.0.15-SNAPSHOT-sources.jar
Sending artifact delta relative to myfaces-current11 » MyFaces Shared Impl #1176
Archived 3 artifacts
Archive block size is 32768
Received 11 blocks and 125676 bytes
Compression is 74.1%
Took 0.27 sec
[JENKINS] Archiving F:\jenkins\jenkins-slave\workspace\myfaces-current11\current11\shared\core\pom.xml to org.apache.myfaces.shared/myfaces-shared-core/2.0.15-SNAPSHOT/myfaces-shared-core-2.0.15-SNAPSHOT.pom
[JENKINS] Archiving F:\jenkins\jenkins-slave\workspace\myfaces-current11\current11\shared\core\target\myfaces-shared-core-2.0.15-SNAPSHOT.jar to org.apache.myfaces.shared/myfaces-shared-core/2.0.15-SNAPSHOT/myfaces-shared-core-2.0.15-SNAPSHOT.jar
[JENKINS] Archiving F:\jenkins\jenkins-slave\workspace\myfaces-current11\current11\shared\core\target\myfaces-shared-core-2.0.15-SNAPSHOT-sources.jar to org.apache.myfaces.shared/myfaces-shared-core/2.0.15-SNAPSHOT/myfaces-shared-core-2.0.15-SNAPSHOT-sources.jar
Sending artifact delta relative to myfaces-current11 » Apache MyFaces Shared For JSF 1.1 - Core #1176
Archived 3 artifacts
Archive block size is 32768
Received 11 blocks and 120867 bytes
Compression is 74.9%
Took 0.23 sec
[JENKINS] Archiving F:\jenkins\jenkins-slave\workspace\myfaces-current11\current11\core\api\pom.xml to org.apache.myfaces.core/myfaces-api/1.1.11-SNAPSHOT/myfaces-api-1.1.11-SNAPSHOT.pom
[JENKINS] Archiving F:\jenkins\jenkins-slave\workspace\myfaces-current11\current11\core\api\target\myfaces-api-1.1.11-SNAPSHOT.jar to org.apache.myfaces.core/myfaces-api/1.1.11-SNAPSHOT/myfaces-api-1.1.11-SNAPSHOT.jar
[JENKINS] Archiving F:\jenkins\jenkins-slave\workspace\myfaces-current11\current11\core\api\target\myfaces-api-1.1.11-SNAPSHOT-sources.jar to org.apache.myfaces.core/myfaces-api/1.1.11-SNAPSHOT/myfaces-api-1.1.11-SNAPSHOT-sources.jar
Sending artifact delta relative to myfaces-current11 » Apache MyFaces JSF-1.1 API #1176
Archived 3 artifacts
Archive block size is 32768
Received 18 blocks and 178083 bytes
Compression is 76.8%
Took 0.29 sec
[JENKINS] Archiving F:\jenkins\jenkins-slave\workspace\myfaces-current11\current11\shared\shared-orchestra\pom.xml to org.apache.myfaces.shared/myfaces-shared-orchestra/2.0.15-SNAPSHOT/myfaces-shared-orchestra-2.0.15-SNAPSHOT.pom
[JENKINS] Archiving F:\jenkins\jenkins-slave\workspace\myfaces-current11\current11\shared\shared-orchestra\target\myfaces-shared-orchestra-2.0.15-SNAPSHOT.jar to org.apache.myfaces.shared/myfaces-shared-orchestra/2.0.15-SNAPSHOT/myfaces-shared-orchestra-2.0.15-SNAPSHOT.jar
[JENKINS] Archiving F:\jenkins\jenkins-slave\workspace\myfaces-current11\current11\shared\shared-orchestra\target\myfaces-shared-orchestra-2.0.15-SNAPSHOT-sources.jar to org.apache.myfaces.shared/myfaces-shared-orchestra/2.0.15-SNAPSHOT/myfaces-shared-orchestra-2.0.15-SNAPSHOT-sources.jar
Sending artifact delta relative to myfaces-current11 » Apache MyFaces Shared - Orchestra #1176
Archived 3 artifacts
Archive block size is 32768
Received 11 blocks and 129076 bytes
Compression is 73.6%
Took 2.2 sec
[JENKINS] Archiving F:\jenkins\jenkins-slave\workspace\myfaces-current11\current11\shared\pom.xml to org.apache.myfaces.shared/myfaces-shared-project/2.0.15-SNAPSHOT/myfaces-shared-project-2.0.15-SNAPSHOT.pom
[JENKINS] Archiving F:\jenkins\jenkins-slave\workspace\myfaces-current11\current11\shared\target\myfaces-shared-project-2.0.15-SNAPSHOT-site.xml to org.apache.myfaces.shared/myfaces-shared-project/2.0.15-SNAPSHOT/myfaces-shared-project-2.0.15-SNAPSHOT-site.xml
Sending artifact delta relative to myfaces-current11 » Apache MyFaces Shared For JSF 1.1 - Project #1176
Archived 2 artifacts
Archive block size is 32768
Received 0 blocks and 10288 bytes
Compression is 0.0%
Took 78 ms
[JENKINS] Archiving F:\jenkins\jenkins-slave\workspace\myfaces-current11\current11\core\pom.xml to org.apache.myfaces.core/myfaces-core-project/1.1.11-SNAPSHOT/myfaces-core-project-1.1.11-SNAPSHOT.pom
[JENKINS] Archiving F:\jenkins\jenkins-slave\workspace\myfaces-current11\current11\core\target\myfaces-core-project-1.1.11-SNAPSHOT-site.xml to org.apache.myfaces.core/myfaces-core-project/1.1.11-SNAPSHOT/myfaces-core-project-1.1.11-SNAPSHOT-site.xml
Sending artifact delta relative to myfaces-current11 » Apache MyFaces JSF-1.1 Core Project #1176
Archived 2 artifacts
Archive block size is 32768
Received 0 blocks and 20788 bytes
Compression is 0.0%
Took 0.14 sec
[JENKINS] Archiving <https://builds.apache.org/job/myfaces-current11/ws/current11\pom.xml> to org.apache.myfaces/myfaces-base/1.1.8-SNAPSHOT/myfaces-base-1.1.8-SNAPSHOT.pom
Sending artifact delta relative to myfaces-current11 » Build Project #1176
Archived 1 artifacts
Archive block size is 32768
Received 0 blocks and 1172 bytes
Compression is 0.0%
Took 0.16 sec
channel stopped
Maven RedeployPublisher use remote windows2 maven settings from : f:\jenkins\tools\maven\latest/conf/settings.xml
[ERROR] uniqueVersion == false is not anymore supported in maven 3
[INFO] Deployment in https://repository.apache.org/content/repositories/snapshots (id=apache.snapshots.https,uniqueVersion=false)
Deploying the main artifact myfaces-base-1.1.8-SNAPSHOT.pom
Downloading: https://repository.apache.org/content/repositories/snapshots/org/apache/myfaces/myfaces-base/1.1.8-SNAPSHOT/maven-metadata.xml
Downloaded: https://repository.apache.org/content/repositories/snapshots/org/apache/myfaces/myfaces-base/1.1.8-SNAPSHOT/maven-metadata.xml (611 B at 1.4 KB/sec)
Uploading: https://repository.apache.org/content/repositories/snapshots/org/apache/myfaces/myfaces-base/1.1.8-SNAPSHOT/myfaces-base-1.1.8-20140625.191119-553.pom
ERROR: Failed to deploy artifacts: Could not transfer artifact org.apache.myfaces:myfaces-base:pom:1.1.8-20140625.191119-553 from/to apache.snapshots.https (https://repository.apache.org/content/repositories/snapshots): Failed to transfer file: https://repository.apache.org/content/repositories/snapshots/org/apache/myfaces/myfaces-base/1.1.8-SNAPSHOT/myfaces-base-1.1.8-20140625.191119-553.pom. Return code is: 401, ReasonPhrase: Unauthorized.
org.apache.maven.artifact.deployer.ArtifactDeploymentException: Failed to deploy artifacts: Could not transfer artifact org.apache.myfaces:myfaces-base:pom:1.1.8-20140625.191119-553 from/to apache.snapshots.https (https://repository.apache.org/content/repositories/snapshots): Failed to transfer file: https://repository.apache.org/content/repositories/snapshots/org/apache/myfaces/myfaces-base/1.1.8-SNAPSHOT/myfaces-base-1.1.8-20140625.191119-553.pom. Return code is: 401, ReasonPhrase: Unauthorized.
at org.apache.maven.artifact.deployer.DefaultArtifactDeployer.deploy(DefaultArtifactDeployer.java:143)
at hudson.maven.reporters.MavenArtifactRecord.deploy(MavenArtifactRecord.java:193)
at hudson.maven.RedeployPublisher.perform(RedeployPublisher.java:176)
at hudson.tasks.BuildStepMonitor$1.perform(BuildStepMonitor.java:20)
at hudson.model.AbstractBuild$AbstractBuildExecution.perform(AbstractBuild.java:804)
at hudson.model.AbstractBuild$AbstractBuildExecution.performAllBuildSteps(AbstractBuild.java:776)
at hudson.maven.MavenModuleSetBuild$MavenModuleSetBuildExecution.post2(MavenModuleSetBuild.java:1040)
at hudson.model.AbstractBuild$AbstractBuildExecution.post(AbstractBuild.java:725)
at hudson.model.Run.execute(Run.java:1701)
at hudson.maven.MavenModuleSetBuild.run(MavenModuleSetBuild.java:529)
at hudson.model.ResourceController.execute(ResourceController.java:88)
at hudson.model.Executor.run(Executor.java:231)
Caused by: org.eclipse.aether.deployment.DeploymentException: Failed to deploy artifacts: Could not transfer artifact org.apache.myfaces:myfaces-base:pom:1.1.8-20140625.191119-553 from/to apache.snapshots.https (https://repository.apache.org/content/repositories/snapshots): Failed to transfer file: https://repository.apache.org/content/repositories/snapshots/org/apache/myfaces/myfaces-base/1.1.8-SNAPSHOT/myfaces-base-1.1.8-20140625.191119-553.pom. Return code is: 401, ReasonPhrase: Unauthorized.
at org.eclipse.aether.internal.impl.DefaultDeployer.deploy(DefaultDeployer.java:341)
at org.eclipse.aether.internal.impl.DefaultDeployer.deploy(DefaultDeployer.java:269)
at org.eclipse.aether.internal.impl.DefaultRepositorySystem.deploy(DefaultRepositorySystem.java:413)
at org.apache.maven.artifact.deployer.DefaultArtifactDeployer.deploy(DefaultArtifactDeployer.java:139)
... 11 more
Caused by: org.eclipse.aether.transfer.ArtifactTransferException: Could not transfer artifact org.apache.myfaces:myfaces-base:pom:1.1.8-20140625.191119-553 from/to apache.snapshots.https (https://repository.apache.org/content/repositories/snapshots): Failed to transfer file: https://repository.apache.org/content/repositories/snapshots/org/apache/myfaces/myfaces-base/1.1.8-SNAPSHOT/myfaces-base-1.1.8-20140625.191119-553.pom. Return code is: 401, ReasonPhrase: Unauthorized.
at org.eclipse.aether.connector.wagon.WagonRepositoryConnector$6.wrap(WagonRepositoryConnector.java:1016)
at org.eclipse.aether.connector.wagon.WagonRepositoryConnector$6.wrap(WagonRepositoryConnector.java:1004)
at org.eclipse.aether.connector.wagon.WagonRepositoryConnector$PutTask.run(WagonRepositoryConnector.java:895)
at org.eclipse.aether.connector.wagon.WagonRepositoryConnector.put(WagonRepositoryConnector.java:522)
at org.eclipse.aether.internal.impl.DefaultDeployer.deploy(DefaultDeployer.java:335)
... 14 more
Caused by: org.apache.maven.wagon.TransferFailedException: Failed to transfer file: https://repository.apache.org/content/repositories/snapshots/org/apache/myfaces/myfaces-base/1.1.8-SNAPSHOT/myfaces-base-1.1.8-20140625.191119-553.pom. Return code is: 401, ReasonPhrase: Unauthorized.
at org.apache.maven.wagon.shared.http4.AbstractHttpClientWagon.put(AbstractHttpClientWagon.java:626)
at org.apache.maven.wagon.shared.http4.AbstractHttpClientWagon.put(AbstractHttpClientWagon.java:524)
at org.apache.maven.wagon.shared.http4.AbstractHttpClientWagon.put(AbstractHttpClientWagon.java:505)
at org.apache.maven.wagon.shared.http4.AbstractHttpClientWagon.put(AbstractHttpClientWagon.java:485)
at org.eclipse.aether.connector.wagon.WagonRepositoryConnector$PutTask.run(WagonRepositoryConnector.java:871)
... 16 more
[INFO] Deployment failed after 0.89 sec
Build step 'Deploy artifacts to Maven repository' changed build result to FAILURE
Build failed in Jenkins: myfaces-current11 #1176
Posted by Apache Jenkins Server <je...@builds.apache.org>.
See <https://builds.apache.org/job/myfaces-current11/1176/>
------------------------------------------
[...truncated 1139 lines...]
Jun 24, 2014 1:51:05 PM org.apache.myfaces.shared_impl.config.MyfacesConfig getBooleanInitParameter
INFO: No context init parameter 'org.apache.myfaces.PRETTY_HTML' found, using default value true
Jun 24, 2014 1:51:05 PM org.apache.myfaces.shared_impl.config.MyfacesConfig getBooleanInitParameter
INFO: No context init parameter 'org.apache.myfaces.ALLOW_JAVASCRIPT' found, using default value true
Jun 24, 2014 1:51:05 PM org.apache.myfaces.shared_impl.config.MyfacesConfig getBooleanInitParameter
INFO: No context init parameter 'org.apache.myfaces.READONLY_AS_DISABLED_FOR_SELECTS' found, using default value true
Jun 24, 2014 1:51:05 PM org.apache.myfaces.shared_impl.config.MyfacesConfig getBooleanInitParameter
INFO: No context init parameter 'org.apache.myfaces.RENDER_VIEWSTATE_ID' found, using default value true
Jun 24, 2014 1:51:05 PM org.apache.myfaces.shared_impl.config.MyfacesConfig getBooleanInitParameter
INFO: No context init parameter 'org.apache.myfaces.STRICT_XHTML_LINKS' found, using default value true
Jun 24, 2014 1:51:05 PM org.apache.myfaces.shared_impl.config.MyfacesConfig getLongInitParameter
INFO: No context init parameter 'org.apache.myfaces.CONFIG_REFRESH_PERIOD' found, using default value 2
Jun 24, 2014 1:51:05 PM org.apache.myfaces.shared_impl.config.MyfacesConfig createAndInitializeMyFacesConfig
INFO: Tomahawk jar not available. Autoscrolling, DetectJavascript, AddResourceClass and CheckExtensionsFilter are disabled now.
Jun 24, 2014 1:51:05 PM org.apache.myfaces.shared_impl.config.MyfacesConfig createAndInitializeMyFacesConfig
INFO: Starting up Tomahawk on the MyFaces-JSF-Implementation
Tests run: 2, Failures: 0, Errors: 0, Skipped: 0, Time elapsed: 0.011 sec
Running org.apache.myfaces.renderkit.html.HtmlSecretRendererTest
WARNING: Component _id0 just got an automatic id, because there was no id assigned yet. If this component was created dynamically (i.e. not by a JSP tag) you should assign it an explicit static id or assign it the id you get from the createUniqueId from the current UIViewRoot component right after creation!
WARNING: Component _id0 just got an automatic id, because there was no id assigned yet. If this component was created dynamically (i.e. not by a JSP tag) you should assign it an explicit static id or assign it the id you get from the createUniqueId from the current UIViewRoot component right after creation!
Tests run: 2, Failures: 0, Errors: 0, Skipped: 0, Time elapsed: 0.012 sec
Running org.apache.myfaces.renderkit.html.HtmlImageRendererTest
Jun 24, 2014 1:51:05 PM org.apache.myfaces.shared_impl.renderkit.html.HtmlImageRendererBase encodeEnd
WARNING: ALT attribute is missing for : img1
Jun 24, 2014 1:51:05 PM org.apache.myfaces.shared_impl.renderkit.html.HtmlImageRendererBase encodeEnd
WARNING: ALT attribute is missing for : img1
Jun 24, 2014 1:51:05 PM org.apache.myfaces.shared_impl.renderkit.html.HtmlImageRendererBase encodeEnd
WARNING: ALT attribute is missing for : img1
Tests run: 3, Failures: 0, Errors: 0, Skipped: 0, Time elapsed: 0.021 sec
Running org.apache.myfaces.renderkit.html.HtmlCheckboxRendererTest
WARNING: Component _id0 just got an automatic id, because there was no id assigned yet. If this component was created dynamically (i.e. not by a JSP tag) you should assign it an explicit static id or assign it the id you get from the createUniqueId from the current UIViewRoot component right after creation!
WARNING: Component _id0 just got an automatic id, because there was no id assigned yet. If this component was created dynamically (i.e. not by a JSP tag) you should assign it an explicit static id or assign it the id you get from the createUniqueId from the current UIViewRoot component right after creation!
Tests run: 2, Failures: 0, Errors: 0, Skipped: 0, Time elapsed: 0.013 sec
Running org.apache.myfaces.renderkit.html.HtmlTextareaRendererTest
WARNING: Component _id0 just got an automatic id, because there was no id assigned yet. If this component was created dynamically (i.e. not by a JSP tag) you should assign it an explicit static id or assign it the id you get from the createUniqueId from the current UIViewRoot component right after creation!
WARNING: Component _id0 just got an automatic id, because there was no id assigned yet. If this component was created dynamically (i.e. not by a JSP tag) you should assign it an explicit static id or assign it the id you get from the createUniqueId from the current UIViewRoot component right after creation!
WARNING: Component _id0 just got an automatic id, because there was no id assigned yet. If this component was created dynamically (i.e. not by a JSP tag) you should assign it an explicit static id or assign it the id you get from the createUniqueId from the current UIViewRoot component right after creation!
Tests run: 3, Failures: 0, Errors: 0, Skipped: 0, Time elapsed: 0.008 sec
Running org.apache.myfaces.renderkit.html.HtmlLabelRendererTest
WARNING: Component _id0 just got an automatic id, because there was no id assigned yet. If this component was created dynamically (i.e. not by a JSP tag) you should assign it an explicit static id or assign it the id you get from the createUniqueId from the current UIViewRoot component right after creation!
Jun 24, 2014 1:51:05 PM org.apache.myfaces.shared_impl.renderkit.RendererUtils getClientId
INFO: Unable to find component 'compId' (calling findComponent on component '_id0'). We'll try to return a guessed client-id anyways - this will be a problem if you put the referenced component into a different naming-container. If this is the case, you can always use the full client-id.
Tests run: 1, Failures: 0, Errors: 0, Skipped: 0, Time elapsed: 0.009 sec
Running org.apache.myfaces.renderkit.html.HtmlMenuRendererTest
WARNING: Component _id0 just got an automatic id, because there was no id assigned yet. If this component was created dynamically (i.e. not by a JSP tag) you should assign it an explicit static id or assign it the id you get from the createUniqueId from the current UIViewRoot component right after creation!
WARNING: Component _id0 just got an automatic id, because there was no id assigned yet. If this component was created dynamically (i.e. not by a JSP tag) you should assign it an explicit static id or assign it the id you get from the createUniqueId from the current UIViewRoot component right after creation!
Tests run: 2, Failures: 0, Errors: 0, Skipped: 0, Time elapsed: 0.012 sec
Running org.apache.myfaces.el.PropertyResolverTestCase
Tests run: 1, Failures: 0, Errors: 0, Skipped: 0, Time elapsed: 0.005 sec
Running org.apache.myfaces.renderkit.html.HtmlMessageRendererTest
WARNING: Component _id0 just got an automatic id, because there was no id assigned yet. If this component was created dynamically (i.e. not by a JSP tag) you should assign it an explicit static id or assign it the id you get from the createUniqueId from the current UIViewRoot component right after creation!
WARNING: Component _id0 just got an automatic id, because there was no id assigned yet. If this component was created dynamically (i.e. not by a JSP tag) you should assign it an explicit static id or assign it the id you get from the createUniqueId from the current UIViewRoot component right after creation!
Tests run: 2, Failures: 0, Errors: 0, Skipped: 0, Time elapsed: 0.01 sec
Results :
Tests run: 48, Failures: 0, Errors: 0, Skipped: 0
[JENKINS] Recording test results
[INFO]
[INFO] --- maven-jar-plugin:2.3.2:jar (default-jar) @ myfaces-impl ---
[INFO] Building jar: F:\jenkins\jenkins-slave\workspace\myfaces-current11\current11\core\impl\target\myfaces-impl-1.1.11-SNAPSHOT.jar
[INFO]
[INFO] --- maven-site-plugin:3.0:attach-descriptor (attach-descriptor) @ myfaces-impl ---
[INFO]
[INFO] >>> maven-source-plugin:2.0.4:jar (attach-source) @ myfaces-impl >>>
[INFO]
[INFO] --- myfaces-builder-plugin:1.0.10:build-metadata (makemyfacesmetadata) @ myfaces-impl ---
[INFO] model is up to date
[INFO]
[INFO] --- myfaces-builder-plugin:1.0.10:make-config (makefacesconfig) @ myfaces-impl ---
[INFO] generated file standard-faces-config.xml is up to date
[INFO]
[INFO] --- myfaces-builder-plugin:1.0.10:make-tags (make_tags) @ myfaces-impl ---
[INFO] generated component tag files are up to date
[INFO]
[INFO] --- myfaces-builder-plugin:1.0.10:make-config (makecoretld) @ myfaces-impl ---
[INFO] generated file myfaces_core.tld is up to date
[INFO]
[INFO] --- myfaces-builder-plugin:1.0.10:make-config (makehtmltld) @ myfaces-impl ---
[INFO] generated file myfaces_html.tld is up to date
[WARNING] Failed to getClass for org.apache.maven.plugin.source.SourceJarMojo
[INFO]
[INFO] <<< maven-source-plugin:2.0.4:jar (attach-source) @ myfaces-impl <<<
[INFO]
[INFO] --- maven-source-plugin:2.0.4:jar (attach-source) @ myfaces-impl ---
[INFO] Building jar: F:\jenkins\jenkins-slave\workspace\myfaces-current11\current11\core\impl\target\myfaces-impl-1.1.11-SNAPSHOT-sources.jar
[INFO]
[INFO] --- maven-checkstyle-plugin:2.6:check (verify-style) @ myfaces-impl ---
[INFO]
[INFO]
[INFO] --- maven-install-plugin:2.3.1:install (default-install) @ myfaces-impl ---
[INFO] Installing F:\jenkins\jenkins-slave\workspace\myfaces-current11\current11\core\impl\target\myfaces-impl-1.1.11-SNAPSHOT.jar to f:\jenkins\jenkins-slave\maven-repositories\1\org\apache\myfaces\core\myfaces-impl\1.1.11-SNAPSHOT\myfaces-impl-1.1.11-SNAPSHOT.jar
[INFO] Installing F:\jenkins\jenkins-slave\workspace\myfaces-current11\current11\core\impl\pom.xml to f:\jenkins\jenkins-slave\maven-repositories\1\org\apache\myfaces\core\myfaces-impl\1.1.11-SNAPSHOT\myfaces-impl-1.1.11-SNAPSHOT.pom
[INFO] Installing F:\jenkins\jenkins-slave\workspace\myfaces-current11\current11\core\impl\target\myfaces-impl-1.1.11-SNAPSHOT-sources.jar to f:\jenkins\jenkins-slave\maven-repositories\1\org\apache\myfaces\core\myfaces-impl\1.1.11-SNAPSHOT\myfaces-impl-1.1.11-SNAPSHOT-sources.jar
[INFO]
[INFO] ------------------------------------------------------------------------
[INFO] Building Build Project 1.1.8-SNAPSHOT
[INFO] ------------------------------------------------------------------------
[INFO]
[INFO] --- maven-remote-resources-plugin:1.1:process (default) @ myfaces-base ---
[INFO] Setting property: classpath.resource.loader.class => 'org.codehaus.plexus.velocity.ContextClassLoaderResourceLoader'.
[INFO] Setting property: velocimacro.messages.on => 'false'.
[INFO] Setting property: resource.loader => 'classpath'.
[INFO] Setting property: resource.manager.logwhenfound => 'false'.
[INFO]
[INFO] --- maven-install-plugin:2.3:install (default-install) @ myfaces-base ---
[INFO] Installing <https://builds.apache.org/job/myfaces-current11/ws/current11\pom.xml> to f:\jenkins\jenkins-slave\maven-repositories\1\org\apache\myfaces\myfaces-base\1.1.8-SNAPSHOT\myfaces-base-1.1.8-SNAPSHOT.pom
[INFO] ------------------------------------------------------------------------
[INFO] Reactor Summary:
[INFO]
[INFO] Apache MyFaces Shared For JSF 1.1 - Project ....... SUCCESS [18.005s]
[INFO] Apache MyFaces Shared For JSF 1.1 - Core .......... SUCCESS [21.053s]
[INFO] MyFaces Shared Impl ............................... SUCCESS [11.767s]
[INFO] MyFaces Shared Tomahawk ........................... SUCCESS [9.079s]
[INFO] Apache MyFaces Shared - Orchestra ................. SUCCESS [8.833s]
[INFO] Apache MyFaces JSF-1.1 Core Project ............... SUCCESS [6.137s]
[INFO] Apache MyFaces JSF-1.1 API ........................ SUCCESS [17.981s]
[INFO] Apache MyFaces JSF-1.1 Implementation ............. SUCCESS [18.338s]
[INFO] Build Project ..................................... SUCCESS [2.114s]
[INFO] ------------------------------------------------------------------------
[INFO] BUILD SUCCESS
[INFO] ------------------------------------------------------------------------
[INFO] Total time: 2:04.689s
[INFO] Finished at: Tue Jun 24 13:51:21 PDT 2014
[INFO] Final Memory: 31M/76M
[INFO] ------------------------------------------------------------------------
Waiting for Jenkins to finish collecting data
[JENKINS] Archiving F:\jenkins\jenkins-slave\workspace\myfaces-current11\current11\shared\shared-tomahawk\pom.xml to org.apache.myfaces.shared/myfaces-shared-tomahawk/2.0.15-SNAPSHOT/myfaces-shared-tomahawk-2.0.15-SNAPSHOT.pom
[JENKINS] Archiving F:\jenkins\jenkins-slave\workspace\myfaces-current11\current11\shared\shared-tomahawk\target\myfaces-shared-tomahawk-2.0.15-SNAPSHOT.jar to org.apache.myfaces.shared/myfaces-shared-tomahawk/2.0.15-SNAPSHOT/myfaces-shared-tomahawk-2.0.15-SNAPSHOT.jar
[JENKINS] Archiving F:\jenkins\jenkins-slave\workspace\myfaces-current11\current11\shared\shared-tomahawk\target\myfaces-shared-tomahawk-2.0.15-SNAPSHOT-sources.jar to org.apache.myfaces.shared/myfaces-shared-tomahawk/2.0.15-SNAPSHOT/myfaces-shared-tomahawk-2.0.15-SNAPSHOT-sources.jar
Sending artifact delta relative to myfaces-current11 » MyFaces Shared Tomahawk #1175
Archived 3 artifacts
Archive block size is 32768
Received 11 blocks and 128752 bytes
Compression is 73.7%
Took 2.2 sec
[JENKINS] Archiving F:\jenkins\jenkins-slave\workspace\myfaces-current11\current11\core\impl\pom.xml to org.apache.myfaces.core/myfaces-impl/1.1.11-SNAPSHOT/myfaces-impl-1.1.11-SNAPSHOT.pom
[JENKINS] Archiving F:\jenkins\jenkins-slave\workspace\myfaces-current11\current11\core\impl\target\myfaces-impl-1.1.11-SNAPSHOT.jar to org.apache.myfaces.core/myfaces-impl/1.1.11-SNAPSHOT/myfaces-impl-1.1.11-SNAPSHOT.jar
[JENKINS] Archiving F:\jenkins\jenkins-slave\workspace\myfaces-current11\current11\core\impl\target\myfaces-impl-1.1.11-SNAPSHOT-sources.jar to org.apache.myfaces.core/myfaces-impl/1.1.11-SNAPSHOT/myfaces-impl-1.1.11-SNAPSHOT-sources.jar
Sending artifact delta relative to myfaces-current11 » Apache MyFaces JSF-1.1 Implementation #1175
Archived 3 artifacts
Archive block size is 32768
Received 34 blocks and 216737 bytes
Compression is 83.7%
Took 0.29 sec
[JENKINS] Archiving F:\jenkins\jenkins-slave\workspace\myfaces-current11\current11\shared\shared-impl\pom.xml to org.apache.myfaces.shared/myfaces-shared-impl/2.0.15-SNAPSHOT/myfaces-shared-impl-2.0.15-SNAPSHOT.pom
[JENKINS] Archiving F:\jenkins\jenkins-slave\workspace\myfaces-current11\current11\shared\shared-impl\target\myfaces-shared-impl-2.0.15-SNAPSHOT.jar to org.apache.myfaces.shared/myfaces-shared-impl/2.0.15-SNAPSHOT/myfaces-shared-impl-2.0.15-SNAPSHOT.jar
[JENKINS] Archiving F:\jenkins\jenkins-slave\workspace\myfaces-current11\current11\shared\shared-impl\target\myfaces-shared-impl-2.0.15-SNAPSHOT-sources.jar to org.apache.myfaces.shared/myfaces-shared-impl/2.0.15-SNAPSHOT/myfaces-shared-impl-2.0.15-SNAPSHOT-sources.jar
Sending artifact delta relative to myfaces-current11 » MyFaces Shared Impl #1175
Archived 3 artifacts
Archive block size is 32768
Received 11 blocks and 125676 bytes
Compression is 74.1%
Took 0.26 sec
[JENKINS] Archiving F:\jenkins\jenkins-slave\workspace\myfaces-current11\current11\shared\core\pom.xml to org.apache.myfaces.shared/myfaces-shared-core/2.0.15-SNAPSHOT/myfaces-shared-core-2.0.15-SNAPSHOT.pom
[JENKINS] Archiving F:\jenkins\jenkins-slave\workspace\myfaces-current11\current11\shared\core\target\myfaces-shared-core-2.0.15-SNAPSHOT.jar to org.apache.myfaces.shared/myfaces-shared-core/2.0.15-SNAPSHOT/myfaces-shared-core-2.0.15-SNAPSHOT.jar
[JENKINS] Archiving F:\jenkins\jenkins-slave\workspace\myfaces-current11\current11\shared\core\target\myfaces-shared-core-2.0.15-SNAPSHOT-sources.jar to org.apache.myfaces.shared/myfaces-shared-core/2.0.15-SNAPSHOT/myfaces-shared-core-2.0.15-SNAPSHOT-sources.jar
Sending artifact delta relative to myfaces-current11 » Apache MyFaces Shared For JSF 1.1 - Core #1175
Archived 3 artifacts
Archive block size is 32768
Received 11 blocks and 120867 bytes
Compression is 74.9%
Took 3 sec
[JENKINS] Archiving F:\jenkins\jenkins-slave\workspace\myfaces-current11\current11\core\api\pom.xml to org.apache.myfaces.core/myfaces-api/1.1.11-SNAPSHOT/myfaces-api-1.1.11-SNAPSHOT.pom
[JENKINS] Archiving F:\jenkins\jenkins-slave\workspace\myfaces-current11\current11\core\api\target\myfaces-api-1.1.11-SNAPSHOT.jar to org.apache.myfaces.core/myfaces-api/1.1.11-SNAPSHOT/myfaces-api-1.1.11-SNAPSHOT.jar
[JENKINS] Archiving F:\jenkins\jenkins-slave\workspace\myfaces-current11\current11\core\api\target\myfaces-api-1.1.11-SNAPSHOT-sources.jar to org.apache.myfaces.core/myfaces-api/1.1.11-SNAPSHOT/myfaces-api-1.1.11-SNAPSHOT-sources.jar
Sending artifact delta relative to myfaces-current11 » Apache MyFaces JSF-1.1 API #1175
Archived 3 artifacts
Archive block size is 32768
Received 18 blocks and 178083 bytes
Compression is 76.8%
Took 2.3 sec
[JENKINS] Archiving F:\jenkins\jenkins-slave\workspace\myfaces-current11\current11\shared\shared-orchestra\pom.xml to org.apache.myfaces.shared/myfaces-shared-orchestra/2.0.15-SNAPSHOT/myfaces-shared-orchestra-2.0.15-SNAPSHOT.pom
[JENKINS] Archiving F:\jenkins\jenkins-slave\workspace\myfaces-current11\current11\shared\shared-orchestra\target\myfaces-shared-orchestra-2.0.15-SNAPSHOT.jar to org.apache.myfaces.shared/myfaces-shared-orchestra/2.0.15-SNAPSHOT/myfaces-shared-orchestra-2.0.15-SNAPSHOT.jar
[JENKINS] Archiving F:\jenkins\jenkins-slave\workspace\myfaces-current11\current11\shared\shared-orchestra\target\myfaces-shared-orchestra-2.0.15-SNAPSHOT-sources.jar to org.apache.myfaces.shared/myfaces-shared-orchestra/2.0.15-SNAPSHOT/myfaces-shared-orchestra-2.0.15-SNAPSHOT-sources.jar
Sending artifact delta relative to myfaces-current11 » Apache MyFaces Shared - Orchestra #1175
Archived 3 artifacts
Archive block size is 32768
Received 11 blocks and 129076 bytes
Compression is 73.6%
Took 0.27 sec
[JENKINS] Archiving F:\jenkins\jenkins-slave\workspace\myfaces-current11\current11\shared\pom.xml to org.apache.myfaces.shared/myfaces-shared-project/2.0.15-SNAPSHOT/myfaces-shared-project-2.0.15-SNAPSHOT.pom
[JENKINS] Archiving F:\jenkins\jenkins-slave\workspace\myfaces-current11\current11\shared\target\myfaces-shared-project-2.0.15-SNAPSHOT-site.xml to org.apache.myfaces.shared/myfaces-shared-project/2.0.15-SNAPSHOT/myfaces-shared-project-2.0.15-SNAPSHOT-site.xml
Sending artifact delta relative to myfaces-current11 » Apache MyFaces Shared For JSF 1.1 - Project #1175
Archived 2 artifacts
Archive block size is 32768
Received 0 blocks and 10288 bytes
Compression is 0.0%
Took 61 ms
[JENKINS] Archiving F:\jenkins\jenkins-slave\workspace\myfaces-current11\current11\core\pom.xml to org.apache.myfaces.core/myfaces-core-project/1.1.11-SNAPSHOT/myfaces-core-project-1.1.11-SNAPSHOT.pom
[JENKINS] Archiving F:\jenkins\jenkins-slave\workspace\myfaces-current11\current11\core\target\myfaces-core-project-1.1.11-SNAPSHOT-site.xml to org.apache.myfaces.core/myfaces-core-project/1.1.11-SNAPSHOT/myfaces-core-project-1.1.11-SNAPSHOT-site.xml
Sending artifact delta relative to myfaces-current11 » Apache MyFaces JSF-1.1 Core Project #1175
Archived 2 artifacts
Archive block size is 32768
Received 0 blocks and 20788 bytes
Compression is 0.0%
Took 81 ms
[JENKINS] Archiving <https://builds.apache.org/job/myfaces-current11/ws/current11\pom.xml> to org.apache.myfaces/myfaces-base/1.1.8-SNAPSHOT/myfaces-base-1.1.8-SNAPSHOT.pom
Sending artifact delta relative to myfaces-current11 » Build Project #1175
Archived 1 artifacts
Archive block size is 32768
Received 0 blocks and 1172 bytes
Compression is 0.0%
Took 0.17 sec
channel stopped
Maven RedeployPublisher use remote windows2 maven settings from : f:\jenkins\tools\maven\latest/conf/settings.xml
[ERROR] uniqueVersion == false is not anymore supported in maven 3
[INFO] Deployment in https://repository.apache.org/content/repositories/snapshots (id=apache.snapshots.https,uniqueVersion=false)
Deploying the main artifact myfaces-base-1.1.8-SNAPSHOT.pom
Downloading: https://repository.apache.org/content/repositories/snapshots/org/apache/myfaces/myfaces-base/1.1.8-SNAPSHOT/maven-metadata.xml
Downloaded: https://repository.apache.org/content/repositories/snapshots/org/apache/myfaces/myfaces-base/1.1.8-SNAPSHOT/maven-metadata.xml (611 B at 1.1 KB/sec)
Uploading: https://repository.apache.org/content/repositories/snapshots/org/apache/myfaces/myfaces-base/1.1.8-SNAPSHOT/myfaces-base-1.1.8-20140624.205140-553.pom
ERROR: Failed to deploy artifacts: Could not transfer artifact org.apache.myfaces:myfaces-base:pom:1.1.8-20140624.205140-553 from/to apache.snapshots.https (https://repository.apache.org/content/repositories/snapshots): Failed to transfer file: https://repository.apache.org/content/repositories/snapshots/org/apache/myfaces/myfaces-base/1.1.8-SNAPSHOT/myfaces-base-1.1.8-20140624.205140-553.pom. Return code is: 401, ReasonPhrase: Unauthorized.
org.apache.maven.artifact.deployer.ArtifactDeploymentException: Failed to deploy artifacts: Could not transfer artifact org.apache.myfaces:myfaces-base:pom:1.1.8-20140624.205140-553 from/to apache.snapshots.https (https://repository.apache.org/content/repositories/snapshots): Failed to transfer file: https://repository.apache.org/content/repositories/snapshots/org/apache/myfaces/myfaces-base/1.1.8-SNAPSHOT/myfaces-base-1.1.8-20140624.205140-553.pom. Return code is: 401, ReasonPhrase: Unauthorized.
at org.apache.maven.artifact.deployer.DefaultArtifactDeployer.deploy(DefaultArtifactDeployer.java:143)
at hudson.maven.reporters.MavenArtifactRecord.deploy(MavenArtifactRecord.java:193)
at hudson.maven.RedeployPublisher.perform(RedeployPublisher.java:176)
at hudson.tasks.BuildStepMonitor$1.perform(BuildStepMonitor.java:20)
at hudson.model.AbstractBuild$AbstractBuildExecution.perform(AbstractBuild.java:804)
at hudson.model.AbstractBuild$AbstractBuildExecution.performAllBuildSteps(AbstractBuild.java:776)
at hudson.maven.MavenModuleSetBuild$MavenModuleSetBuildExecution.post2(MavenModuleSetBuild.java:1040)
at hudson.model.AbstractBuild$AbstractBuildExecution.post(AbstractBuild.java:725)
at hudson.model.Run.execute(Run.java:1701)
at hudson.maven.MavenModuleSetBuild.run(MavenModuleSetBuild.java:529)
at hudson.model.ResourceController.execute(ResourceController.java:88)
at hudson.model.Executor.run(Executor.java:231)
Caused by: org.eclipse.aether.deployment.DeploymentException: Failed to deploy artifacts: Could not transfer artifact org.apache.myfaces:myfaces-base:pom:1.1.8-20140624.205140-553 from/to apache.snapshots.https (https://repository.apache.org/content/repositories/snapshots): Failed to transfer file: https://repository.apache.org/content/repositories/snapshots/org/apache/myfaces/myfaces-base/1.1.8-SNAPSHOT/myfaces-base-1.1.8-20140624.205140-553.pom. Return code is: 401, ReasonPhrase: Unauthorized.
at org.eclipse.aether.internal.impl.DefaultDeployer.deploy(DefaultDeployer.java:341)
at org.eclipse.aether.internal.impl.DefaultDeployer.deploy(DefaultDeployer.java:269)
at org.eclipse.aether.internal.impl.DefaultRepositorySystem.deploy(DefaultRepositorySystem.java:413)
at org.apache.maven.artifact.deployer.DefaultArtifactDeployer.deploy(DefaultArtifactDeployer.java:139)
... 11 more
Caused by: org.eclipse.aether.transfer.ArtifactTransferException: Could not transfer artifact org.apache.myfaces:myfaces-base:pom:1.1.8-20140624.205140-553 from/to apache.snapshots.https (https://repository.apache.org/content/repositories/snapshots): Failed to transfer file: https://repository.apache.org/content/repositories/snapshots/org/apache/myfaces/myfaces-base/1.1.8-SNAPSHOT/myfaces-base-1.1.8-20140624.205140-553.pom. Return code is: 401, ReasonPhrase: Unauthorized.
at org.eclipse.aether.connector.wagon.WagonRepositoryConnector$6.wrap(WagonRepositoryConnector.java:1016)
at org.eclipse.aether.connector.wagon.WagonRepositoryConnector$6.wrap(WagonRepositoryConnector.java:1004)
at org.eclipse.aether.connector.wagon.WagonRepositoryConnector$PutTask.run(WagonRepositoryConnector.java:895)
at org.eclipse.aether.connector.wagon.WagonRepositoryConnector.put(WagonRepositoryConnector.java:522)
at org.eclipse.aether.internal.impl.DefaultDeployer.deploy(DefaultDeployer.java:335)
... 14 more
Caused by: org.apache.maven.wagon.TransferFailedException: Failed to transfer file: https://repository.apache.org/content/repositories/snapshots/org/apache/myfaces/myfaces-base/1.1.8-SNAPSHOT/myfaces-base-1.1.8-20140624.205140-553.pom. Return code is: 401, ReasonPhrase: Unauthorized.
at org.apache.maven.wagon.shared.http4.AbstractHttpClientWagon.put(AbstractHttpClientWagon.java:626)
at org.apache.maven.wagon.shared.http4.AbstractHttpClientWagon.put(AbstractHttpClientWagon.java:524)
at org.apache.maven.wagon.shared.http4.AbstractHttpClientWagon.put(AbstractHttpClientWagon.java:505)
at org.apache.maven.wagon.shared.http4.AbstractHttpClientWagon.put(AbstractHttpClientWagon.java:485)
at org.eclipse.aether.connector.wagon.WagonRepositoryConnector$PutTask.run(WagonRepositoryConnector.java:871)
... 16 more
[INFO] Deployment failed after 3.1 sec
Build step 'Deploy artifacts to Maven repository' changed build result to FAILURE
Build failed in Jenkins: myfaces-current11 #1175
Posted by Apache Jenkins Server <je...@builds.apache.org>.
See <https://builds.apache.org/job/myfaces-current11/1175/>
------------------------------------------
[...truncated 1137 lines...]
Jun 24, 2014 6:12:15 AM org.apache.myfaces.shared_impl.config.MyfacesConfig getBooleanInitParameter
INFO: No context init parameter 'org.apache.myfaces.PRETTY_HTML' found, using default value true
Jun 24, 2014 6:12:15 AM org.apache.myfaces.shared_impl.config.MyfacesConfig getBooleanInitParameter
INFO: No context init parameter 'org.apache.myfaces.ALLOW_JAVASCRIPT' found, using default value true
Jun 24, 2014 6:12:15 AM org.apache.myfaces.shared_impl.config.MyfacesConfig getBooleanInitParameter
INFO: No context init parameter 'org.apache.myfaces.READONLY_AS_DISABLED_FOR_SELECTS' found, using default value true
Jun 24, 2014 6:12:15 AM org.apache.myfaces.shared_impl.config.MyfacesConfig getBooleanInitParameter
INFO: No context init parameter 'org.apache.myfaces.RENDER_VIEWSTATE_ID' found, using default value true
Jun 24, 2014 6:12:15 AM org.apache.myfaces.shared_impl.config.MyfacesConfig getBooleanInitParameter
INFO: No context init parameter 'org.apache.myfaces.STRICT_XHTML_LINKS' found, using default value true
Jun 24, 2014 6:12:15 AM org.apache.myfaces.shared_impl.config.MyfacesConfig getLongInitParameter
INFO: No context init parameter 'org.apache.myfaces.CONFIG_REFRESH_PERIOD' found, using default value 2
Jun 24, 2014 6:12:15 AM org.apache.myfaces.shared_impl.config.MyfacesConfig createAndInitializeMyFacesConfig
INFO: Tomahawk jar not available. Autoscrolling, DetectJavascript, AddResourceClass and CheckExtensionsFilter are disabled now.
Jun 24, 2014 6:12:15 AM org.apache.myfaces.shared_impl.config.MyfacesConfig createAndInitializeMyFacesConfig
INFO: Starting up Tomahawk on the MyFaces-JSF-Implementation
Tests run: 2, Failures: 0, Errors: 0, Skipped: 0, Time elapsed: 0.01 sec
Running org.apache.myfaces.renderkit.html.HtmlSecretRendererTest
WARNING: Component _id0 just got an automatic id, because there was no id assigned yet. If this component was created dynamically (i.e. not by a JSP tag) you should assign it an explicit static id or assign it the id you get from the createUniqueId from the current UIViewRoot component right after creation!
WARNING: Component _id0 just got an automatic id, because there was no id assigned yet. If this component was created dynamically (i.e. not by a JSP tag) you should assign it an explicit static id or assign it the id you get from the createUniqueId from the current UIViewRoot component right after creation!
Tests run: 2, Failures: 0, Errors: 0, Skipped: 0, Time elapsed: 0.011 sec
Running org.apache.myfaces.renderkit.html.HtmlImageRendererTest
Jun 24, 2014 6:12:15 AM org.apache.myfaces.shared_impl.renderkit.html.HtmlImageRendererBase encodeEnd
WARNING: ALT attribute is missing for : img1
Jun 24, 2014 6:12:15 AM org.apache.myfaces.shared_impl.renderkit.html.HtmlImageRendererBase encodeEnd
WARNING: ALT attribute is missing for : img1
Jun 24, 2014 6:12:15 AM org.apache.myfaces.shared_impl.renderkit.html.HtmlImageRendererBase encodeEnd
WARNING: ALT attribute is missing for : img1
Tests run: 3, Failures: 0, Errors: 0, Skipped: 0, Time elapsed: 0.021 sec
Running org.apache.myfaces.renderkit.html.HtmlCheckboxRendererTest
WARNING: Component _id0 just got an automatic id, because there was no id assigned yet. If this component was created dynamically (i.e. not by a JSP tag) you should assign it an explicit static id or assign it the id you get from the createUniqueId from the current UIViewRoot component right after creation!
WARNING: Component _id0 just got an automatic id, because there was no id assigned yet. If this component was created dynamically (i.e. not by a JSP tag) you should assign it an explicit static id or assign it the id you get from the createUniqueId from the current UIViewRoot component right after creation!
Tests run: 2, Failures: 0, Errors: 0, Skipped: 0, Time elapsed: 0.012 sec
Running org.apache.myfaces.renderkit.html.HtmlTextareaRendererTest
WARNING: Component _id0 just got an automatic id, because there was no id assigned yet. If this component was created dynamically (i.e. not by a JSP tag) you should assign it an explicit static id or assign it the id you get from the createUniqueId from the current UIViewRoot component right after creation!
WARNING: Component _id0 just got an automatic id, because there was no id assigned yet. If this component was created dynamically (i.e. not by a JSP tag) you should assign it an explicit static id or assign it the id you get from the createUniqueId from the current UIViewRoot component right after creation!
WARNING: Component _id0 just got an automatic id, because there was no id assigned yet. If this component was created dynamically (i.e. not by a JSP tag) you should assign it an explicit static id or assign it the id you get from the createUniqueId from the current UIViewRoot component right after creation!
Tests run: 3, Failures: 0, Errors: 0, Skipped: 0, Time elapsed: 0.008 sec
Running org.apache.myfaces.renderkit.html.HtmlLabelRendererTest
WARNING: Component _id0 just got an automatic id, because there was no id assigned yet. If this component was created dynamically (i.e. not by a JSP tag) you should assign it an explicit static id or assign it the id you get from the createUniqueId from the current UIViewRoot component right after creation!
Jun 24, 2014 6:12:15 AM org.apache.myfaces.shared_impl.renderkit.RendererUtils getClientId
INFO: Unable to find component 'compId' (calling findComponent on component '_id0'). We'll try to return a guessed client-id anyways - this will be a problem if you put the referenced component into a different naming-container. If this is the case, you can always use the full client-id.
Tests run: 1, Failures: 0, Errors: 0, Skipped: 0, Time elapsed: 0.01 sec
Running org.apache.myfaces.renderkit.html.HtmlMenuRendererTest
WARNING: Component _id0 just got an automatic id, because there was no id assigned yet. If this component was created dynamically (i.e. not by a JSP tag) you should assign it an explicit static id or assign it the id you get from the createUniqueId from the current UIViewRoot component right after creation!
WARNING: Component _id0 just got an automatic id, because there was no id assigned yet. If this component was created dynamically (i.e. not by a JSP tag) you should assign it an explicit static id or assign it the id you get from the createUniqueId from the current UIViewRoot component right after creation!
Tests run: 2, Failures: 0, Errors: 0, Skipped: 0, Time elapsed: 0.013 sec
Running org.apache.myfaces.el.PropertyResolverTestCase
Tests run: 1, Failures: 0, Errors: 0, Skipped: 0, Time elapsed: 0.003 sec
Running org.apache.myfaces.renderkit.html.HtmlMessageRendererTest
WARNING: Component _id0 just got an automatic id, because there was no id assigned yet. If this component was created dynamically (i.e. not by a JSP tag) you should assign it an explicit static id or assign it the id you get from the createUniqueId from the current UIViewRoot component right after creation!
WARNING: Component _id0 just got an automatic id, because there was no id assigned yet. If this component was created dynamically (i.e. not by a JSP tag) you should assign it an explicit static id or assign it the id you get from the createUniqueId from the current UIViewRoot component right after creation!
Tests run: 2, Failures: 0, Errors: 0, Skipped: 0, Time elapsed: 0.01 sec
Results :
Tests run: 48, Failures: 0, Errors: 0, Skipped: 0
[JENKINS] Recording test results
[INFO]
[INFO] --- maven-jar-plugin:2.3.2:jar (default-jar) @ myfaces-impl ---
[INFO] Building jar: F:\jenkins\jenkins-slave\workspace\myfaces-current11\current11\core\impl\target\myfaces-impl-1.1.11-SNAPSHOT.jar
[INFO]
[INFO] --- maven-site-plugin:3.0:attach-descriptor (attach-descriptor) @ myfaces-impl ---
[INFO]
[INFO] >>> maven-source-plugin:2.0.4:jar (attach-source) @ myfaces-impl >>>
[INFO]
[INFO] --- myfaces-builder-plugin:1.0.10:build-metadata (makemyfacesmetadata) @ myfaces-impl ---
[INFO] model is up to date
[INFO]
[INFO] --- myfaces-builder-plugin:1.0.10:make-config (makefacesconfig) @ myfaces-impl ---
[INFO] generated file standard-faces-config.xml is up to date
[INFO]
[INFO] --- myfaces-builder-plugin:1.0.10:make-tags (make_tags) @ myfaces-impl ---
[INFO] generated component tag files are up to date
[INFO]
[INFO] --- myfaces-builder-plugin:1.0.10:make-config (makecoretld) @ myfaces-impl ---
[INFO] generated file myfaces_core.tld is up to date
[INFO]
[INFO] --- myfaces-builder-plugin:1.0.10:make-config (makehtmltld) @ myfaces-impl ---
[INFO] generated file myfaces_html.tld is up to date
[WARNING] Failed to getClass for org.apache.maven.plugin.source.SourceJarMojo
[INFO]
[INFO] <<< maven-source-plugin:2.0.4:jar (attach-source) @ myfaces-impl <<<
[INFO]
[INFO] --- maven-source-plugin:2.0.4:jar (attach-source) @ myfaces-impl ---
[INFO] Building jar: F:\jenkins\jenkins-slave\workspace\myfaces-current11\current11\core\impl\target\myfaces-impl-1.1.11-SNAPSHOT-sources.jar
[INFO]
[INFO] --- maven-checkstyle-plugin:2.6:check (verify-style) @ myfaces-impl ---
[INFO]
[INFO]
[INFO] --- maven-install-plugin:2.3.1:install (default-install) @ myfaces-impl ---
[INFO] Installing F:\jenkins\jenkins-slave\workspace\myfaces-current11\current11\core\impl\target\myfaces-impl-1.1.11-SNAPSHOT.jar to f:\jenkins\jenkins-slave\maven-repositories\0\org\apache\myfaces\core\myfaces-impl\1.1.11-SNAPSHOT\myfaces-impl-1.1.11-SNAPSHOT.jar
[INFO] Installing F:\jenkins\jenkins-slave\workspace\myfaces-current11\current11\core\impl\pom.xml to f:\jenkins\jenkins-slave\maven-repositories\0\org\apache\myfaces\core\myfaces-impl\1.1.11-SNAPSHOT\myfaces-impl-1.1.11-SNAPSHOT.pom
[INFO] Installing F:\jenkins\jenkins-slave\workspace\myfaces-current11\current11\core\impl\target\myfaces-impl-1.1.11-SNAPSHOT-sources.jar to f:\jenkins\jenkins-slave\maven-repositories\0\org\apache\myfaces\core\myfaces-impl\1.1.11-SNAPSHOT\myfaces-impl-1.1.11-SNAPSHOT-sources.jar
[INFO]
[INFO] ------------------------------------------------------------------------
[INFO] Building Build Project 1.1.8-SNAPSHOT
[INFO] ------------------------------------------------------------------------
[INFO]
[INFO] --- maven-remote-resources-plugin:1.1:process (default) @ myfaces-base ---
[INFO] Setting property: classpath.resource.loader.class => 'org.codehaus.plexus.velocity.ContextClassLoaderResourceLoader'.
[INFO] Setting property: velocimacro.messages.on => 'false'.
[INFO] Setting property: resource.loader => 'classpath'.
[INFO] Setting property: resource.manager.logwhenfound => 'false'.
[INFO]
[INFO] --- maven-install-plugin:2.3:install (default-install) @ myfaces-base ---
[INFO] Installing <https://builds.apache.org/job/myfaces-current11/ws/current11\pom.xml> to f:\jenkins\jenkins-slave\maven-repositories\0\org\apache\myfaces\myfaces-base\1.1.8-SNAPSHOT\myfaces-base-1.1.8-SNAPSHOT.pom
[INFO] ------------------------------------------------------------------------
[INFO] Reactor Summary:
[INFO]
[INFO] Apache MyFaces Shared For JSF 1.1 - Project ....... SUCCESS [12.174s]
[INFO] Apache MyFaces Shared For JSF 1.1 - Core .......... SUCCESS [11.581s]
[INFO] MyFaces Shared Impl ............................... SUCCESS [3.939s]
[INFO] MyFaces Shared Tomahawk ........................... SUCCESS [3.288s]
[INFO] Apache MyFaces Shared - Orchestra ................. SUCCESS [2.937s]
[INFO] Apache MyFaces JSF-1.1 Core Project ............... SUCCESS [3.397s]
[INFO] Apache MyFaces JSF-1.1 API ........................ SUCCESS [8.804s]
[INFO] Apache MyFaces JSF-1.1 Implementation ............. SUCCESS [8.290s]
[INFO] Build Project ..................................... SUCCESS [2.375s]
[INFO] ------------------------------------------------------------------------
[INFO] BUILD SUCCESS
[INFO] ------------------------------------------------------------------------
[INFO] Total time: 1:03.764s
[INFO] Finished at: Tue Jun 24 06:12:22 PDT 2014
[INFO] Final Memory: 31M/76M
[INFO] ------------------------------------------------------------------------
Waiting for Jenkins to finish collecting data
[JENKINS] Archiving F:\jenkins\jenkins-slave\workspace\myfaces-current11\current11\shared\shared-tomahawk\pom.xml to org.apache.myfaces.shared/myfaces-shared-tomahawk/2.0.15-SNAPSHOT/myfaces-shared-tomahawk-2.0.15-SNAPSHOT.pom
[JENKINS] Archiving F:\jenkins\jenkins-slave\workspace\myfaces-current11\current11\shared\shared-tomahawk\target\myfaces-shared-tomahawk-2.0.15-SNAPSHOT.jar to org.apache.myfaces.shared/myfaces-shared-tomahawk/2.0.15-SNAPSHOT/myfaces-shared-tomahawk-2.0.15-SNAPSHOT.jar
[JENKINS] Archiving F:\jenkins\jenkins-slave\workspace\myfaces-current11\current11\shared\shared-tomahawk\target\myfaces-shared-tomahawk-2.0.15-SNAPSHOT-sources.jar to org.apache.myfaces.shared/myfaces-shared-tomahawk/2.0.15-SNAPSHOT/myfaces-shared-tomahawk-2.0.15-SNAPSHOT-sources.jar
Sending artifact delta relative to myfaces-current11 » MyFaces Shared Tomahawk #1174
Archived 3 artifacts
Archive block size is 32768
Received 11 blocks and 128752 bytes
Compression is 73.7%
Took 1.7 sec
[JENKINS] Archiving F:\jenkins\jenkins-slave\workspace\myfaces-current11\current11\core\impl\pom.xml to org.apache.myfaces.core/myfaces-impl/1.1.11-SNAPSHOT/myfaces-impl-1.1.11-SNAPSHOT.pom
[JENKINS] Archiving F:\jenkins\jenkins-slave\workspace\myfaces-current11\current11\core\impl\target\myfaces-impl-1.1.11-SNAPSHOT.jar to org.apache.myfaces.core/myfaces-impl/1.1.11-SNAPSHOT/myfaces-impl-1.1.11-SNAPSHOT.jar
[JENKINS] Archiving F:\jenkins\jenkins-slave\workspace\myfaces-current11\current11\core\impl\target\myfaces-impl-1.1.11-SNAPSHOT-sources.jar to org.apache.myfaces.core/myfaces-impl/1.1.11-SNAPSHOT/myfaces-impl-1.1.11-SNAPSHOT-sources.jar
Sending artifact delta relative to myfaces-current11 » Apache MyFaces JSF-1.1 Implementation #1174
Archived 3 artifacts
Archive block size is 32768
Received 34 blocks and 216737 bytes
Compression is 83.7%
Took 0.24 sec
[JENKINS] Archiving F:\jenkins\jenkins-slave\workspace\myfaces-current11\current11\shared\shared-impl\pom.xml to org.apache.myfaces.shared/myfaces-shared-impl/2.0.15-SNAPSHOT/myfaces-shared-impl-2.0.15-SNAPSHOT.pom
[JENKINS] Archiving F:\jenkins\jenkins-slave\workspace\myfaces-current11\current11\shared\shared-impl\target\myfaces-shared-impl-2.0.15-SNAPSHOT.jar to org.apache.myfaces.shared/myfaces-shared-impl/2.0.15-SNAPSHOT/myfaces-shared-impl-2.0.15-SNAPSHOT.jar
[JENKINS] Archiving F:\jenkins\jenkins-slave\workspace\myfaces-current11\current11\shared\shared-impl\target\myfaces-shared-impl-2.0.15-SNAPSHOT-sources.jar to org.apache.myfaces.shared/myfaces-shared-impl/2.0.15-SNAPSHOT/myfaces-shared-impl-2.0.15-SNAPSHOT-sources.jar
Sending artifact delta relative to myfaces-current11 » MyFaces Shared Impl #1174
Archived 3 artifacts
Archive block size is 32768
Received 11 blocks and 125676 bytes
Compression is 74.1%
Took 0.1 sec
[JENKINS] Archiving F:\jenkins\jenkins-slave\workspace\myfaces-current11\current11\shared\core\pom.xml to org.apache.myfaces.shared/myfaces-shared-core/2.0.15-SNAPSHOT/myfaces-shared-core-2.0.15-SNAPSHOT.pom
[JENKINS] Archiving F:\jenkins\jenkins-slave\workspace\myfaces-current11\current11\shared\core\target\myfaces-shared-core-2.0.15-SNAPSHOT.jar to org.apache.myfaces.shared/myfaces-shared-core/2.0.15-SNAPSHOT/myfaces-shared-core-2.0.15-SNAPSHOT.jar
[JENKINS] Archiving F:\jenkins\jenkins-slave\workspace\myfaces-current11\current11\shared\core\target\myfaces-shared-core-2.0.15-SNAPSHOT-sources.jar to org.apache.myfaces.shared/myfaces-shared-core/2.0.15-SNAPSHOT/myfaces-shared-core-2.0.15-SNAPSHOT-sources.jar
Sending artifact delta relative to myfaces-current11 » Apache MyFaces Shared For JSF 1.1 - Core #1174
Archived 3 artifacts
Archive block size is 32768
Received 11 blocks and 120867 bytes
Compression is 74.9%
Took 0.12 sec
[JENKINS] Archiving F:\jenkins\jenkins-slave\workspace\myfaces-current11\current11\core\api\pom.xml to org.apache.myfaces.core/myfaces-api/1.1.11-SNAPSHOT/myfaces-api-1.1.11-SNAPSHOT.pom
[JENKINS] Archiving F:\jenkins\jenkins-slave\workspace\myfaces-current11\current11\core\api\target\myfaces-api-1.1.11-SNAPSHOT.jar to org.apache.myfaces.core/myfaces-api/1.1.11-SNAPSHOT/myfaces-api-1.1.11-SNAPSHOT.jar
[JENKINS] Archiving F:\jenkins\jenkins-slave\workspace\myfaces-current11\current11\core\api\target\myfaces-api-1.1.11-SNAPSHOT-sources.jar to org.apache.myfaces.core/myfaces-api/1.1.11-SNAPSHOT/myfaces-api-1.1.11-SNAPSHOT-sources.jar
Sending artifact delta relative to myfaces-current11 » Apache MyFaces JSF-1.1 API #1174
Archived 3 artifacts
Archive block size is 32768
Received 18 blocks and 178083 bytes
Compression is 76.8%
Took 0.13 sec
[JENKINS] Archiving F:\jenkins\jenkins-slave\workspace\myfaces-current11\current11\shared\shared-orchestra\pom.xml to org.apache.myfaces.shared/myfaces-shared-orchestra/2.0.15-SNAPSHOT/myfaces-shared-orchestra-2.0.15-SNAPSHOT.pom
[JENKINS] Archiving F:\jenkins\jenkins-slave\workspace\myfaces-current11\current11\shared\shared-orchestra\target\myfaces-shared-orchestra-2.0.15-SNAPSHOT.jar to org.apache.myfaces.shared/myfaces-shared-orchestra/2.0.15-SNAPSHOT/myfaces-shared-orchestra-2.0.15-SNAPSHOT.jar
[JENKINS] Archiving F:\jenkins\jenkins-slave\workspace\myfaces-current11\current11\shared\shared-orchestra\target\myfaces-shared-orchestra-2.0.15-SNAPSHOT-sources.jar to org.apache.myfaces.shared/myfaces-shared-orchestra/2.0.15-SNAPSHOT/myfaces-shared-orchestra-2.0.15-SNAPSHOT-sources.jar
Sending artifact delta relative to myfaces-current11 » Apache MyFaces Shared - Orchestra #1174
Archived 3 artifacts
Archive block size is 32768
Received 11 blocks and 129076 bytes
Compression is 73.6%
Took 0.24 sec
[JENKINS] Archiving F:\jenkins\jenkins-slave\workspace\myfaces-current11\current11\shared\pom.xml to org.apache.myfaces.shared/myfaces-shared-project/2.0.15-SNAPSHOT/myfaces-shared-project-2.0.15-SNAPSHOT.pom
[JENKINS] Archiving F:\jenkins\jenkins-slave\workspace\myfaces-current11\current11\shared\target\myfaces-shared-project-2.0.15-SNAPSHOT-site.xml to org.apache.myfaces.shared/myfaces-shared-project/2.0.15-SNAPSHOT/myfaces-shared-project-2.0.15-SNAPSHOT-site.xml
Sending artifact delta relative to myfaces-current11 » Apache MyFaces Shared For JSF 1.1 - Project #1174
Archived 2 artifacts
Archive block size is 32768
Received 0 blocks and 10288 bytes
Compression is 0.0%
Took 40 ms
[JENKINS] Archiving F:\jenkins\jenkins-slave\workspace\myfaces-current11\current11\core\pom.xml to org.apache.myfaces.core/myfaces-core-project/1.1.11-SNAPSHOT/myfaces-core-project-1.1.11-SNAPSHOT.pom
[JENKINS] Archiving F:\jenkins\jenkins-slave\workspace\myfaces-current11\current11\core\target\myfaces-core-project-1.1.11-SNAPSHOT-site.xml to org.apache.myfaces.core/myfaces-core-project/1.1.11-SNAPSHOT/myfaces-core-project-1.1.11-SNAPSHOT-site.xml
Sending artifact delta relative to myfaces-current11 » Apache MyFaces JSF-1.1 Core Project #1174
Archived 2 artifacts
Archive block size is 32768
Received 0 blocks and 20788 bytes
Compression is 0.0%
Took 29 ms
[JENKINS] Archiving <https://builds.apache.org/job/myfaces-current11/ws/current11\pom.xml> to org.apache.myfaces/myfaces-base/1.1.8-SNAPSHOT/myfaces-base-1.1.8-SNAPSHOT.pom
Sending artifact delta relative to myfaces-current11 » Build Project #1174
Archived 1 artifacts
Archive block size is 32768
Received 0 blocks and 1172 bytes
Compression is 0.0%
Took 28 ms
channel stopped
Maven RedeployPublisher use remote windows2 maven settings from : f:\jenkins\tools\maven\latest/conf/settings.xml
[ERROR] uniqueVersion == false is not anymore supported in maven 3
[INFO] Deployment in https://repository.apache.org/content/repositories/snapshots (id=apache.snapshots.https,uniqueVersion=false)
Deploying the main artifact myfaces-base-1.1.8-SNAPSHOT.pom
Downloading: https://repository.apache.org/content/repositories/snapshots/org/apache/myfaces/myfaces-base/1.1.8-SNAPSHOT/maven-metadata.xml
Downloaded: https://repository.apache.org/content/repositories/snapshots/org/apache/myfaces/myfaces-base/1.1.8-SNAPSHOT/maven-metadata.xml (611 B at 11.5 KB/sec)
Uploading: https://repository.apache.org/content/repositories/snapshots/org/apache/myfaces/myfaces-base/1.1.8-SNAPSHOT/myfaces-base-1.1.8-20140624.131230-553.pom
ERROR: Failed to deploy artifacts: Could not transfer artifact org.apache.myfaces:myfaces-base:pom:1.1.8-20140624.131230-553 from/to apache.snapshots.https (https://repository.apache.org/content/repositories/snapshots): Failed to transfer file: https://repository.apache.org/content/repositories/snapshots/org/apache/myfaces/myfaces-base/1.1.8-SNAPSHOT/myfaces-base-1.1.8-20140624.131230-553.pom. Return code is: 401, ReasonPhrase: Unauthorized.
org.apache.maven.artifact.deployer.ArtifactDeploymentException: Failed to deploy artifacts: Could not transfer artifact org.apache.myfaces:myfaces-base:pom:1.1.8-20140624.131230-553 from/to apache.snapshots.https (https://repository.apache.org/content/repositories/snapshots): Failed to transfer file: https://repository.apache.org/content/repositories/snapshots/org/apache/myfaces/myfaces-base/1.1.8-SNAPSHOT/myfaces-base-1.1.8-20140624.131230-553.pom. Return code is: 401, ReasonPhrase: Unauthorized.
at org.apache.maven.artifact.deployer.DefaultArtifactDeployer.deploy(DefaultArtifactDeployer.java:143)
at hudson.maven.reporters.MavenArtifactRecord.deploy(MavenArtifactRecord.java:193)
at hudson.maven.RedeployPublisher.perform(RedeployPublisher.java:176)
at hudson.tasks.BuildStepMonitor$1.perform(BuildStepMonitor.java:20)
at hudson.model.AbstractBuild$AbstractBuildExecution.perform(AbstractBuild.java:804)
at hudson.model.AbstractBuild$AbstractBuildExecution.performAllBuildSteps(AbstractBuild.java:776)
at hudson.maven.MavenModuleSetBuild$MavenModuleSetBuildExecution.post2(MavenModuleSetBuild.java:1040)
at hudson.model.AbstractBuild$AbstractBuildExecution.post(AbstractBuild.java:725)
at hudson.model.Run.execute(Run.java:1701)
at hudson.maven.MavenModuleSetBuild.run(MavenModuleSetBuild.java:529)
at hudson.model.ResourceController.execute(ResourceController.java:88)
at hudson.model.Executor.run(Executor.java:231)
Caused by: org.eclipse.aether.deployment.DeploymentException: Failed to deploy artifacts: Could not transfer artifact org.apache.myfaces:myfaces-base:pom:1.1.8-20140624.131230-553 from/to apache.snapshots.https (https://repository.apache.org/content/repositories/snapshots): Failed to transfer file: https://repository.apache.org/content/repositories/snapshots/org/apache/myfaces/myfaces-base/1.1.8-SNAPSHOT/myfaces-base-1.1.8-20140624.131230-553.pom. Return code is: 401, ReasonPhrase: Unauthorized.
at org.eclipse.aether.internal.impl.DefaultDeployer.deploy(DefaultDeployer.java:341)
at org.eclipse.aether.internal.impl.DefaultDeployer.deploy(DefaultDeployer.java:269)
at org.eclipse.aether.internal.impl.DefaultRepositorySystem.deploy(DefaultRepositorySystem.java:413)
at org.apache.maven.artifact.deployer.DefaultArtifactDeployer.deploy(DefaultArtifactDeployer.java:139)
... 11 more
Caused by: org.eclipse.aether.transfer.ArtifactTransferException: Could not transfer artifact org.apache.myfaces:myfaces-base:pom:1.1.8-20140624.131230-553 from/to apache.snapshots.https (https://repository.apache.org/content/repositories/snapshots): Failed to transfer file: https://repository.apache.org/content/repositories/snapshots/org/apache/myfaces/myfaces-base/1.1.8-SNAPSHOT/myfaces-base-1.1.8-20140624.131230-553.pom. Return code is: 401, ReasonPhrase: Unauthorized.
at org.eclipse.aether.connector.wagon.WagonRepositoryConnector$6.wrap(WagonRepositoryConnector.java:1016)
at org.eclipse.aether.connector.wagon.WagonRepositoryConnector$6.wrap(WagonRepositoryConnector.java:1004)
at org.eclipse.aether.connector.wagon.WagonRepositoryConnector$PutTask.run(WagonRepositoryConnector.java:895)
at org.eclipse.aether.connector.wagon.WagonRepositoryConnector.put(WagonRepositoryConnector.java:522)
at org.eclipse.aether.internal.impl.DefaultDeployer.deploy(DefaultDeployer.java:335)
... 14 more
Caused by: org.apache.maven.wagon.TransferFailedException: Failed to transfer file: https://repository.apache.org/content/repositories/snapshots/org/apache/myfaces/myfaces-base/1.1.8-SNAPSHOT/myfaces-base-1.1.8-20140624.131230-553.pom. Return code is: 401, ReasonPhrase: Unauthorized.
at org.apache.maven.wagon.shared.http4.AbstractHttpClientWagon.put(AbstractHttpClientWagon.java:626)
at org.apache.maven.wagon.shared.http4.AbstractHttpClientWagon.put(AbstractHttpClientWagon.java:524)
at org.apache.maven.wagon.shared.http4.AbstractHttpClientWagon.put(AbstractHttpClientWagon.java:505)
at org.apache.maven.wagon.shared.http4.AbstractHttpClientWagon.put(AbstractHttpClientWagon.java:485)
at org.eclipse.aether.connector.wagon.WagonRepositoryConnector$PutTask.run(WagonRepositoryConnector.java:871)
... 16 more
[INFO] Deployment failed after 0.54 sec
Build step 'Deploy artifacts to Maven repository' changed build result to FAILURE
Build failed in Jenkins: myfaces-current11 #1174
Posted by Apache Jenkins Server <je...@builds.apache.org>.
See <https://builds.apache.org/job/myfaces-current11/1174/>
------------------------------------------
[...truncated 1140 lines...]
Jun 24, 2014 4:49:50 AM org.apache.myfaces.shared_impl.config.MyfacesConfig getBooleanInitParameter
INFO: No context init parameter 'org.apache.myfaces.PRETTY_HTML' found, using default value true
Jun 24, 2014 4:49:50 AM org.apache.myfaces.shared_impl.config.MyfacesConfig getBooleanInitParameter
INFO: No context init parameter 'org.apache.myfaces.ALLOW_JAVASCRIPT' found, using default value true
Jun 24, 2014 4:49:50 AM org.apache.myfaces.shared_impl.config.MyfacesConfig getBooleanInitParameter
INFO: No context init parameter 'org.apache.myfaces.READONLY_AS_DISABLED_FOR_SELECTS' found, using default value true
Jun 24, 2014 4:49:50 AM org.apache.myfaces.shared_impl.config.MyfacesConfig getBooleanInitParameter
INFO: No context init parameter 'org.apache.myfaces.RENDER_VIEWSTATE_ID' found, using default value true
Jun 24, 2014 4:49:50 AM org.apache.myfaces.shared_impl.config.MyfacesConfig getBooleanInitParameter
INFO: No context init parameter 'org.apache.myfaces.STRICT_XHTML_LINKS' found, using default value true
Jun 24, 2014 4:49:50 AM org.apache.myfaces.shared_impl.config.MyfacesConfig getLongInitParameter
INFO: No context init parameter 'org.apache.myfaces.CONFIG_REFRESH_PERIOD' found, using default value 2
Jun 24, 2014 4:49:50 AM org.apache.myfaces.shared_impl.config.MyfacesConfig createAndInitializeMyFacesConfig
INFO: Tomahawk jar not available. Autoscrolling, DetectJavascript, AddResourceClass and CheckExtensionsFilter are disabled now.
Jun 24, 2014 4:49:50 AM org.apache.myfaces.shared_impl.config.MyfacesConfig createAndInitializeMyFacesConfig
INFO: Starting up Tomahawk on the MyFaces-JSF-Implementation
Tests run: 2, Failures: 0, Errors: 0, Skipped: 0, Time elapsed: 0.011 sec
Running org.apache.myfaces.renderkit.html.HtmlSecretRendererTest
WARNING: Component _id0 just got an automatic id, because there was no id assigned yet. If this component was created dynamically (i.e. not by a JSP tag) you should assign it an explicit static id or assign it the id you get from the createUniqueId from the current UIViewRoot component right after creation!
WARNING: Component _id0 just got an automatic id, because there was no id assigned yet. If this component was created dynamically (i.e. not by a JSP tag) you should assign it an explicit static id or assign it the id you get from the createUniqueId from the current UIViewRoot component right after creation!
Tests run: 2, Failures: 0, Errors: 0, Skipped: 0, Time elapsed: 0.022 sec
Running org.apache.myfaces.renderkit.html.HtmlImageRendererTest
Jun 24, 2014 4:49:50 AM org.apache.myfaces.shared_impl.renderkit.html.HtmlImageRendererBase encodeEnd
WARNING: ALT attribute is missing for : img1
Jun 24, 2014 4:49:50 AM org.apache.myfaces.shared_impl.renderkit.html.HtmlImageRendererBase encodeEnd
WARNING: ALT attribute is missing for : img1
Jun 24, 2014 4:49:50 AM org.apache.myfaces.shared_impl.renderkit.html.HtmlImageRendererBase encodeEnd
WARNING: ALT attribute is missing for : img1
Tests run: 3, Failures: 0, Errors: 0, Skipped: 0, Time elapsed: 0.024 sec
Running org.apache.myfaces.renderkit.html.HtmlCheckboxRendererTest
WARNING: Component _id0 just got an automatic id, because there was no id assigned yet. If this component was created dynamically (i.e. not by a JSP tag) you should assign it an explicit static id or assign it the id you get from the createUniqueId from the current UIViewRoot component right after creation!
WARNING: Component _id0 just got an automatic id, because there was no id assigned yet. If this component was created dynamically (i.e. not by a JSP tag) you should assign it an explicit static id or assign it the id you get from the createUniqueId from the current UIViewRoot component right after creation!
Tests run: 2, Failures: 0, Errors: 0, Skipped: 0, Time elapsed: 0.015 sec
Running org.apache.myfaces.renderkit.html.HtmlTextareaRendererTest
WARNING: Component _id0 just got an automatic id, because there was no id assigned yet. If this component was created dynamically (i.e. not by a JSP tag) you should assign it an explicit static id or assign it the id you get from the createUniqueId from the current UIViewRoot component right after creation!
WARNING: Component _id0 just got an automatic id, because there was no id assigned yet. If this component was created dynamically (i.e. not by a JSP tag) you should assign it an explicit static id or assign it the id you get from the createUniqueId from the current UIViewRoot component right after creation!
WARNING: Component _id0 just got an automatic id, because there was no id assigned yet. If this component was created dynamically (i.e. not by a JSP tag) you should assign it an explicit static id or assign it the id you get from the createUniqueId from the current UIViewRoot component right after creation!
Tests run: 3, Failures: 0, Errors: 0, Skipped: 0, Time elapsed: 0.012 sec
Running org.apache.myfaces.renderkit.html.HtmlLabelRendererTest
WARNING: Component _id0 just got an automatic id, because there was no id assigned yet. If this component was created dynamically (i.e. not by a JSP tag) you should assign it an explicit static id or assign it the id you get from the createUniqueId from the current UIViewRoot component right after creation!
Jun 24, 2014 4:49:50 AM org.apache.myfaces.shared_impl.renderkit.RendererUtils getClientId
INFO: Unable to find component 'compId' (calling findComponent on component '_id0'). We'll try to return a guessed client-id anyways - this will be a problem if you put the referenced component into a different naming-container. If this is the case, you can always use the full client-id.
Tests run: 1, Failures: 0, Errors: 0, Skipped: 0, Time elapsed: 0.011 sec
Running org.apache.myfaces.renderkit.html.HtmlMenuRendererTest
WARNING: Component _id0 just got an automatic id, because there was no id assigned yet. If this component was created dynamically (i.e. not by a JSP tag) you should assign it an explicit static id or assign it the id you get from the createUniqueId from the current UIViewRoot component right after creation!
WARNING: Component _id0 just got an automatic id, because there was no id assigned yet. If this component was created dynamically (i.e. not by a JSP tag) you should assign it an explicit static id or assign it the id you get from the createUniqueId from the current UIViewRoot component right after creation!
Tests run: 2, Failures: 0, Errors: 0, Skipped: 0, Time elapsed: 0.016 sec
Running org.apache.myfaces.el.PropertyResolverTestCase
Tests run: 1, Failures: 0, Errors: 0, Skipped: 0, Time elapsed: 0.005 sec
Running org.apache.myfaces.renderkit.html.HtmlMessageRendererTest
WARNING: Component _id0 just got an automatic id, because there was no id assigned yet. If this component was created dynamically (i.e. not by a JSP tag) you should assign it an explicit static id or assign it the id you get from the createUniqueId from the current UIViewRoot component right after creation!
WARNING: Component _id0 just got an automatic id, because there was no id assigned yet. If this component was created dynamically (i.e. not by a JSP tag) you should assign it an explicit static id or assign it the id you get from the createUniqueId from the current UIViewRoot component right after creation!
Tests run: 2, Failures: 0, Errors: 0, Skipped: 0, Time elapsed: 0.059 sec
Results :
Tests run: 48, Failures: 0, Errors: 0, Skipped: 0
[JENKINS] Recording test results
[INFO]
[INFO] --- maven-jar-plugin:2.3.2:jar (default-jar) @ myfaces-impl ---
[INFO] Building jar: F:\jenkins\jenkins-slave\workspace\myfaces-current11\current11\core\impl\target\myfaces-impl-1.1.11-SNAPSHOT.jar
[INFO]
[INFO] --- maven-site-plugin:3.0:attach-descriptor (attach-descriptor) @ myfaces-impl ---
[INFO]
[INFO] >>> maven-source-plugin:2.0.4:jar (attach-source) @ myfaces-impl >>>
[INFO]
[INFO] --- myfaces-builder-plugin:1.0.10:build-metadata (makemyfacesmetadata) @ myfaces-impl ---
[INFO] model is up to date
[INFO]
[INFO] --- myfaces-builder-plugin:1.0.10:make-config (makefacesconfig) @ myfaces-impl ---
[INFO] generated file standard-faces-config.xml is up to date
[INFO]
[INFO] --- myfaces-builder-plugin:1.0.10:make-tags (make_tags) @ myfaces-impl ---
[INFO] generated component tag files are up to date
[INFO]
[INFO] --- myfaces-builder-plugin:1.0.10:make-config (makecoretld) @ myfaces-impl ---
[INFO] generated file myfaces_core.tld is up to date
[INFO]
[INFO] --- myfaces-builder-plugin:1.0.10:make-config (makehtmltld) @ myfaces-impl ---
[INFO] generated file myfaces_html.tld is up to date
[WARNING] Failed to getClass for org.apache.maven.plugin.source.SourceJarMojo
[INFO]
[INFO] <<< maven-source-plugin:2.0.4:jar (attach-source) @ myfaces-impl <<<
[INFO]
[INFO] --- maven-source-plugin:2.0.4:jar (attach-source) @ myfaces-impl ---
[INFO] Building jar: F:\jenkins\jenkins-slave\workspace\myfaces-current11\current11\core\impl\target\myfaces-impl-1.1.11-SNAPSHOT-sources.jar
[INFO]
[INFO] --- maven-checkstyle-plugin:2.6:check (verify-style) @ myfaces-impl ---
[INFO]
[INFO]
[INFO] --- maven-install-plugin:2.3.1:install (default-install) @ myfaces-impl ---
[INFO] Installing F:\jenkins\jenkins-slave\workspace\myfaces-current11\current11\core\impl\target\myfaces-impl-1.1.11-SNAPSHOT.jar to f:\jenkins\jenkins-slave\maven-repositories\0\org\apache\myfaces\core\myfaces-impl\1.1.11-SNAPSHOT\myfaces-impl-1.1.11-SNAPSHOT.jar
[INFO] Installing F:\jenkins\jenkins-slave\workspace\myfaces-current11\current11\core\impl\pom.xml to f:\jenkins\jenkins-slave\maven-repositories\0\org\apache\myfaces\core\myfaces-impl\1.1.11-SNAPSHOT\myfaces-impl-1.1.11-SNAPSHOT.pom
[INFO] Installing F:\jenkins\jenkins-slave\workspace\myfaces-current11\current11\core\impl\target\myfaces-impl-1.1.11-SNAPSHOT-sources.jar to f:\jenkins\jenkins-slave\maven-repositories\0\org\apache\myfaces\core\myfaces-impl\1.1.11-SNAPSHOT\myfaces-impl-1.1.11-SNAPSHOT-sources.jar
[INFO]
[INFO] ------------------------------------------------------------------------
[INFO] Building Build Project 1.1.8-SNAPSHOT
[INFO] ------------------------------------------------------------------------
[INFO]
[INFO] --- maven-remote-resources-plugin:1.1:process (default) @ myfaces-base ---
[INFO] Setting property: classpath.resource.loader.class => 'org.codehaus.plexus.velocity.ContextClassLoaderResourceLoader'.
[INFO] Setting property: velocimacro.messages.on => 'false'.
[INFO] Setting property: resource.loader => 'classpath'.
[INFO] Setting property: resource.manager.logwhenfound => 'false'.
[INFO]
[INFO] --- maven-install-plugin:2.3:install (default-install) @ myfaces-base ---
[INFO] Installing <https://builds.apache.org/job/myfaces-current11/ws/current11\pom.xml> to f:\jenkins\jenkins-slave\maven-repositories\0\org\apache\myfaces\myfaces-base\1.1.8-SNAPSHOT\myfaces-base-1.1.8-SNAPSHOT.pom
[INFO] ------------------------------------------------------------------------
[INFO] Reactor Summary:
[INFO]
[INFO] Apache MyFaces Shared For JSF 1.1 - Project ....... SUCCESS [18.197s]
[INFO] Apache MyFaces Shared For JSF 1.1 - Core .......... SUCCESS [21.717s]
[INFO] MyFaces Shared Impl ............................... SUCCESS [11.209s]
[INFO] MyFaces Shared Tomahawk ........................... SUCCESS [6.942s]
[INFO] Apache MyFaces Shared - Orchestra ................. SUCCESS [12.331s]
[INFO] Apache MyFaces JSF-1.1 Core Project ............... SUCCESS [5.963s]
[INFO] Apache MyFaces JSF-1.1 API ........................ SUCCESS [20.918s]
[INFO] Apache MyFaces JSF-1.1 Implementation ............. SUCCESS [24.263s]
[INFO] Build Project ..................................... SUCCESS [1.031s]
[INFO] ------------------------------------------------------------------------
[INFO] BUILD SUCCESS
[INFO] ------------------------------------------------------------------------
[INFO] Total time: 2:25.054s
[INFO] Finished at: Tue Jun 24 04:50:07 PDT 2014
[INFO] Final Memory: 31M/76M
[INFO] ------------------------------------------------------------------------
Waiting for Jenkins to finish collecting data
[JENKINS] Archiving F:\jenkins\jenkins-slave\workspace\myfaces-current11\current11\shared\shared-tomahawk\pom.xml to org.apache.myfaces.shared/myfaces-shared-tomahawk/2.0.15-SNAPSHOT/myfaces-shared-tomahawk-2.0.15-SNAPSHOT.pom
[JENKINS] Archiving F:\jenkins\jenkins-slave\workspace\myfaces-current11\current11\shared\shared-tomahawk\target\myfaces-shared-tomahawk-2.0.15-SNAPSHOT.jar to org.apache.myfaces.shared/myfaces-shared-tomahawk/2.0.15-SNAPSHOT/myfaces-shared-tomahawk-2.0.15-SNAPSHOT.jar
[JENKINS] Archiving F:\jenkins\jenkins-slave\workspace\myfaces-current11\current11\shared\shared-tomahawk\target\myfaces-shared-tomahawk-2.0.15-SNAPSHOT-sources.jar to org.apache.myfaces.shared/myfaces-shared-tomahawk/2.0.15-SNAPSHOT/myfaces-shared-tomahawk-2.0.15-SNAPSHOT-sources.jar
Sending artifact delta relative to myfaces-current11 » MyFaces Shared Tomahawk #1173
Archived 3 artifacts
Archive block size is 32768
Received 11 blocks and 128752 bytes
Compression is 73.7%
Took 2.4 sec
[JENKINS] Archiving F:\jenkins\jenkins-slave\workspace\myfaces-current11\current11\core\impl\pom.xml to org.apache.myfaces.core/myfaces-impl/1.1.11-SNAPSHOT/myfaces-impl-1.1.11-SNAPSHOT.pom
[JENKINS] Archiving F:\jenkins\jenkins-slave\workspace\myfaces-current11\current11\core\impl\target\myfaces-impl-1.1.11-SNAPSHOT.jar to org.apache.myfaces.core/myfaces-impl/1.1.11-SNAPSHOT/myfaces-impl-1.1.11-SNAPSHOT.jar
[JENKINS] Archiving F:\jenkins\jenkins-slave\workspace\myfaces-current11\current11\core\impl\target\myfaces-impl-1.1.11-SNAPSHOT-sources.jar to org.apache.myfaces.core/myfaces-impl/1.1.11-SNAPSHOT/myfaces-impl-1.1.11-SNAPSHOT-sources.jar
Sending artifact delta relative to myfaces-current11 » Apache MyFaces JSF-1.1 Implementation #1173
Archived 3 artifacts
Archive block size is 32768
Received 34 blocks and 216737 bytes
Compression is 83.7%
Took 0.25 sec
[JENKINS] Archiving F:\jenkins\jenkins-slave\workspace\myfaces-current11\current11\shared\shared-impl\pom.xml to org.apache.myfaces.shared/myfaces-shared-impl/2.0.15-SNAPSHOT/myfaces-shared-impl-2.0.15-SNAPSHOT.pom
[JENKINS] Archiving F:\jenkins\jenkins-slave\workspace\myfaces-current11\current11\shared\shared-impl\target\myfaces-shared-impl-2.0.15-SNAPSHOT.jar to org.apache.myfaces.shared/myfaces-shared-impl/2.0.15-SNAPSHOT/myfaces-shared-impl-2.0.15-SNAPSHOT.jar
[JENKINS] Archiving F:\jenkins\jenkins-slave\workspace\myfaces-current11\current11\shared\shared-impl\target\myfaces-shared-impl-2.0.15-SNAPSHOT-sources.jar to org.apache.myfaces.shared/myfaces-shared-impl/2.0.15-SNAPSHOT/myfaces-shared-impl-2.0.15-SNAPSHOT-sources.jar
Sending artifact delta relative to myfaces-current11 » MyFaces Shared Impl #1173
Archived 3 artifacts
Archive block size is 32768
Received 11 blocks and 125676 bytes
Compression is 74.1%
Took 2.1 sec
[JENKINS] Archiving F:\jenkins\jenkins-slave\workspace\myfaces-current11\current11\shared\core\pom.xml to org.apache.myfaces.shared/myfaces-shared-core/2.0.15-SNAPSHOT/myfaces-shared-core-2.0.15-SNAPSHOT.pom
[JENKINS] Archiving F:\jenkins\jenkins-slave\workspace\myfaces-current11\current11\shared\core\target\myfaces-shared-core-2.0.15-SNAPSHOT.jar to org.apache.myfaces.shared/myfaces-shared-core/2.0.15-SNAPSHOT/myfaces-shared-core-2.0.15-SNAPSHOT.jar
[JENKINS] Archiving F:\jenkins\jenkins-slave\workspace\myfaces-current11\current11\shared\core\target\myfaces-shared-core-2.0.15-SNAPSHOT-sources.jar to org.apache.myfaces.shared/myfaces-shared-core/2.0.15-SNAPSHOT/myfaces-shared-core-2.0.15-SNAPSHOT-sources.jar
Sending artifact delta relative to myfaces-current11 » Apache MyFaces Shared For JSF 1.1 - Core #1173
Archived 3 artifacts
Archive block size is 32768
Received 11 blocks and 120867 bytes
Compression is 74.9%
Took 0.22 sec
[JENKINS] Archiving F:\jenkins\jenkins-slave\workspace\myfaces-current11\current11\core\api\pom.xml to org.apache.myfaces.core/myfaces-api/1.1.11-SNAPSHOT/myfaces-api-1.1.11-SNAPSHOT.pom
[JENKINS] Archiving F:\jenkins\jenkins-slave\workspace\myfaces-current11\current11\core\api\target\myfaces-api-1.1.11-SNAPSHOT.jar to org.apache.myfaces.core/myfaces-api/1.1.11-SNAPSHOT/myfaces-api-1.1.11-SNAPSHOT.jar
[JENKINS] Archiving F:\jenkins\jenkins-slave\workspace\myfaces-current11\current11\core\api\target\myfaces-api-1.1.11-SNAPSHOT-sources.jar to org.apache.myfaces.core/myfaces-api/1.1.11-SNAPSHOT/myfaces-api-1.1.11-SNAPSHOT-sources.jar
Sending artifact delta relative to myfaces-current11 » Apache MyFaces JSF-1.1 API #1173
Archived 3 artifacts
Archive block size is 32768
Received 18 blocks and 178083 bytes
Compression is 76.8%
Took 0.27 sec
[JENKINS] Archiving F:\jenkins\jenkins-slave\workspace\myfaces-current11\current11\shared\shared-orchestra\pom.xml to org.apache.myfaces.shared/myfaces-shared-orchestra/2.0.15-SNAPSHOT/myfaces-shared-orchestra-2.0.15-SNAPSHOT.pom
[JENKINS] Archiving F:\jenkins\jenkins-slave\workspace\myfaces-current11\current11\shared\shared-orchestra\target\myfaces-shared-orchestra-2.0.15-SNAPSHOT.jar to org.apache.myfaces.shared/myfaces-shared-orchestra/2.0.15-SNAPSHOT/myfaces-shared-orchestra-2.0.15-SNAPSHOT.jar
[JENKINS] Archiving F:\jenkins\jenkins-slave\workspace\myfaces-current11\current11\shared\shared-orchestra\target\myfaces-shared-orchestra-2.0.15-SNAPSHOT-sources.jar to org.apache.myfaces.shared/myfaces-shared-orchestra/2.0.15-SNAPSHOT/myfaces-shared-orchestra-2.0.15-SNAPSHOT-sources.jar
Sending artifact delta relative to myfaces-current11 » Apache MyFaces Shared - Orchestra #1173
Archived 3 artifacts
Archive block size is 32768
Received 11 blocks and 129076 bytes
Compression is 73.6%
Took 1.7 sec
[JENKINS] Archiving F:\jenkins\jenkins-slave\workspace\myfaces-current11\current11\shared\pom.xml to org.apache.myfaces.shared/myfaces-shared-project/2.0.15-SNAPSHOT/myfaces-shared-project-2.0.15-SNAPSHOT.pom
[JENKINS] Archiving F:\jenkins\jenkins-slave\workspace\myfaces-current11\current11\shared\target\myfaces-shared-project-2.0.15-SNAPSHOT-site.xml to org.apache.myfaces.shared/myfaces-shared-project/2.0.15-SNAPSHOT/myfaces-shared-project-2.0.15-SNAPSHOT-site.xml
Sending artifact delta relative to myfaces-current11 » Apache MyFaces Shared For JSF 1.1 - Project #1173
Archived 2 artifacts
Archive block size is 32768
Received 0 blocks and 10288 bytes
Compression is 0.0%
Took 34 ms
[JENKINS] Archiving F:\jenkins\jenkins-slave\workspace\myfaces-current11\current11\core\pom.xml to org.apache.myfaces.core/myfaces-core-project/1.1.11-SNAPSHOT/myfaces-core-project-1.1.11-SNAPSHOT.pom
[JENKINS] Archiving F:\jenkins\jenkins-slave\workspace\myfaces-current11\current11\core\target\myfaces-core-project-1.1.11-SNAPSHOT-site.xml to org.apache.myfaces.core/myfaces-core-project/1.1.11-SNAPSHOT/myfaces-core-project-1.1.11-SNAPSHOT-site.xml
Sending artifact delta relative to myfaces-current11 » Apache MyFaces JSF-1.1 Core Project #1173
Archived 2 artifacts
Archive block size is 32768
Received 0 blocks and 20788 bytes
Compression is 0.0%
Took 67 ms
[JENKINS] Archiving <https://builds.apache.org/job/myfaces-current11/ws/current11\pom.xml> to org.apache.myfaces/myfaces-base/1.1.8-SNAPSHOT/myfaces-base-1.1.8-SNAPSHOT.pom
Sending artifact delta relative to myfaces-current11 » Build Project #1173
Archived 1 artifacts
Archive block size is 32768
Received 0 blocks and 1172 bytes
Compression is 0.0%
Took 6 ms
channel stopped
Maven RedeployPublisher use remote windows2 maven settings from : f:\jenkins\tools\maven\latest/conf/settings.xml
[ERROR] uniqueVersion == false is not anymore supported in maven 3
[INFO] Deployment in https://repository.apache.org/content/repositories/snapshots (id=apache.snapshots.https,uniqueVersion=false)
Deploying the main artifact myfaces-base-1.1.8-SNAPSHOT.pom
Downloading: https://repository.apache.org/content/repositories/snapshots/org/apache/myfaces/myfaces-base/1.1.8-SNAPSHOT/maven-metadata.xml
Downloaded: https://repository.apache.org/content/repositories/snapshots/org/apache/myfaces/myfaces-base/1.1.8-SNAPSHOT/maven-metadata.xml (611 B at 0.2 KB/sec)
Uploading: https://repository.apache.org/content/repositories/snapshots/org/apache/myfaces/myfaces-base/1.1.8-SNAPSHOT/myfaces-base-1.1.8-20140624.115027-553.pom
ERROR: Failed to deploy artifacts: Could not transfer artifact org.apache.myfaces:myfaces-base:pom:1.1.8-20140624.115027-553 from/to apache.snapshots.https (https://repository.apache.org/content/repositories/snapshots): Failed to transfer file: https://repository.apache.org/content/repositories/snapshots/org/apache/myfaces/myfaces-base/1.1.8-SNAPSHOT/myfaces-base-1.1.8-20140624.115027-553.pom. Return code is: 401, ReasonPhrase: Unauthorized.
org.apache.maven.artifact.deployer.ArtifactDeploymentException: Failed to deploy artifacts: Could not transfer artifact org.apache.myfaces:myfaces-base:pom:1.1.8-20140624.115027-553 from/to apache.snapshots.https (https://repository.apache.org/content/repositories/snapshots): Failed to transfer file: https://repository.apache.org/content/repositories/snapshots/org/apache/myfaces/myfaces-base/1.1.8-SNAPSHOT/myfaces-base-1.1.8-20140624.115027-553.pom. Return code is: 401, ReasonPhrase: Unauthorized.
at org.apache.maven.artifact.deployer.DefaultArtifactDeployer.deploy(DefaultArtifactDeployer.java:143)
at hudson.maven.reporters.MavenArtifactRecord.deploy(MavenArtifactRecord.java:193)
at hudson.maven.RedeployPublisher.perform(RedeployPublisher.java:176)
at hudson.tasks.BuildStepMonitor$1.perform(BuildStepMonitor.java:20)
at hudson.model.AbstractBuild$AbstractBuildExecution.perform(AbstractBuild.java:804)
at hudson.model.AbstractBuild$AbstractBuildExecution.performAllBuildSteps(AbstractBuild.java:776)
at hudson.maven.MavenModuleSetBuild$MavenModuleSetBuildExecution.post2(MavenModuleSetBuild.java:1040)
at hudson.model.AbstractBuild$AbstractBuildExecution.post(AbstractBuild.java:725)
at hudson.model.Run.execute(Run.java:1701)
at hudson.maven.MavenModuleSetBuild.run(MavenModuleSetBuild.java:529)
at hudson.model.ResourceController.execute(ResourceController.java:88)
at hudson.model.Executor.run(Executor.java:231)
Caused by: org.eclipse.aether.deployment.DeploymentException: Failed to deploy artifacts: Could not transfer artifact org.apache.myfaces:myfaces-base:pom:1.1.8-20140624.115027-553 from/to apache.snapshots.https (https://repository.apache.org/content/repositories/snapshots): Failed to transfer file: https://repository.apache.org/content/repositories/snapshots/org/apache/myfaces/myfaces-base/1.1.8-SNAPSHOT/myfaces-base-1.1.8-20140624.115027-553.pom. Return code is: 401, ReasonPhrase: Unauthorized.
at org.eclipse.aether.internal.impl.DefaultDeployer.deploy(DefaultDeployer.java:341)
at org.eclipse.aether.internal.impl.DefaultDeployer.deploy(DefaultDeployer.java:269)
at org.eclipse.aether.internal.impl.DefaultRepositorySystem.deploy(DefaultRepositorySystem.java:413)
at org.apache.maven.artifact.deployer.DefaultArtifactDeployer.deploy(DefaultArtifactDeployer.java:139)
... 11 more
Caused by: org.eclipse.aether.transfer.ArtifactTransferException: Could not transfer artifact org.apache.myfaces:myfaces-base:pom:1.1.8-20140624.115027-553 from/to apache.snapshots.https (https://repository.apache.org/content/repositories/snapshots): Failed to transfer file: https://repository.apache.org/content/repositories/snapshots/org/apache/myfaces/myfaces-base/1.1.8-SNAPSHOT/myfaces-base-1.1.8-20140624.115027-553.pom. Return code is: 401, ReasonPhrase: Unauthorized.
at org.eclipse.aether.connector.wagon.WagonRepositoryConnector$6.wrap(WagonRepositoryConnector.java:1016)
at org.eclipse.aether.connector.wagon.WagonRepositoryConnector$6.wrap(WagonRepositoryConnector.java:1004)
at org.eclipse.aether.connector.wagon.WagonRepositoryConnector$PutTask.run(WagonRepositoryConnector.java:895)
at org.eclipse.aether.connector.wagon.WagonRepositoryConnector.put(WagonRepositoryConnector.java:522)
at org.eclipse.aether.internal.impl.DefaultDeployer.deploy(DefaultDeployer.java:335)
... 14 more
Caused by: org.apache.maven.wagon.TransferFailedException: Failed to transfer file: https://repository.apache.org/content/repositories/snapshots/org/apache/myfaces/myfaces-base/1.1.8-SNAPSHOT/myfaces-base-1.1.8-20140624.115027-553.pom. Return code is: 401, ReasonPhrase: Unauthorized.
at org.apache.maven.wagon.shared.http4.AbstractHttpClientWagon.put(AbstractHttpClientWagon.java:626)
at org.apache.maven.wagon.shared.http4.AbstractHttpClientWagon.put(AbstractHttpClientWagon.java:524)
at org.apache.maven.wagon.shared.http4.AbstractHttpClientWagon.put(AbstractHttpClientWagon.java:505)
at org.apache.maven.wagon.shared.http4.AbstractHttpClientWagon.put(AbstractHttpClientWagon.java:485)
at org.eclipse.aether.connector.wagon.WagonRepositoryConnector$PutTask.run(WagonRepositoryConnector.java:871)
... 16 more
[INFO] Deployment failed after 5.3 sec
Build step 'Deploy artifacts to Maven repository' changed build result to FAILURE