You are viewing a plain text version of this content. The canonical link for it is here.
Posted to commits@struts.apache.org by Atlassian Open Source Bamboo <ba...@apache.org> on 2009/10/27 18:08:21 UTC

[OSS Bamboo] Struts 2 SVN - Main Build (Java 6) build 996 has FAILED (1 tests failed, no failures were new). Change made by Musachy Barroso

-----------------------------------------------------------
STRUTS-MAINJ6-996 failed.
-----------------------------------------------------------
Code has been updated by Musachy Barroso.
1/1130 tests failed.

http://opensource.bamboo.atlassian.com/browse/STRUTS-MAINJ6-996/        


--------------
Code Changes
--------------
Musachy Barroso (830250):

>WW-3195 When FreemarkerResult isn't writing directly to Response, s.action tag is broken


--------------
Tests
--------------
Failed Tests (1)
   - EmbeddedJSPResultTest: Key in context (Existing)


--------------
Error Summary
--------------
   [INFO] ------------------------------------------------------------------------
   [ERROR] BUILD FAILURE
   [INFO] ------------------------------------------------------------------------
   [INFO] There are test failures.
   
   Please refer to /opt/j2ee/domains/bamboo.atlassian.com/opensource/home/xml-data/build-dir/STRUTS-MAINJ6/plugins/embeddedjsp/target/surefire-reports for the individual test results.
   [INFO] ------------------------------------------------------------------------
   [INFO] For more information, run Maven with the -e switch


--
This message is automatically generated by Atlassian Bamboo