You are viewing a plain text version of this content. The canonical link for it is here.
Posted to dev@pdfbox.apache.org by Apache Jenkins Server <je...@builds.apache.org> on 2020/06/29 18:21:22 UTC

Build failed in Jenkins: PDFBox-1.8.x #794

See <https://builds.apache.org/job/PDFBox-1.8.x/794/display/redirect?page=changes>

Changes:

[tilman] PDFBOX-4902: fix bug with half hour timezones, thanks Juho Tikkala


------------------------------------------
[...truncated 379.25 KB...]
    at org.owasp.dependencycheck.Engine.initializeAndUpdateDatabase (Engine.java:737)
    at org.owasp.dependencycheck.Engine.analyzeDependencies (Engine.java:667)
    at org.owasp.dependencycheck.maven.BaseDependencyCheckMojo.runCheck (BaseDependencyCheckMojo.java:1557)
    at org.owasp.dependencycheck.maven.BaseDependencyCheckMojo.execute (BaseDependencyCheckMojo.java:848)
    at org.apache.maven.plugin.DefaultBuildPluginManager.executeMojo (DefaultBuildPluginManager.java:137)
    at org.apache.maven.lifecycle.internal.MojoExecutor.execute (MojoExecutor.java:210)
    at org.apache.maven.lifecycle.internal.MojoExecutor.execute (MojoExecutor.java:156)
    at org.apache.maven.lifecycle.internal.MojoExecutor.execute (MojoExecutor.java:148)
    at org.apache.maven.lifecycle.internal.LifecycleModuleBuilder.buildProject (LifecycleModuleBuilder.java:117)
    at org.apache.maven.lifecycle.internal.LifecycleModuleBuilder.buildProject (LifecycleModuleBuilder.java:81)
    at org.apache.maven.lifecycle.internal.builder.singlethreaded.SingleThreadedBuilder.build (SingleThreadedBuilder.java:56)
    at org.apache.maven.lifecycle.internal.LifecycleStarter.execute (LifecycleStarter.java:128)
    at org.apache.maven.DefaultMaven.doExecute (DefaultMaven.java:305)
    at org.apache.maven.DefaultMaven.doExecute (DefaultMaven.java:192)
    at org.apache.maven.DefaultMaven.execute (DefaultMaven.java:105)
    at org.jvnet.hudson.maven3.launcher.Maven35Launcher.main (Maven35Launcher.java:130)
    at sun.reflect.NativeMethodAccessorImpl.invoke0 (Native Method)
    at sun.reflect.NativeMethodAccessorImpl.invoke (NativeMethodAccessorImpl.java:62)
    at sun.reflect.DelegatingMethodAccessorImpl.invoke (DelegatingMethodAccessorImpl.java:43)
    at java.lang.reflect.Method.invoke (Method.java:498)
    at org.codehaus.plexus.classworlds.launcher.Launcher.launchEnhanced (Launcher.java:282)
    at org.codehaus.plexus.classworlds.launcher.Launcher.launch (Launcher.java:225)
    at jenkins.maven3.agent.Maven35Main.launch (Maven35Main.java:178)
    at sun.reflect.NativeMethodAccessorImpl.invoke0 (Native Method)
    at sun.reflect.NativeMethodAccessorImpl.invoke (NativeMethodAccessorImpl.java:62)
    at sun.reflect.DelegatingMethodAccessorImpl.invoke (DelegatingMethodAccessorImpl.java:43)
    at java.lang.reflect.Method.invoke (Method.java:498)
    at hudson.maven.Maven3Builder.call (Maven3Builder.java:139)
    at hudson.maven.Maven3Builder.call (Maven3Builder.java:70)
    at hudson.remoting.UserRequest.perform (UserRequest.java:212)
    at hudson.remoting.UserRequest.perform (UserRequest.java:54)
    at hudson.remoting.Request$2.run (Request.java:369)
    at hudson.remoting.InterceptingExecutorService$1.call (InterceptingExecutorService.java:72)
    at java.util.concurrent.FutureTask.run (FutureTask.java:266)
    at java.util.concurrent.ThreadPoolExecutor.runWorker (ThreadPoolExecutor.java:1149)
    at java.util.concurrent.ThreadPoolExecutor$Worker.run (ThreadPoolExecutor.java:624)
    at java.lang.Thread.run (Thread.java:748)
Caused by: org.owasp.dependencycheck.utils.DownloadFailedException: Download failed, unable to retrieve 'https://nvd.nist.gov/feeds/json/cve/1.1/nvdcve-1.1-modified.meta'
    at org.owasp.dependencycheck.utils.Downloader.fetchContent (Downloader.java:131)
    at org.owasp.dependencycheck.data.update.NvdCveUpdater.getMetaFile (NvdCveUpdater.java:340)
    at org.owasp.dependencycheck.data.update.NvdCveUpdater.getUpdatesNeeded (NvdCveUpdater.java:385)
    at org.owasp.dependencycheck.data.update.NvdCveUpdater.update (NvdCveUpdater.java:122)
    at org.owasp.dependencycheck.Engine.doUpdates (Engine.java:936)
    at org.owasp.dependencycheck.Engine.initializeAndUpdateDatabase (Engine.java:737)
    at org.owasp.dependencycheck.Engine.analyzeDependencies (Engine.java:667)
    at org.owasp.dependencycheck.maven.BaseDependencyCheckMojo.runCheck (BaseDependencyCheckMojo.java:1557)
    at org.owasp.dependencycheck.maven.BaseDependencyCheckMojo.execute (BaseDependencyCheckMojo.java:848)
    at org.apache.maven.plugin.DefaultBuildPluginManager.executeMojo (DefaultBuildPluginManager.java:137)
    at org.apache.maven.lifecycle.internal.MojoExecutor.execute (MojoExecutor.java:210)
    at org.apache.maven.lifecycle.internal.MojoExecutor.execute (MojoExecutor.java:156)
    at org.apache.maven.lifecycle.internal.MojoExecutor.execute (MojoExecutor.java:148)
    at org.apache.maven.lifecycle.internal.LifecycleModuleBuilder.buildProject (LifecycleModuleBuilder.java:117)
    at org.apache.maven.lifecycle.internal.LifecycleModuleBuilder.buildProject (LifecycleModuleBuilder.java:81)
    at org.apache.maven.lifecycle.internal.builder.singlethreaded.SingleThreadedBuilder.build (SingleThreadedBuilder.java:56)
    at org.apache.maven.lifecycle.internal.LifecycleStarter.execute (LifecycleStarter.java:128)
    at org.apache.maven.DefaultMaven.doExecute (DefaultMaven.java:305)
    at org.apache.maven.DefaultMaven.doExecute (DefaultMaven.java:192)
    at org.apache.maven.DefaultMaven.execute (DefaultMaven.java:105)
    at org.jvnet.hudson.maven3.launcher.Maven35Launcher.main (Maven35Launcher.java:130)
    at sun.reflect.NativeMethodAccessorImpl.invoke0 (Native Method)
    at sun.reflect.NativeMethodAccessorImpl.invoke (NativeMethodAccessorImpl.java:62)
    at sun.reflect.DelegatingMethodAccessorImpl.invoke (DelegatingMethodAccessorImpl.java:43)
    at java.lang.reflect.Method.invoke (Method.java:498)
    at org.codehaus.plexus.classworlds.launcher.Launcher.launchEnhanced (Launcher.java:282)
    at org.codehaus.plexus.classworlds.launcher.Launcher.launch (Launcher.java:225)
    at jenkins.maven3.agent.Maven35Main.launch (Maven35Main.java:178)
    at sun.reflect.NativeMethodAccessorImpl.invoke0 (Native Method)
    at sun.reflect.NativeMethodAccessorImpl.invoke (NativeMethodAccessorImpl.java:62)
    at sun.reflect.DelegatingMethodAccessorImpl.invoke (DelegatingMethodAccessorImpl.java:43)
    at java.lang.reflect.Method.invoke (Method.java:498)
    at hudson.maven.Maven3Builder.call (Maven3Builder.java:139)
    at hudson.maven.Maven3Builder.call (Maven3Builder.java:70)
    at hudson.remoting.UserRequest.perform (UserRequest.java:212)
    at hudson.remoting.UserRequest.perform (UserRequest.java:54)
    at hudson.remoting.Request$2.run (Request.java:369)
    at hudson.remoting.InterceptingExecutorService$1.call (InterceptingExecutorService.java:72)
    at java.util.concurrent.FutureTask.run (FutureTask.java:266)
    at java.util.concurrent.ThreadPoolExecutor.runWorker (ThreadPoolExecutor.java:1149)
    at java.util.concurrent.ThreadPoolExecutor$Worker.run (ThreadPoolExecutor.java:624)
    at java.lang.Thread.run (Thread.java:748)
Caused by: org.owasp.dependencycheck.utils.DownloadFailedException: Error downloading file https://nvd.nist.gov/feeds/json/cve/1.1/nvdcve-1.1-modified.meta; unable to connect.
    at org.owasp.dependencycheck.utils.HttpResourceConnection.obtainConnection (HttpResourceConnection.java:238)
    at org.owasp.dependencycheck.utils.HttpResourceConnection.fetch (HttpResourceConnection.java:138)
    at org.owasp.dependencycheck.utils.Downloader.fetchContent (Downloader.java:126)
    at org.owasp.dependencycheck.data.update.NvdCveUpdater.getMetaFile (NvdCveUpdater.java:340)
    at org.owasp.dependencycheck.data.update.NvdCveUpdater.getUpdatesNeeded (NvdCveUpdater.java:385)
    at org.owasp.dependencycheck.data.update.NvdCveUpdater.update (NvdCveUpdater.java:122)
    at org.owasp.dependencycheck.Engine.doUpdates (Engine.java:936)
    at org.owasp.dependencycheck.Engine.initializeAndUpdateDatabase (Engine.java:737)
    at org.owasp.dependencycheck.Engine.analyzeDependencies (Engine.java:667)
    at org.owasp.dependencycheck.maven.BaseDependencyCheckMojo.runCheck (BaseDependencyCheckMojo.java:1557)
    at org.owasp.dependencycheck.maven.BaseDependencyCheckMojo.execute (BaseDependencyCheckMojo.java:848)
    at org.apache.maven.plugin.DefaultBuildPluginManager.executeMojo (DefaultBuildPluginManager.java:137)
    at org.apache.maven.lifecycle.internal.MojoExecutor.execute (MojoExecutor.java:210)
    at org.apache.maven.lifecycle.internal.MojoExecutor.execute (MojoExecutor.java:156)
    at org.apache.maven.lifecycle.internal.MojoExecutor.execute (MojoExecutor.java:148)
    at org.apache.maven.lifecycle.internal.LifecycleModuleBuilder.buildProject (LifecycleModuleBuilder.java:117)
    at org.apache.maven.lifecycle.internal.LifecycleModuleBuilder.buildProject (LifecycleModuleBuilder.java:81)
    at org.apache.maven.lifecycle.internal.builder.singlethreaded.SingleThreadedBuilder.build (SingleThreadedBuilder.java:56)
    at org.apache.maven.lifecycle.internal.LifecycleStarter.execute (LifecycleStarter.java:128)
    at org.apache.maven.DefaultMaven.doExecute (DefaultMaven.java:305)
    at org.apache.maven.DefaultMaven.doExecute (DefaultMaven.java:192)
    at org.apache.maven.DefaultMaven.execute (DefaultMaven.java:105)
    at org.jvnet.hudson.maven3.launcher.Maven35Launcher.main (Maven35Launcher.java:130)
    at sun.reflect.NativeMethodAccessorImpl.invoke0 (Native Method)
    at sun.reflect.NativeMethodAccessorImpl.invoke (NativeMethodAccessorImpl.java:62)
    at sun.reflect.DelegatingMethodAccessorImpl.invoke (DelegatingMethodAccessorImpl.java:43)
    at java.lang.reflect.Method.invoke (Method.java:498)
    at org.codehaus.plexus.classworlds.launcher.Launcher.launchEnhanced (Launcher.java:282)
    at org.codehaus.plexus.classworlds.launcher.Launcher.launch (Launcher.java:225)
    at jenkins.maven3.agent.Maven35Main.launch (Maven35Main.java:178)
    at sun.reflect.NativeMethodAccessorImpl.invoke0 (Native Method)
    at sun.reflect.NativeMethodAccessorImpl.invoke (NativeMethodAccessorImpl.java:62)
    at sun.reflect.DelegatingMethodAccessorImpl.invoke (DelegatingMethodAccessorImpl.java:43)
    at java.lang.reflect.Method.invoke (Method.java:498)
    at hudson.maven.Maven3Builder.call (Maven3Builder.java:139)
    at hudson.maven.Maven3Builder.call (Maven3Builder.java:70)
    at hudson.remoting.UserRequest.perform (UserRequest.java:212)
    at hudson.remoting.UserRequest.perform (UserRequest.java:54)
    at hudson.remoting.Request$2.run (Request.java:369)
    at hudson.remoting.InterceptingExecutorService$1.call (InterceptingExecutorService.java:72)
    at java.util.concurrent.FutureTask.run (FutureTask.java:266)
    at java.util.concurrent.ThreadPoolExecutor.runWorker (ThreadPoolExecutor.java:1149)
    at java.util.concurrent.ThreadPoolExecutor$Worker.run (ThreadPoolExecutor.java:624)
    at java.lang.Thread.run (Thread.java:748)
Caused by: java.net.SocketTimeoutException: connect timed out
    at java.net.PlainSocketImpl.socketConnect (Native Method)
    at java.net.AbstractPlainSocketImpl.doConnect (AbstractPlainSocketImpl.java:350)
    at java.net.AbstractPlainSocketImpl.connectToAddress (AbstractPlainSocketImpl.java:206)
    at java.net.AbstractPlainSocketImpl.connect (AbstractPlainSocketImpl.java:188)
    at java.net.SocksSocketImpl.connect (SocksSocketImpl.java:392)
    at java.net.Socket.connect (Socket.java:606)
    at sun.net.NetworkClient.doConnect (NetworkClient.java:175)
    at sun.net.www.http.HttpClient.openServer (HttpClient.java:463)
    at sun.net.www.http.HttpClient.openServer (HttpClient.java:558)
    at sun.net.www.protocol.https.HttpsClient.<init> (HttpsClient.java:264)
    at sun.net.www.protocol.https.HttpsClient.New (HttpsClient.java:367)
    at sun.net.www.protocol.https.AbstractDelegateHttpsURLConnection.getNewHttpClient (AbstractDelegateHttpsURLConnection.java:191)
    at sun.net.www.protocol.http.HttpURLConnection.plainConnect0 (HttpURLConnection.java:1162)
    at sun.net.www.protocol.http.HttpURLConnection.plainConnect (HttpURLConnection.java:1056)
    at sun.net.www.protocol.https.AbstractDelegateHttpsURLConnection.connect (AbstractDelegateHttpsURLConnection.java:177)
    at sun.net.www.protocol.https.HttpsURLConnectionImpl.connect (HttpsURLConnectionImpl.java:167)
    at org.owasp.dependencycheck.utils.HttpResourceConnection.obtainConnection (HttpResourceConnection.java:178)
    at org.owasp.dependencycheck.utils.HttpResourceConnection.fetch (HttpResourceConnection.java:138)
    at org.owasp.dependencycheck.utils.Downloader.fetchContent (Downloader.java:126)
    at org.owasp.dependencycheck.data.update.NvdCveUpdater.getMetaFile (NvdCveUpdater.java:340)
    at org.owasp.dependencycheck.data.update.NvdCveUpdater.getUpdatesNeeded (NvdCveUpdater.java:385)
    at org.owasp.dependencycheck.data.update.NvdCveUpdater.update (NvdCveUpdater.java:122)
    at org.owasp.dependencycheck.Engine.doUpdates (Engine.java:936)
    at org.owasp.dependencycheck.Engine.initializeAndUpdateDatabase (Engine.java:737)
    at org.owasp.dependencycheck.Engine.analyzeDependencies (Engine.java:667)
    at org.owasp.dependencycheck.maven.BaseDependencyCheckMojo.runCheck (BaseDependencyCheckMojo.java:1557)
    at org.owasp.dependencycheck.maven.BaseDependencyCheckMojo.execute (BaseDependencyCheckMojo.java:848)
    at org.apache.maven.plugin.DefaultBuildPluginManager.executeMojo (DefaultBuildPluginManager.java:137)
    at org.apache.maven.lifecycle.internal.MojoExecutor.execute (MojoExecutor.java:210)
    at org.apache.maven.lifecycle.internal.MojoExecutor.execute (MojoExecutor.java:156)
    at org.apache.maven.lifecycle.internal.MojoExecutor.execute (MojoExecutor.java:148)
    at org.apache.maven.lifecycle.internal.LifecycleModuleBuilder.buildProject (LifecycleModuleBuilder.java:117)
    at org.apache.maven.lifecycle.internal.LifecycleModuleBuilder.buildProject (LifecycleModuleBuilder.java:81)
    at org.apache.maven.lifecycle.internal.builder.singlethreaded.SingleThreadedBuilder.build (SingleThreadedBuilder.java:56)
    at org.apache.maven.lifecycle.internal.LifecycleStarter.execute (LifecycleStarter.java:128)
    at org.apache.maven.DefaultMaven.doExecute (DefaultMaven.java:305)
    at org.apache.maven.DefaultMaven.doExecute (DefaultMaven.java:192)
    at org.apache.maven.DefaultMaven.execute (DefaultMaven.java:105)
    at org.jvnet.hudson.maven3.launcher.Maven35Launcher.main (Maven35Launcher.java:130)
    at sun.reflect.NativeMethodAccessorImpl.invoke0 (Native Method)
    at sun.reflect.NativeMethodAccessorImpl.invoke (NativeMethodAccessorImpl.java:62)
    at sun.reflect.DelegatingMethodAccessorImpl.invoke (DelegatingMethodAccessorImpl.java:43)
    at java.lang.reflect.Method.invoke (Method.java:498)
    at org.codehaus.plexus.classworlds.launcher.Launcher.launchEnhanced (Launcher.java:282)
    at org.codehaus.plexus.classworlds.launcher.Launcher.launch (Launcher.java:225)
    at jenkins.maven3.agent.Maven35Main.launch (Maven35Main.java:178)
    at sun.reflect.NativeMethodAccessorImpl.invoke0 (Native Method)
    at sun.reflect.NativeMethodAccessorImpl.invoke (NativeMethodAccessorImpl.java:62)
    at sun.reflect.DelegatingMethodAccessorImpl.invoke (DelegatingMethodAccessorImpl.java:43)
    at java.lang.reflect.Method.invoke (Method.java:498)
    at hudson.maven.Maven3Builder.call (Maven3Builder.java:139)
    at hudson.maven.Maven3Builder.call (Maven3Builder.java:70)
    at hudson.remoting.UserRequest.perform (UserRequest.java:212)
    at hudson.remoting.UserRequest.perform (UserRequest.java:54)
    at hudson.remoting.Request$2.run (Request.java:369)
    at hudson.remoting.InterceptingExecutorService$1.call (InterceptingExecutorService.java:72)
    at java.util.concurrent.FutureTask.run (FutureTask.java:266)
    at java.util.concurrent.ThreadPoolExecutor.runWorker (ThreadPoolExecutor.java:1149)
    at java.util.concurrent.ThreadPoolExecutor$Worker.run (ThreadPoolExecutor.java:624)
    at java.lang.Thread.run (Thread.java:748)
[WARNING] Unable to update 1 or more Cached Web DataSource, using local data instead. Results may not include recent vulnerabilities.
[ERROR] Unable to continue dependency-check analysis.
[INFO] ------------------------------------------------------------------------
[INFO] Reactor Summary for PDFBox reactor 1.8.17-SNAPSHOT:
[INFO] 
[INFO] PDFBox parent ...................................... FAILURE [ 29.470 s]
[INFO] Apache FontBox ..................................... SKIPPED
[INFO] Apache JempBox ..................................... SKIPPED
[INFO] Apache XmpBox ...................................... SKIPPED
[INFO] Apache PDFBox ...................................... SKIPPED
[INFO] Apache Preflight ................................... SKIPPED
[INFO] Apache Preflight application ....................... SKIPPED
[INFO] Apache PDFBox for Lucene ........................... SKIPPED
[INFO] Apache PDFBox for Ant .............................. SKIPPED
[INFO] Apache PDFBox webapp ............................... SKIPPED
[INFO] Apache PDFBox application .......................... SKIPPED
[INFO] Apache PDFBox examples ............................. SKIPPED
[INFO] PDFBox reactor ..................................... SKIPPED
[INFO] ------------------------------------------------------------------------
[INFO] BUILD FAILURE
[INFO] ------------------------------------------------------------------------
[INFO] Total time:  57.365 s
[INFO] Finished at: 2020-06-29T18:20:48Z
[INFO] ------------------------------------------------------------------------
Waiting for Jenkins to finish collecting data
[ERROR] Failed to execute goal org.owasp:dependency-check-maven:5.3.2:check (default) on project pdfbox-parent: Fatal exception(s) analyzing PDFBox parent: One or more exceptions occurred during analysis:
[ERROR] Unable to download meta file: https://nvd.nist.gov/feeds/json/cve/1.1/nvdcve-1.1-modified.meta
[ERROR] No documents exist
[ERROR] -> [Help 1]
[ERROR] 
[ERROR] To see the full stack trace of the errors, re-run Maven with the -e switch.
[ERROR] Re-run Maven using the -X switch to enable full debug logging.
[ERROR] 
[ERROR] For more information about the errors and possible solutions, please read the following articles:
[ERROR] [Help 1] http://cwiki.apache.org/confluence/display/MAVEN/MojoExecutionException
[JENKINS] Archiving <https://builds.apache.org/job/PDFBox-1.8.x/ws/1.8/lucene/pom.xml> to org.apache.pdfbox/pdfbox-lucene/1.8.17-SNAPSHOT/pdfbox-lucene-1.8.17-SNAPSHOT.pom
[JENKINS] Archiving <https://builds.apache.org/job/PDFBox-1.8.x/ws/1.8/jempbox/pom.xml> to org.apache.pdfbox/jempbox/1.8.17-SNAPSHOT/jempbox-1.8.17-SNAPSHOT.pom
[JENKINS] Archiving <https://builds.apache.org/job/PDFBox-1.8.x/ws/1.8/examples/pom.xml> to org.apache.pdfbox/pdfbox-examples/1.8.17-SNAPSHOT/pdfbox-examples-1.8.17-SNAPSHOT.pom
[JENKINS] Archiving <https://builds.apache.org/job/PDFBox-1.8.x/ws/1.8/parent/pom.xml> to org.apache.pdfbox/pdfbox-parent/1.8.17-SNAPSHOT/pdfbox-parent-1.8.17-SNAPSHOT.pom
[JENKINS] Archiving <https://builds.apache.org/job/PDFBox-1.8.x/ws/1.8/pdfbox/pom.xml> to org.apache.pdfbox/pdfbox/1.8.17-SNAPSHOT/pdfbox-1.8.17-SNAPSHOT.pom
[JENKINS] Archiving <https://builds.apache.org/job/PDFBox-1.8.x/ws/1.8/ant/pom.xml> to org.apache.pdfbox/pdfbox-ant/1.8.17-SNAPSHOT/pdfbox-ant-1.8.17-SNAPSHOT.pom
[JENKINS] Archiving <https://builds.apache.org/job/PDFBox-1.8.x/ws/1.8/fontbox/pom.xml> to org.apache.pdfbox/fontbox/1.8.17-SNAPSHOT/fontbox-1.8.17-SNAPSHOT.pom
[JENKINS] Archiving <https://builds.apache.org/job/PDFBox-1.8.x/ws/1.8/war/pom.xml> to org.apache.pdfbox/pdfbox-war/1.8.17-SNAPSHOT/pdfbox-war-1.8.17-SNAPSHOT.pom
[JENKINS] Archiving <https://builds.apache.org/job/PDFBox-1.8.x/ws/1.8/xmpbox/pom.xml> to org.apache.pdfbox/xmpbox/1.8.17-SNAPSHOT/xmpbox-1.8.17-SNAPSHOT.pom
[JENKINS] Archiving <https://builds.apache.org/job/PDFBox-1.8.x/ws/1.8/preflight-app/pom.xml> to org.apache.pdfbox/preflight-app/1.8.17-SNAPSHOT/preflight-app-1.8.17-SNAPSHOT.pom
[JENKINS] Archiving <https://builds.apache.org/job/PDFBox-1.8.x/ws/1.8/app/pom.xml> to org.apache.pdfbox/pdfbox-app/1.8.17-SNAPSHOT/pdfbox-app-1.8.17-SNAPSHOT.pom
[JENKINS] Archiving <https://builds.apache.org/job/PDFBox-1.8.x/ws/1.8/preflight/pom.xml> to org.apache.pdfbox/preflight/1.8.17-SNAPSHOT/preflight-1.8.17-SNAPSHOT.pom
[JENKINS] Archiving <https://builds.apache.org/job/PDFBox-1.8.x/ws/1.8/pom.xml> to org.apache.pdfbox/pdfbox-reactor/1.8.17-SNAPSHOT/pdfbox-reactor-1.8.17-SNAPSHOT.pom
No mail will be sent out, as 'PDFBox-1.8.x » Apache PDFBox for Lucene #794' does not have a result yet. Please make sure you set a proper result in case of pipeline/build scripts.
No mail will be sent out, as 'PDFBox-1.8.x » Apache JempBox #794' does not have a result yet. Please make sure you set a proper result in case of pipeline/build scripts.
No mail will be sent out, as 'PDFBox-1.8.x » Apache PDFBox examples #794' does not have a result yet. Please make sure you set a proper result in case of pipeline/build scripts.
Sending e-mails to: dev@pdfbox.apache.org
No mail will be sent out, as 'PDFBox-1.8.x » Apache PDFBox #794' does not have a result yet. Please make sure you set a proper result in case of pipeline/build scripts.
No mail will be sent out, as 'PDFBox-1.8.x » Apache PDFBox for Ant #794' does not have a result yet. Please make sure you set a proper result in case of pipeline/build scripts.
No mail will be sent out, as 'PDFBox-1.8.x » Apache FontBox #794' does not have a result yet. Please make sure you set a proper result in case of pipeline/build scripts.
No mail will be sent out, as 'PDFBox-1.8.x » Apache PDFBox webapp #794' does not have a result yet. Please make sure you set a proper result in case of pipeline/build scripts.
No mail will be sent out, as 'PDFBox-1.8.x » Apache XmpBox #794' does not have a result yet. Please make sure you set a proper result in case of pipeline/build scripts.
No mail will be sent out, as 'PDFBox-1.8.x » Apache Preflight application #794' does not have a result yet. Please make sure you set a proper result in case of pipeline/build scripts.
No mail will be sent out, as 'PDFBox-1.8.x » Apache PDFBox application #794' does not have a result yet. Please make sure you set a proper result in case of pipeline/build scripts.
No mail will be sent out, as 'PDFBox-1.8.x » Apache Preflight #794' does not have a result yet. Please make sure you set a proper result in case of pipeline/build scripts.
No mail will be sent out, as 'PDFBox-1.8.x » PDFBox reactor #794' does not have a result yet. Please make sure you set a proper result in case of pipeline/build scripts.
channel stopped
Archiving artifacts

---------------------------------------------------------------------
To unsubscribe, e-mail: dev-unsubscribe@pdfbox.apache.org
For additional commands, e-mail: dev-help@pdfbox.apache.org


Jenkins build is back to normal : PDFBox-1.8.x #795

Posted by Apache Jenkins Server <je...@builds.apache.org>.
See <https://builds.apache.org/job/PDFBox-1.8.x/795/display/redirect?page=changes>


---------------------------------------------------------------------
To unsubscribe, e-mail: dev-unsubscribe@pdfbox.apache.org
For additional commands, e-mail: dev-help@pdfbox.apache.org