You are viewing a plain text version of this content. The canonical link for it is here.
Posted to builds@beam.apache.org by Apache Jenkins Server <je...@builds.apache.org> on 2022/09/06 15:04:53 UTC
Build failed in Jenkins: beam_PostCommit_Python39 #819
See <https://ci-beam.apache.org/job/beam_PostCommit_Python39/819/display/redirect>
Changes:
------------------------------------------
[...truncated 37.61 MB...]
INFO:root:severity: INFO
timestamp {
seconds: 1662467339
nanos: 497577190
}
message: "Closing all cached grpc data channels."
log_location: "/usr/local/lib/python3.9/site-packages/apache_beam/runners/worker/data_plane.py:805"
thread: "MainThread"
INFO:root:severity: INFO
timestamp {
seconds: 1662467339
nanos: 497668266
}
message: "Closing all cached gRPC state handlers."
log_location: "/usr/local/lib/python3.9/site-packages/apache_beam/runners/worker/sdk_worker.py:875"
thread: "MainThread"
INFO:root:severity: INFO
timestamp {
seconds: 1662467339
nanos: 498609781
}
message: "Done consuming work."
log_location: "/usr/local/lib/python3.9/site-packages/apache_beam/runners/worker/sdk_worker.py:277"
thread: "MainThread"
INFO:root:severity: INFO
timestamp {
seconds: 1662467339
nanos: 498733282
}
message: "Python sdk harness exiting."
log_location: "/usr/local/lib/python3.9/site-packages/apache_beam/runners/worker/sdk_worker_main.py:184"
thread: "MainThread"
INFO:apache_beam.runners.portability.local_job_service:Completed job in 11.82588505744934 seconds with state DONE.
INFO:root:Completed job in 11.82588505744934 seconds with state DONE.
INFO:apache_beam.runners.portability.portable_runner:Job state changed to DONE
> Task :sdks:python:test-suites:portable:py39:portableWordCountSparkRunnerBatch
INFO:apache_beam.runners.worker.worker_pool_main:Listening for workers at localhost:33835
INFO:root:Default Python SDK image for environment is apache/beam_python3.9_sdk:2.42.0.dev
INFO:apache_beam.runners.portability.fn_api_runner.translations:==================== <function pack_combiners at 0x7fef37d974c0> ====================
INFO:apache_beam.runners.portability.fn_api_runner.translations:==================== <function lift_combiners at 0x7fef37d97550> ====================
INFO:apache_beam.runners.portability.fn_api_runner.translations:==================== <function sort_stages at 0x7fef37d97ca0> ====================
INFO:apache_beam.utils.subprocess_server:Starting service with ['java' '-jar' '<https://ci-beam.apache.org/job/beam_PostCommit_Python39/ws/src/runners/spark/2/job-server/build/libs/beam-runners-spark-job-server-2.42.0-SNAPSHOT.jar'> '--spark-master-url' 'local[4]' '--artifacts-dir' '/tmp/beam-temp4qlk2spd/artifactse4mgdqbg' '--job-port' '51951' '--artifact-port' '0' '--expansion-port' '0']
INFO:apache_beam.utils.subprocess_server:22/09/06 12:29:04 WARN software.amazon.awssdk.regions.internal.util.EC2MetadataUtils: Unable to retrieve the requested metadata.
INFO:apache_beam.utils.subprocess_server:22/09/06 12:29:05 INFO org.apache.beam.runners.jobsubmission.JobServerDriver: ArtifactStagingService started on localhost:33429
INFO:apache_beam.utils.subprocess_server:22/09/06 12:29:05 INFO org.apache.beam.runners.jobsubmission.JobServerDriver: Java ExpansionService started on localhost:37023
INFO:apache_beam.utils.subprocess_server:22/09/06 12:29:05 INFO org.apache.beam.runners.jobsubmission.JobServerDriver: JobService started on localhost:51951
INFO:apache_beam.utils.subprocess_server:22/09/06 12:29:05 INFO org.apache.beam.runners.jobsubmission.JobServerDriver: Job server now running, terminate with Ctrl+C
WARNING:apache_beam.options.pipeline_options:Discarding unparseable args: ['--parallelism=2']
INFO:apache_beam.utils.subprocess_server:22/09/06 12:29:05 INFO org.apache.beam.runners.fnexecution.artifact.ArtifactStagingService: Staging artifacts for job_5bec1811-b7ee-4650-a839-05c04bd36c84.
INFO:apache_beam.utils.subprocess_server:22/09/06 12:29:05 INFO org.apache.beam.runners.fnexecution.artifact.ArtifactStagingService: Resolving artifacts for job_5bec1811-b7ee-4650-a839-05c04bd36c84.ref_Environment_default_environment_1.
INFO:apache_beam.utils.subprocess_server:22/09/06 12:29:05 INFO org.apache.beam.runners.fnexecution.artifact.ArtifactStagingService: Getting 1 artifacts for job_5bec1811-b7ee-4650-a839-05c04bd36c84.null.
INFO:apache_beam.utils.subprocess_server:22/09/06 12:29:05 INFO org.apache.beam.runners.fnexecution.artifact.ArtifactStagingService: Artifacts fully staged for job_5bec1811-b7ee-4650-a839-05c04bd36c84.
INFO:apache_beam.utils.subprocess_server:22/09/06 12:29:06 INFO org.apache.beam.runners.spark.SparkJobInvoker: Invoking job BeamApp-jenkins-0906122906-6754655b_a7e720d9-0ba0-459f-a708-a9a72147fd7e
INFO:apache_beam.utils.subprocess_server:22/09/06 12:29:06 INFO org.apache.beam.runners.jobsubmission.JobInvocation: Starting job invocation BeamApp-jenkins-0906122906-6754655b_a7e720d9-0ba0-459f-a708-a9a72147fd7e
INFO:apache_beam.runners.portability.portable_runner:Environment "LOOPBACK" has started a component necessary for the execution. Be sure to run the pipeline using
with Pipeline() as p:
p.apply(..)
This ensures that the pipeline finishes before this program exits.
INFO:apache_beam.runners.portability.portable_runner:Job state changed to STOPPED
INFO:apache_beam.runners.portability.portable_runner:Job state changed to STARTING
INFO:apache_beam.runners.portability.portable_runner:Job state changed to RUNNING
INFO:apache_beam.utils.subprocess_server:22/09/06 12:29:06 INFO org.apache.beam.runners.spark.translation.SparkContextFactory: Creating a brand new Spark Context.
INFO:apache_beam.utils.subprocess_server:22/09/06 12:29:07 WARN org.apache.hadoop.util.NativeCodeLoader: Unable to load native-hadoop library for your platform... using builtin-java classes where applicable
INFO:apache_beam.utils.subprocess_server:22/09/06 12:29:07 WARN org.apache.beam.runners.spark.translation.SparkContextFactory: Support for Spark 2 is deprecated, this runner will be removed in a few releases.
INFO:apache_beam.utils.subprocess_server:Spark 2 is reaching its EOL, consider migrating to Spark 3.
INFO:apache_beam.utils.subprocess_server:22/09/06 12:29:07 INFO org.apache.beam.runners.spark.aggregators.AggregatorsAccumulator: Instantiated aggregators accumulator:
INFO:apache_beam.utils.subprocess_server:22/09/06 12:29:07 INFO org.apache.beam.runners.spark.metrics.MetricsAccumulator: Instantiated metrics accumulator: MetricQueryResults()
INFO:apache_beam.utils.subprocess_server:22/09/06 12:29:07 WARN software.amazon.awssdk.regions.internal.util.EC2MetadataUtils: Unable to retrieve the requested metadata.
INFO:apache_beam.utils.subprocess_server:22/09/06 12:29:07 INFO org.apache.beam.runners.spark.SparkPipelineRunner: Running job BeamApp-jenkins-0906122906-6754655b_a7e720d9-0ba0-459f-a708-a9a72147fd7e on Spark master local[4]
INFO:apache_beam.utils.subprocess_server:22/09/06 12:29:08 WARN software.amazon.awssdk.regions.internal.util.EC2MetadataUtils: Unable to retrieve the requested metadata.
INFO:apache_beam.utils.subprocess_server:22/09/06 12:29:08 WARN software.amazon.awssdk.regions.internal.util.EC2MetadataUtils: Unable to retrieve the requested metadata.
INFO:apache_beam.utils.subprocess_server:22/09/06 12:29:08 WARN software.amazon.awssdk.regions.internal.util.EC2MetadataUtils: Unable to retrieve the requested metadata.
INFO:apache_beam.utils.subprocess_server:22/09/06 12:29:08 WARN software.amazon.awssdk.regions.internal.util.EC2MetadataUtils: Unable to retrieve the requested metadata.
INFO:apache_beam.runners.worker.statecache:Creating state cache with size 0
INFO:apache_beam.runners.worker.sdk_worker:Creating insecure control channel for localhost:38977.
INFO:apache_beam.runners.worker.sdk_worker:Control channel established.
INFO:apache_beam.runners.worker.sdk_worker:Initializing SDKHarness with unbounded number of workers.
INFO:apache_beam.utils.subprocess_server:22/09/06 12:29:09 INFO org.apache.beam.runners.fnexecution.control.FnApiControlClientPoolService: Beam Fn Control client connected with id 1-1
INFO:apache_beam.utils.subprocess_server:22/09/06 12:29:09 INFO org.apache.beam.runners.fnexecution.control.FnApiControlClientPoolService: getProcessBundleDescriptor request with id 1-2
INFO:apache_beam.runners.worker.sdk_worker:Creating insecure state channel for localhost:45031.
INFO:apache_beam.runners.worker.sdk_worker:State channel established.
INFO:apache_beam.runners.worker.data_plane:Creating client data channel for localhost:41679
INFO:apache_beam.utils.subprocess_server:22/09/06 12:29:09 INFO org.apache.beam.runners.fnexecution.data.GrpcDataService: Beam Fn Data client connected.
INFO:apache_beam.utils.subprocess_server:22/09/06 12:29:09 INFO org.apache.beam.runners.fnexecution.control.FnApiControlClientPoolService: getProcessBundleDescriptor request with id 1-3
INFO:apache_beam.utils.subprocess_server:22/09/06 12:29:09 WARN software.amazon.awssdk.regions.internal.util.EC2MetadataUtils: Unable to retrieve the requested metadata.
INFO:apache_beam.utils.subprocess_server:22/09/06 12:29:09 WARN software.amazon.awssdk.regions.internal.util.EC2MetadataUtils: Unable to retrieve the requested metadata.
INFO:apache_beam.utils.subprocess_server:22/09/06 12:29:09 WARN software.amazon.awssdk.regions.internal.util.EC2MetadataUtils: Unable to retrieve the requested metadata.
INFO:apache_beam.utils.subprocess_server:22/09/06 12:29:09 WARN software.amazon.awssdk.regions.internal.util.EC2MetadataUtils: Unable to retrieve the requested metadata.
INFO:apache_beam.utils.subprocess_server:22/09/06 12:29:09 INFO org.apache.beam.runners.fnexecution.control.FnApiControlClientPoolService: getProcessBundleDescriptor request with id 1-4
INFO:apache_beam.utils.subprocess_server:22/09/06 12:29:09 INFO org.apache.beam.runners.fnexecution.control.FnApiControlClientPoolService: getProcessBundleDescriptor request with id 1-5
INFO:apache_beam.utils.subprocess_server:22/09/06 12:29:09 WARN software.amazon.awssdk.regions.internal.util.EC2MetadataUtils: Unable to retrieve the requested metadata.
INFO:apache_beam.utils.subprocess_server:22/09/06 12:29:09 WARN software.amazon.awssdk.regions.internal.util.EC2MetadataUtils: Unable to retrieve the requested metadata.
INFO:apache_beam.utils.subprocess_server:22/09/06 12:29:09 WARN software.amazon.awssdk.regions.internal.util.EC2MetadataUtils: Unable to retrieve the requested metadata.
INFO:apache_beam.utils.subprocess_server:22/09/06 12:29:09 WARN software.amazon.awssdk.regions.internal.util.EC2MetadataUtils: Unable to retrieve the requested metadata.
INFO:apache_beam.utils.subprocess_server:22/09/06 12:29:09 INFO org.apache.beam.runners.fnexecution.control.FnApiControlClientPoolService: getProcessBundleDescriptor request with id 1-7
INFO:apache_beam.utils.subprocess_server:22/09/06 12:29:09 INFO org.apache.beam.runners.fnexecution.control.FnApiControlClientPoolService: getProcessBundleDescriptor request with id 1-6
INFO:apache_beam.utils.subprocess_server:22/09/06 12:29:09 INFO org.apache.beam.runners.fnexecution.control.FnApiControlClientPoolService: getProcessBundleDescriptor request with id 1-8
INFO:apache_beam.utils.subprocess_server:22/09/06 12:29:09 INFO org.apache.beam.runners.fnexecution.control.FnApiControlClientPoolService: getProcessBundleDescriptor request with id 1-9
INFO:apache_beam.utils.subprocess_server:22/09/06 12:29:09 INFO org.apache.beam.runners.fnexecution.control.FnApiControlClientPoolService: getProcessBundleDescriptor request with id 1-10
INFO:apache_beam.utils.subprocess_server:22/09/06 12:29:09 INFO org.apache.beam.runners.fnexecution.control.FnApiControlClientPoolService: getProcessBundleDescriptor request with id 1-11
INFO:apache_beam.utils.subprocess_server:22/09/06 12:29:09 INFO org.apache.beam.runners.fnexecution.control.FnApiControlClientPoolService: getProcessBundleDescriptor request with id 1-12
INFO:apache_beam.utils.subprocess_server:22/09/06 12:29:09 INFO org.apache.beam.runners.fnexecution.control.FnApiControlClientPoolService: getProcessBundleDescriptor request with id 1-13
INFO:apache_beam.utils.subprocess_server:22/09/06 12:29:10 WARN software.amazon.awssdk.regions.internal.util.EC2MetadataUtils: Unable to retrieve the requested metadata.
INFO:apache_beam.utils.subprocess_server:22/09/06 12:29:10 WARN software.amazon.awssdk.regions.internal.util.EC2MetadataUtils: Unable to retrieve the requested metadata.
INFO:apache_beam.utils.subprocess_server:22/09/06 12:29:10 WARN software.amazon.awssdk.regions.internal.util.EC2MetadataUtils: Unable to retrieve the requested metadata.
INFO:apache_beam.utils.subprocess_server:22/09/06 12:29:10 WARN software.amazon.awssdk.regions.internal.util.EC2MetadataUtils: Unable to retrieve the requested metadata.
INFO:apache_beam.utils.subprocess_server:22/09/06 12:29:10 INFO org.apache.beam.runners.fnexecution.control.FnApiControlClientPoolService: getProcessBundleDescriptor request with id 1-14
INFO:apache_beam.utils.subprocess_server:22/09/06 12:29:10 WARN software.amazon.awssdk.regions.internal.util.EC2MetadataUtils: Unable to retrieve the requested metadata.
INFO:apache_beam.utils.subprocess_server:22/09/06 12:29:10 WARN software.amazon.awssdk.regions.internal.util.EC2MetadataUtils: Unable to retrieve the requested metadata.
INFO:apache_beam.utils.subprocess_server:22/09/06 12:29:10 WARN software.amazon.awssdk.regions.internal.util.EC2MetadataUtils: Unable to retrieve the requested metadata.
INFO:apache_beam.utils.subprocess_server:22/09/06 12:29:10 WARN software.amazon.awssdk.regions.internal.util.EC2MetadataUtils: Unable to retrieve the requested metadata.
INFO:apache_beam.utils.subprocess_server:22/09/06 12:29:10 INFO org.apache.beam.runners.fnexecution.control.FnApiControlClientPoolService: getProcessBundleDescriptor request with id 1-15
INFO:apache_beam.utils.subprocess_server:22/09/06 12:29:10 INFO org.apache.beam.runners.spark.SparkPipelineRunner: Job BeamApp-jenkins-0906122906-6754655b_a7e720d9-0ba0-459f-a708-a9a72147fd7e: Pipeline translated successfully. Computing outputs
INFO:apache_beam.utils.subprocess_server:22/09/06 12:29:10 WARN software.amazon.awssdk.regions.internal.util.EC2MetadataUtils: Unable to retrieve the requested metadata.
INFO:apache_beam.utils.subprocess_server:22/09/06 12:29:10 WARN software.amazon.awssdk.regions.internal.util.EC2MetadataUtils: Unable to retrieve the requested metadata.
INFO:apache_beam.utils.subprocess_server:22/09/06 12:29:10 WARN software.amazon.awssdk.regions.internal.util.EC2MetadataUtils: Unable to retrieve the requested metadata.
INFO:apache_beam.utils.subprocess_server:22/09/06 12:29:10 WARN software.amazon.awssdk.regions.internal.util.EC2MetadataUtils: Unable to retrieve the requested metadata.
INFO:apache_beam.utils.subprocess_server:22/09/06 12:29:10 INFO org.apache.beam.runners.fnexecution.control.FnApiControlClientPoolService: getProcessBundleDescriptor request with id 1-16
INFO:apache_beam.io.filebasedsink:Starting finalize_write threads with num_shards: 4 (skipped: 0), batches: 4, num_threads: 4
INFO:apache_beam.io.filebasedsink:Renamed 4 shards in 0.01 seconds.
INFO:apache_beam.utils.subprocess_server:22/09/06 12:29:10 INFO org.apache.beam.runners.spark.SparkPipelineRunner: Job BeamApp-jenkins-0906122906-6754655b_a7e720d9-0ba0-459f-a708-a9a72147fd7e finished.
INFO:apache_beam.runners.portability.portable_runner:Job state changed to DONE
Exception in thread run_worker_1-1:
Traceback (most recent call last):
File "/usr/lib/python3.9/threading.py", line 973, in _bootstrap_inner
Exception in thread read_state:
Traceback (most recent call last):
File "/usr/lib/python3.9/threading.py", line 973, in _bootstrap_inner
self.run()
File "/usr/lib/python3.9/threading.py", line 910, in run
self.run()
self._target(*self._args, **self._kwargs)
File "<https://ci-beam.apache.org/job/beam_PostCommit_Python39/ws/src/sdks/python/apache_beam/runners/worker/sdk_worker.py",> line 1006, in pull_responses
File "/usr/lib/python3.9/threading.py", line 910, in run
for response in responses:
File "<https://ci-beam.apache.org/job/beam_PostCommit_Python39/ws/src/build/gradleenv/2022703443/lib/python3.9/site-packages/grpc/_channel.py",> line 426, in __next__
self._target(*self._args, **self._kwargs)
File "<https://ci-beam.apache.org/job/beam_PostCommit_Python39/ws/src/sdks/python/apache_beam/runners/worker/sdk_worker.py",> line 254, in run
return self._next()
for work_request in self._control_stub.Control(get_responses()):
File "<https://ci-beam.apache.org/job/beam_PostCommit_Python39/ws/src/build/gradleenv/2022703443/lib/python3.9/site-packages/grpc/_channel.py",> line 826, in _next
File "<https://ci-beam.apache.org/job/beam_PostCommit_Python39/ws/src/build/gradleenv/2022703443/lib/python3.9/site-packages/grpc/_channel.py",> line 426, in __next__
raise self
ERROR:apache_beam.runners.worker.data_plane:Failed to read inputs in the data plane.
Traceback (most recent call last):
File "<https://ci-beam.apache.org/job/beam_PostCommit_Python39/ws/src/sdks/python/apache_beam/runners/worker/data_plane.py",> line 654, in _read_inputs
for elements in elements_iterator:
File "<https://ci-beam.apache.org/job/beam_PostCommit_Python39/ws/src/build/gradleenv/2022703443/lib/python3.9/site-packages/grpc/_channel.py",> line 426, in __next__
return self._next()
File "<https://ci-beam.apache.org/job/beam_PostCommit_Python39/ws/src/build/gradleenv/2022703443/lib/python3.9/site-packages/grpc/_channel.py",> line 826, in _next
raise self
grpc._channel._MultiThreadedRendezvous: <_MultiThreadedRendezvous of RPC that terminated with:
status = StatusCode.UNAVAILABLE
details = "Socket closed"
debug_error_string = "UNKNOWN:Error received from peer ipv4:127.0.0.1:41679 {created_time:"2022-09-06T12:29:10.930860081+00:00", grpc_status:14, grpc_message:"Socket closed"}"
>
grpc._channel._MultiThreadedRendezvous: <_MultiThreadedRendezvous of RPC that terminated with:
status = StatusCode.UNAVAILABLE
details = "Socket closed"
debug_error_string = "UNKNOWN:Error received from peer ipv4:127.0.0.1:45031 {created_time:"2022-09-06T12:29:10.930799389+00:00", grpc_status:14, grpc_message:"Socket closed"}"
>
return self._next()
File "<https://ci-beam.apache.org/job/beam_PostCommit_Python39/ws/src/build/gradleenv/2022703443/lib/python3.9/site-packages/grpc/_channel.py",> line 826, in _next
Exception in thread read_grpc_client_inputs:
Traceback (most recent call last):
File "/usr/lib/python3.9/threading.py", line 973, in _bootstrap_inner
raise self
grpc._channel._MultiThreadedRendezvous: <_MultiThreadedRendezvous of RPC that terminated with:
status = StatusCode.UNAVAILABLE
details = "Connection reset by peer"
debug_error_string = "UNKNOWN:Error received from peer ipv4:127.0.0.1:38977 {grpc_message:"Connection reset by peer", grpc_status:14, created_time:"2022-09-06T12:29:10.93083883+00:00"}"
>
self.run()
File "/usr/lib/python3.9/threading.py", line 910, in run
self._target(*self._args, **self._kwargs)
File "<https://ci-beam.apache.org/job/beam_PostCommit_Python39/ws/src/sdks/python/apache_beam/runners/worker/data_plane.py",> line 671, in <lambda>
target=lambda: self._read_inputs(elements_iterator),
File "<https://ci-beam.apache.org/job/beam_PostCommit_Python39/ws/src/sdks/python/apache_beam/runners/worker/data_plane.py",> line 654, in _read_inputs
for elements in elements_iterator:
File "<https://ci-beam.apache.org/job/beam_PostCommit_Python39/ws/src/build/gradleenv/2022703443/lib/python3.9/site-packages/grpc/_channel.py",> line 426, in __next__
return self._next()
File "<https://ci-beam.apache.org/job/beam_PostCommit_Python39/ws/src/build/gradleenv/2022703443/lib/python3.9/site-packages/grpc/_channel.py",> line 826, in _next
raise self
grpc._channel._MultiThreadedRendezvous: <_MultiThreadedRendezvous of RPC that terminated with:
status = StatusCode.UNAVAILABLE
details = "Socket closed"
debug_error_string = "UNKNOWN:Error received from peer ipv4:127.0.0.1:41679 {created_time:"2022-09-06T12:29:10.930860081+00:00", grpc_status:14, grpc_message:"Socket closed"}"
>
> Task :sdks:python:test-suites:portable:py39:postCommitPy39
> Task :sdks:python:test-suites:dataflow:py39:postCommitIT FAILED
FAILURE: Build completed with 2 failures.
1: Task failed with an exception.
-----------
* Where:
Script '<https://ci-beam.apache.org/job/beam_PostCommit_Python39/ws/src/sdks/python/test-suites/direct/common.gradle'> line: 229
* What went wrong:
Execution failed for task ':sdks:python:test-suites:direct:py39:sklearnInferenceTest'.
> Process 'command 'sh'' finished with non-zero exit value 1
* Try:
> Run with --stacktrace option to get the stack trace.
> Run with --info or --debug option to get more log output.
> Run with --scan to get full insights.
==============================================================================
2: Task failed with an exception.
-----------
* Where:
Script '<https://ci-beam.apache.org/job/beam_PostCommit_Python39/ws/src/sdks/python/test-suites/dataflow/common.gradle'> line: 121
* What went wrong:
Execution failed for task ':sdks:python:test-suites:dataflow:py39:postCommitIT'.
> Process 'command 'sh'' finished with non-zero exit value 1
* Try:
> Run with --stacktrace option to get the stack trace.
> Run with --info or --debug option to get more log output.
> Run with --scan to get full insights.
==============================================================================
* Get more help at https://help.gradle.org
Deprecated Gradle features were used in this build, making it incompatible with Gradle 8.0.
You can use '--warning-mode all' to show the individual deprecation warnings and determine if they come from your own scripts or plugins.
See https://docs.gradle.org/7.4/userguide/command_line_interface.html#sec:command_line_warnings
Execution optimizations have been disabled for 1 invalid unit(s) of work during this build to ensure correctness.
Please consult deprecation warnings for more details.
BUILD FAILED in 2h 53m 18s
222 actionable tasks: 152 executed, 64 from cache, 6 up-to-date
Publishing build scan...
https://gradle.com/s/3sbjsncgv3nlo
Build step 'Invoke Gradle script' changed build result to FAILURE
Build step 'Invoke Gradle script' marked build as failure
---------------------------------------------------------------------
To unsubscribe, e-mail: builds-unsubscribe@beam.apache.org
For additional commands, e-mail: builds-help@beam.apache.org
Jenkins build is back to normal : beam_PostCommit_Python39 #824
Posted by Apache Jenkins Server <je...@builds.apache.org>.
See <https://ci-beam.apache.org/job/beam_PostCommit_Python39/824/display/redirect?page=changes>
---------------------------------------------------------------------
To unsubscribe, e-mail: builds-unsubscribe@beam.apache.org
For additional commands, e-mail: builds-help@beam.apache.org
Build failed in Jenkins: beam_PostCommit_Python39 #823
Posted by Apache Jenkins Server <je...@builds.apache.org>.
See <https://ci-beam.apache.org/job/beam_PostCommit_Python39/823/display/redirect>
Changes:
------------------------------------------
[...truncated 43.67 MB...]
apache_beam/typehints/pandas_type_compatibility_test.py:89
apache_beam/typehints/pandas_type_compatibility_test.py:89
apache_beam/typehints/pandas_type_compatibility_test.py:89
apache_beam/typehints/pandas_type_compatibility_test.py:89
apache_beam/typehints/pandas_type_compatibility_test.py:89
<https://ci-beam.apache.org/job/beam_PostCommit_Python39/ws/src/sdks/python/apache_beam/typehints/pandas_type_compatibility_test.py>:89: FutureWarning: pandas.Int64Index is deprecated and will be removed from pandas in a future version. Use pandas.Index with the appropriate dtype instead.
pd.Int64Index(range(123, 223), name='an_index'),
apache_beam/typehints/pandas_type_compatibility_test.py:90
apache_beam/typehints/pandas_type_compatibility_test.py:90
apache_beam/typehints/pandas_type_compatibility_test.py:90
apache_beam/typehints/pandas_type_compatibility_test.py:90
apache_beam/typehints/pandas_type_compatibility_test.py:90
apache_beam/typehints/pandas_type_compatibility_test.py:90
apache_beam/typehints/pandas_type_compatibility_test.py:90
apache_beam/typehints/pandas_type_compatibility_test.py:90
<https://ci-beam.apache.org/job/beam_PostCommit_Python39/ws/src/sdks/python/apache_beam/typehints/pandas_type_compatibility_test.py>:90: FutureWarning: pandas.Int64Index is deprecated and will be removed from pandas in a future version. Use pandas.Index with the appropriate dtype instead.
pd.Int64Index(range(475, 575), name='another_index'),
apache_beam/dataframe/io_it_test.py: 3 warnings
apache_beam/examples/cookbook/bigquery_tornadoes_it_test.py: 1 warning
apache_beam/examples/dataframe/flight_delays_it_test.py: 1 warning
apache_beam/io/gcp/big_query_query_to_table_it_test.py: 6 warnings
apache_beam/io/gcp/bigquery_read_it_test.py: 7 warnings
apache_beam/io/gcp/bigquery_io_read_it_test.py: 2 warnings
apache_beam/io/gcp/bigquery_json_it_test.py: 3 warnings
<https://ci-beam.apache.org/job/beam_PostCommit_Python39/ws/src/sdks/python/apache_beam/io/gcp/bigquery.py>:2774: BeamDeprecationWarning: options is deprecated since First stable release. References to <pipeline>.options will not be supported
temp_location = pcoll.pipeline.options.view_as(
apache_beam/dataframe/io_it_test.py: 3 warnings
apache_beam/examples/cookbook/bigquery_tornadoes_it_test.py: 1 warning
apache_beam/examples/dataframe/flight_delays_it_test.py: 1 warning
apache_beam/io/gcp/big_query_query_to_table_it_test.py: 6 warnings
apache_beam/io/gcp/bigquery_read_it_test.py: 7 warnings
apache_beam/io/gcp/bigquery_io_read_it_test.py: 2 warnings
apache_beam/io/gcp/bigquery_json_it_test.py: 3 warnings
<https://ci-beam.apache.org/job/beam_PostCommit_Python39/ws/src/sdks/python/apache_beam/io/gcp/bigquery.py>:2776: BeamDeprecationWarning: options is deprecated since First stable release. References to <pipeline>.options will not be supported
job_name = pcoll.pipeline.options.view_as(GoogleCloudOptions).job_name
apache_beam/dataframe/io_it_test.py: 3 warnings
apache_beam/examples/cookbook/bigquery_tornadoes_it_test.py: 1 warning
apache_beam/examples/dataframe/flight_delays_it_test.py: 1 warning
apache_beam/io/gcp/big_query_query_to_table_it_test.py: 6 warnings
apache_beam/io/gcp/bigquery_read_it_test.py: 7 warnings
apache_beam/io/gcp/bigquery_io_read_it_test.py: 2 warnings
apache_beam/io/gcp/bigquery_json_it_test.py: 3 warnings
<https://ci-beam.apache.org/job/beam_PostCommit_Python39/ws/src/sdks/python/apache_beam/io/gcp/bigquery.py>:2800: BeamDeprecationWarning: options is deprecated since First stable release. References to <pipeline>.options will not be supported
pipeline_options=pcoll.pipeline.options,
apache_beam/examples/complete/game/game_stats_it_test.py::GameStatsIT::test_game_stats_it
apache_beam/examples/complete/game/hourly_team_score_it_test.py::HourlyTeamScoreIT::test_hourly_team_score_it
apache_beam/examples/complete/game/leader_board_it_test.py::LeaderBoardIT::test_leader_board_it
apache_beam/io/gcp/bigquery_test.py::PubSubBigQueryIT::test_file_loads
apache_beam/io/gcp/bigquery_test.py::PubSubBigQueryIT::test_streaming_inserts
<https://ci-beam.apache.org/job/beam_PostCommit_Python39/ws/src/sdks/python/apache_beam/io/gcp/tests/utils.py>:63: PendingDeprecationWarning: Client.dataset is deprecated and will be removed in a future version. Use a string like 'my_project.my_dataset' or a cloud.google.bigquery.DatasetReference object, instead.
dataset_ref = client.dataset(unique_dataset_name, project=project)
apache_beam/examples/complete/game/game_stats_it_test.py: 2 warnings
apache_beam/examples/cookbook/bigquery_tornadoes_it_test.py: 1 warning
apache_beam/examples/complete/game/hourly_team_score_it_test.py: 1 warning
apache_beam/examples/complete/game/leader_board_it_test.py: 2 warnings
apache_beam/io/gcp/big_query_query_to_table_it_test.py: 6 warnings
apache_beam/io/gcp/bigquery_write_it_test.py: 4 warnings
apache_beam/io/gcp/bigquery_json_it_test.py: 2 warnings
apache_beam/io/gcp/bigquery_test.py: 6 warnings
apache_beam/io/gcp/bigquery_file_loads_test.py: 3 warnings
<https://ci-beam.apache.org/job/beam_PostCommit_Python39/ws/src/sdks/python/apache_beam/io/gcp/bigquery.py>:2285: BeamDeprecationWarning: options is deprecated since First stable release. References to <pipeline>.options will not be supported
is_streaming_pipeline = p.options.view_as(StandardOptions).streaming
apache_beam/examples/complete/game/game_stats_it_test.py: 2 warnings
apache_beam/examples/cookbook/bigquery_tornadoes_it_test.py: 1 warning
apache_beam/examples/complete/game/hourly_team_score_it_test.py: 1 warning
apache_beam/examples/complete/game/leader_board_it_test.py: 2 warnings
apache_beam/io/gcp/big_query_query_to_table_it_test.py: 6 warnings
apache_beam/io/gcp/bigquery_write_it_test.py: 4 warnings
apache_beam/io/gcp/bigquery_json_it_test.py: 2 warnings
apache_beam/io/gcp/bigquery_test.py: 6 warnings
apache_beam/io/gcp/bigquery_file_loads_test.py: 3 warnings
<https://ci-beam.apache.org/job/beam_PostCommit_Python39/ws/src/sdks/python/apache_beam/io/gcp/bigquery.py>:2291: BeamDeprecationWarning: options is deprecated since First stable release. References to <pipeline>.options will not be supported
experiments = p.options.view_as(DebugOptions).experiments or []
apache_beam/examples/cookbook/bigquery_tornadoes_it_test.py: 1 warning
apache_beam/io/gcp/big_query_query_to_table_it_test.py: 6 warnings
apache_beam/io/gcp/bigquery_write_it_test.py: 4 warnings
apache_beam/io/gcp/bigquery_test.py: 2 warnings
<https://ci-beam.apache.org/job/beam_PostCommit_Python39/ws/src/sdks/python/apache_beam/io/gcp/bigquery.py>:2281: BeamDeprecationWarning: options is deprecated since First stable release. References to <pipeline>.options will not be supported
self.table_reference.projectId = pcoll.pipeline.options.view_as(
apache_beam/examples/cookbook/bigquery_tornadoes_it_test.py: 1 warning
apache_beam/examples/complete/game/hourly_team_score_it_test.py: 1 warning
apache_beam/io/gcp/big_query_query_to_table_it_test.py: 6 warnings
apache_beam/io/gcp/bigquery_write_it_test.py: 3 warnings
apache_beam/io/gcp/bigquery_test.py: 3 warnings
apache_beam/io/gcp/bigquery_file_loads_test.py: 3 warnings
<https://ci-beam.apache.org/job/beam_PostCommit_Python39/ws/src/sdks/python/apache_beam/io/gcp/bigquery_file_loads.py>:1129: BeamDeprecationWarning: options is deprecated since First stable release. References to <pipeline>.options will not be supported
temp_location = p.options.view_as(GoogleCloudOptions).temp_location
apache_beam/examples/cookbook/bigquery_tornadoes_it_test.py: 1 warning
apache_beam/examples/complete/game/hourly_team_score_it_test.py: 1 warning
apache_beam/io/gcp/big_query_query_to_table_it_test.py: 6 warnings
apache_beam/io/gcp/bigquery_write_it_test.py: 3 warnings
apache_beam/io/gcp/bigquery_test.py: 3 warnings
apache_beam/io/gcp/bigquery_file_loads_test.py: 3 warnings
<https://ci-beam.apache.org/job/beam_PostCommit_Python39/ws/src/sdks/python/apache_beam/io/gcp/bigquery_file_loads.py>:1131: BeamDeprecationWarning: options is deprecated since First stable release. References to <pipeline>.options will not be supported
p.options.view_as(GoogleCloudOptions).job_name or 'AUTOMATIC_JOB_NAME')
apache_beam/examples/cookbook/bigquery_tornadoes_it_test.py::BigqueryTornadoesIT::test_bigquery_tornadoes_it
<https://ci-beam.apache.org/job/beam_PostCommit_Python39/ws/src/sdks/python/apache_beam/io/gcp/tests/utils.py>:100: PendingDeprecationWarning: Client.dataset is deprecated and will be removed in a future version. Use a string like 'my_project.my_dataset' or a cloud.google.bigquery.DatasetReference object, instead.
table_ref = client.dataset(dataset_id).table(table_id)
apache_beam/dataframe/io_it_test.py: 2 warnings
apache_beam/io/gcp/bigquery_json_it_test.py: 1 warning
apache_beam/io/gcp/bigquery_read_it_test.py: 9 warnings
<https://ci-beam.apache.org/job/beam_PostCommit_Python39/ws/src/sdks/python/apache_beam/io/gcp/bigquery.py>:2818: BeamDeprecationWarning: options is deprecated since First stable release. References to <pipeline>.options will not be supported
project_id = pcoll.pipeline.options.view_as(GoogleCloudOptions).project
apache_beam/dataframe/io_it_test.py: 2 warnings
apache_beam/io/gcp/bigquery_json_it_test.py: 1 warning
apache_beam/io/gcp/bigquery_read_it_test.py: 9 warnings
<https://ci-beam.apache.org/job/beam_PostCommit_Python39/ws/src/sdks/python/apache_beam/io/gcp/bigquery.py>:2839: BeamDeprecationWarning: options is deprecated since First stable release. References to <pipeline>.options will not be supported
pipeline_options=pcoll.pipeline.options,
apache_beam/examples/dataframe/flight_delays_it_test.py::FlightDelaysTest::test_flight_delays
<https://ci-beam.apache.org/job/beam_PostCommit_Python39/ws/src/sdks/python/apache_beam/examples/dataframe/flight_delays.py>:47: FutureWarning: Dropping of nuisance columns in DataFrame reductions (with 'numeric_only=None') is deprecated; in a future version this will raise TypeError. Select only valid columns before calling the reduction.
return airline_df[at_top_airports].mean()
apache_beam/examples/dataframe/flight_delays_it_test.py::FlightDelaysTest::test_flight_delays
apache_beam/examples/dataframe/taxiride_it_test.py::TaxirideIT::test_aggregation
apache_beam/examples/dataframe/taxiride_it_test.py::TaxirideIT::test_enrich
<https://ci-beam.apache.org/job/beam_PostCommit_Python39/ws/src/sdks/python/apache_beam/dataframe/io.py>:659: FutureWarning: WriteToFiles is experimental.
return pcoll | fileio.WriteToFiles(
apache_beam/examples/dataframe/flight_delays_it_test.py::FlightDelaysTest::test_flight_delays
apache_beam/examples/dataframe/taxiride_it_test.py::TaxirideIT::test_aggregation
apache_beam/examples/dataframe/taxiride_it_test.py::TaxirideIT::test_enrich
<https://ci-beam.apache.org/job/beam_PostCommit_Python39/ws/src/sdks/python/apache_beam/io/fileio.py>:590: BeamDeprecationWarning: options is deprecated since First stable release. References to <pipeline>.options will not be supported
p.options.view_as(GoogleCloudOptions).temp_location or
apache_beam/io/gcp/bigquery_read_it_test.py::ReadTests::test_native_source
<https://ci-beam.apache.org/job/beam_PostCommit_Python39/ws/src/sdks/python/apache_beam/io/gcp/bigquery_read_it_test.py>:171: BeamDeprecationWarning: BigQuerySource is deprecated since 2.25.0. Use ReadFromBigQuery instead.
beam.io.BigQuerySource(query=self.query, use_standard_sql=True)))
apache_beam/io/gcp/bigquery_test.py::BigQueryStreamingInsertTransformIntegrationTests::test_multiple_destinations_transform
<https://ci-beam.apache.org/job/beam_PostCommit_Python39/ws/src/sdks/python/apache_beam/io/gcp/bigquery_test.py>:1846: BeamDeprecationWarning: options is deprecated since First stable release. References to <pipeline>.options will not be supported
streaming = self.test_pipeline.options.view_as(StandardOptions).streaming
apache_beam/ml/gcp/cloud_dlp_it_test.py::CloudDLPIT::test_deidentification
<https://ci-beam.apache.org/job/beam_PostCommit_Python39/ws/src/sdks/python/apache_beam/ml/gcp/cloud_dlp_it_test.py>:74: FutureWarning: MaskDetectedDetails is experimental.
| MaskDetectedDetails(
apache_beam/io/gcp/big_query_query_to_table_it_test.py::BigQueryQueryToTableIT::test_big_query_new_types_native
apache_beam/io/gcp/big_query_query_to_table_it_test.py::BigQueryQueryToTableIT::test_big_query_standard_sql_kms_key_native
<https://ci-beam.apache.org/job/beam_PostCommit_Python39/ws/src/sdks/python/apache_beam/io/gcp/big_query_query_to_table_pipeline.py>:81: BeamDeprecationWarning: BigQuerySource is deprecated since 2.25.0. Use ReadFromBigQuery instead.
beam.io.BigQuerySource(
apache_beam/io/gcp/big_query_query_to_table_it_test.py::BigQueryQueryToTableIT::test_big_query_new_types_native
apache_beam/io/gcp/big_query_query_to_table_it_test.py::BigQueryQueryToTableIT::test_big_query_standard_sql_kms_key_native
<https://ci-beam.apache.org/job/beam_PostCommit_Python39/ws/src/sdks/python/apache_beam/runners/dataflow/ptransform_overrides.py>:316: BeamDeprecationWarning: BigQuerySink is deprecated since 2.11.0. Use WriteToBigQuery instead.
io.BigQuerySink(
apache_beam/ml/gcp/cloud_dlp_it_test.py::CloudDLPIT::test_inspection
<https://ci-beam.apache.org/job/beam_PostCommit_Python39/ws/src/sdks/python/apache_beam/ml/gcp/cloud_dlp_it_test.py>:85: FutureWarning: InspectForDetails is experimental.
| InspectForDetails(
apache_beam/ml/inference/sklearn_inference_it_test.py::SklearnInference::test_sklearn_regression
<https://ci-beam.apache.org/job/beam_PostCommit_Python39/ws/src/sdks/python/apache_beam/examples/inference/sklearn_japanese_housing_regression.py>:128: FutureWarning: SklearnModelHandlerPandas is experimental. No backwards-compatibility guarantees.
model_loader = SklearnModelHandlerPandas(
apache_beam/ml/inference/sklearn_inference_it_test.py::SklearnInference::test_sklearn_regression
<https://ci-beam.apache.org/job/beam_PostCommit_Python39/ws/src/build/gradleenv/-1734967050/lib/python3.9/site-packages/dill/_dill.py>:472: FutureWarning: SklearnModelHandlerPandas is experimental. No backwards-compatibility guarantees.
obj = StockUnpickler.load(self)
apache_beam/io/gcp/bigquery_read_it_test.py::ReadNewTypesTests::test_native_source
<https://ci-beam.apache.org/job/beam_PostCommit_Python39/ws/src/sdks/python/apache_beam/io/gcp/bigquery_read_it_test.py>:646: BeamDeprecationWarning: BigQuerySource is deprecated since 2.25.0. Use ReadFromBigQuery instead.
beam.io.BigQuerySource(query=self.query, use_standard_sql=True)))
apache_beam/io/gcp/bigquery_read_it_test.py::ReadAllBQTests::test_read_queries
<https://ci-beam.apache.org/job/beam_PostCommit_Python39/ws/src/sdks/python/apache_beam/io/gcp/bigquery_read_it_test.py>:761: FutureWarning: ReadAllFromBigQuery is experimental.
| beam.io.ReadAllFromBigQuery())
apache_beam/io/gcp/bigquery_read_it_test.py::ReadAllBQTests::test_read_queries
<https://ci-beam.apache.org/job/beam_PostCommit_Python39/ws/src/sdks/python/apache_beam/io/gcp/bigquery.py>:2947: BeamDeprecationWarning: options is deprecated since First stable release. References to <pipeline>.options will not be supported
job_name = pcoll.pipeline.options.view_as(GoogleCloudOptions).job_name
apache_beam/io/gcp/bigquery_read_it_test.py::ReadAllBQTests::test_read_queries
<https://ci-beam.apache.org/job/beam_PostCommit_Python39/ws/src/sdks/python/apache_beam/io/gcp/bigquery.py>:2948: BeamDeprecationWarning: options is deprecated since First stable release. References to <pipeline>.options will not be supported
project = pcoll.pipeline.options.view_as(GoogleCloudOptions).project
apache_beam/io/gcp/bigquery_read_it_test.py::ReadAllBQTests::test_read_queries
<https://ci-beam.apache.org/job/beam_PostCommit_Python39/ws/src/sdks/python/apache_beam/io/gcp/bigquery.py>:2961: BeamDeprecationWarning: options is deprecated since First stable release. References to <pipeline>.options will not be supported
options=pcoll.pipeline.options,
-- Docs: https://docs.pytest.org/en/stable/how-to/capture-warnings.html
- generated xml file: <https://ci-beam.apache.org/job/beam_PostCommit_Python39/ws/src/sdks/python/pytest_postCommitIT-df-py39.xml> -
=========================== short test summary info ============================
FAILED apache_beam/ml/inference/sklearn_inference_it_test.py::SklearnInference::test_sklearn_mnist_classification
[31m===== [31m[1m1 failed[0m, [32m87 passed[0m, [33m12 skipped[0m, [33m272 warnings[0m[31m in 12089.50s (3:21:29)[0m[31m =====[0m
> Task :sdks:python:test-suites:dataflow:py39:postCommitIT FAILED
FAILURE: Build completed with 2 failures.
1: Task failed with an exception.
-----------
* Where:
Script '<https://ci-beam.apache.org/job/beam_PostCommit_Python39/ws/src/sdks/python/test-suites/direct/common.gradle'> line: 229
* What went wrong:
Execution failed for task ':sdks:python:test-suites:direct:py39:sklearnInferenceTest'.
> Process 'command 'sh'' finished with non-zero exit value 1
* Try:
> Run with --stacktrace option to get the stack trace.
> Run with --info or --debug option to get more log output.
==============================================================================
2: Task failed with an exception.
-----------
* Where:
Script '<https://ci-beam.apache.org/job/beam_PostCommit_Python39/ws/src/sdks/python/test-suites/dataflow/common.gradle'> line: 121
* What went wrong:
Execution failed for task ':sdks:python:test-suites:dataflow:py39:postCommitIT'.
> Process 'command 'sh'' finished with non-zero exit value 1
* Try:
> Run with --stacktrace option to get the stack trace.
> Run with --info or --debug option to get more log output.
==============================================================================
* Get more help at https://help.gradle.org
Deprecated Gradle features were used in this build, making it incompatible with Gradle 8.0.
You can use '--warning-mode all' to show the individual deprecation warnings and determine if they come from your own scripts or plugins.
See https://docs.gradle.org/7.5.1/userguide/command_line_interface.html#sec:command_line_warnings
Execution optimizations have been disabled for 1 invalid unit(s) of work during this build to ensure correctness.
Please consult deprecation warnings for more details.
BUILD FAILED in 3h 23m 42s
222 actionable tasks: 152 executed, 64 from cache, 6 up-to-date
Publishing build scan...
https://gradle.com/s/skqmxopu3ox6y
Build step 'Invoke Gradle script' changed build result to FAILURE
Build step 'Invoke Gradle script' marked build as failure
---------------------------------------------------------------------
To unsubscribe, e-mail: builds-unsubscribe@beam.apache.org
For additional commands, e-mail: builds-help@beam.apache.org
Build failed in Jenkins: beam_PostCommit_Python39 #822
Posted by Apache Jenkins Server <je...@builds.apache.org>.
See <https://ci-beam.apache.org/job/beam_PostCommit_Python39/822/display/redirect?page=changes>
Changes:
[Kenneth Knowles] Cosmetic checkstyle fix to TextRowCountEstimator
[Kenneth Knowles] Upgrade to Gradle 7.5.1
[chamikaramj] Fixes RunInference test failure
------------------------------------------
[...truncated 43.56 MB...]
apache_beam/typehints/pandas_type_compatibility_test.py:89
apache_beam/typehints/pandas_type_compatibility_test.py:89
apache_beam/typehints/pandas_type_compatibility_test.py:89
apache_beam/typehints/pandas_type_compatibility_test.py:89
apache_beam/typehints/pandas_type_compatibility_test.py:89
<https://ci-beam.apache.org/job/beam_PostCommit_Python39/ws/src/sdks/python/apache_beam/typehints/pandas_type_compatibility_test.py>:89: FutureWarning: pandas.Int64Index is deprecated and will be removed from pandas in a future version. Use pandas.Index with the appropriate dtype instead.
pd.Int64Index(range(123, 223), name='an_index'),
apache_beam/typehints/pandas_type_compatibility_test.py:90
apache_beam/typehints/pandas_type_compatibility_test.py:90
apache_beam/typehints/pandas_type_compatibility_test.py:90
apache_beam/typehints/pandas_type_compatibility_test.py:90
apache_beam/typehints/pandas_type_compatibility_test.py:90
apache_beam/typehints/pandas_type_compatibility_test.py:90
apache_beam/typehints/pandas_type_compatibility_test.py:90
apache_beam/typehints/pandas_type_compatibility_test.py:90
<https://ci-beam.apache.org/job/beam_PostCommit_Python39/ws/src/sdks/python/apache_beam/typehints/pandas_type_compatibility_test.py>:90: FutureWarning: pandas.Int64Index is deprecated and will be removed from pandas in a future version. Use pandas.Index with the appropriate dtype instead.
pd.Int64Index(range(475, 575), name='another_index'),
apache_beam/dataframe/io_it_test.py: 3 warnings
apache_beam/examples/cookbook/bigquery_tornadoes_it_test.py: 1 warning
apache_beam/examples/dataframe/flight_delays_it_test.py: 1 warning
apache_beam/io/gcp/big_query_query_to_table_it_test.py: 6 warnings
apache_beam/io/gcp/bigquery_read_it_test.py: 7 warnings
apache_beam/io/gcp/bigquery_io_read_it_test.py: 2 warnings
apache_beam/io/gcp/bigquery_json_it_test.py: 3 warnings
<https://ci-beam.apache.org/job/beam_PostCommit_Python39/ws/src/sdks/python/apache_beam/io/gcp/bigquery.py>:2774: BeamDeprecationWarning: options is deprecated since First stable release. References to <pipeline>.options will not be supported
temp_location = pcoll.pipeline.options.view_as(
apache_beam/dataframe/io_it_test.py: 3 warnings
apache_beam/examples/cookbook/bigquery_tornadoes_it_test.py: 1 warning
apache_beam/examples/dataframe/flight_delays_it_test.py: 1 warning
apache_beam/io/gcp/big_query_query_to_table_it_test.py: 6 warnings
apache_beam/io/gcp/bigquery_read_it_test.py: 7 warnings
apache_beam/io/gcp/bigquery_io_read_it_test.py: 2 warnings
apache_beam/io/gcp/bigquery_json_it_test.py: 3 warnings
<https://ci-beam.apache.org/job/beam_PostCommit_Python39/ws/src/sdks/python/apache_beam/io/gcp/bigquery.py>:2776: BeamDeprecationWarning: options is deprecated since First stable release. References to <pipeline>.options will not be supported
job_name = pcoll.pipeline.options.view_as(GoogleCloudOptions).job_name
apache_beam/dataframe/io_it_test.py: 3 warnings
apache_beam/examples/cookbook/bigquery_tornadoes_it_test.py: 1 warning
apache_beam/examples/dataframe/flight_delays_it_test.py: 1 warning
apache_beam/io/gcp/big_query_query_to_table_it_test.py: 6 warnings
apache_beam/io/gcp/bigquery_read_it_test.py: 7 warnings
apache_beam/io/gcp/bigquery_io_read_it_test.py: 2 warnings
apache_beam/io/gcp/bigquery_json_it_test.py: 3 warnings
<https://ci-beam.apache.org/job/beam_PostCommit_Python39/ws/src/sdks/python/apache_beam/io/gcp/bigquery.py>:2800: BeamDeprecationWarning: options is deprecated since First stable release. References to <pipeline>.options will not be supported
pipeline_options=pcoll.pipeline.options,
apache_beam/examples/complete/game/game_stats_it_test.py::GameStatsIT::test_game_stats_it
apache_beam/examples/complete/game/hourly_team_score_it_test.py::HourlyTeamScoreIT::test_hourly_team_score_it
apache_beam/examples/complete/game/leader_board_it_test.py::LeaderBoardIT::test_leader_board_it
apache_beam/io/gcp/bigquery_test.py::PubSubBigQueryIT::test_file_loads
apache_beam/io/gcp/bigquery_test.py::PubSubBigQueryIT::test_streaming_inserts
<https://ci-beam.apache.org/job/beam_PostCommit_Python39/ws/src/sdks/python/apache_beam/io/gcp/tests/utils.py>:63: PendingDeprecationWarning: Client.dataset is deprecated and will be removed in a future version. Use a string like 'my_project.my_dataset' or a cloud.google.bigquery.DatasetReference object, instead.
dataset_ref = client.dataset(unique_dataset_name, project=project)
apache_beam/examples/complete/game/game_stats_it_test.py: 2 warnings
apache_beam/examples/cookbook/bigquery_tornadoes_it_test.py: 1 warning
apache_beam/examples/complete/game/hourly_team_score_it_test.py: 1 warning
apache_beam/examples/complete/game/leader_board_it_test.py: 2 warnings
apache_beam/io/gcp/big_query_query_to_table_it_test.py: 6 warnings
apache_beam/io/gcp/bigquery_test.py: 6 warnings
apache_beam/io/gcp/bigquery_write_it_test.py: 4 warnings
apache_beam/io/gcp/bigquery_json_it_test.py: 2 warnings
apache_beam/io/gcp/bigquery_file_loads_test.py: 3 warnings
<https://ci-beam.apache.org/job/beam_PostCommit_Python39/ws/src/sdks/python/apache_beam/io/gcp/bigquery.py>:2285: BeamDeprecationWarning: options is deprecated since First stable release. References to <pipeline>.options will not be supported
is_streaming_pipeline = p.options.view_as(StandardOptions).streaming
apache_beam/examples/complete/game/game_stats_it_test.py: 2 warnings
apache_beam/examples/cookbook/bigquery_tornadoes_it_test.py: 1 warning
apache_beam/examples/complete/game/hourly_team_score_it_test.py: 1 warning
apache_beam/examples/complete/game/leader_board_it_test.py: 2 warnings
apache_beam/io/gcp/big_query_query_to_table_it_test.py: 6 warnings
apache_beam/io/gcp/bigquery_test.py: 6 warnings
apache_beam/io/gcp/bigquery_write_it_test.py: 4 warnings
apache_beam/io/gcp/bigquery_json_it_test.py: 2 warnings
apache_beam/io/gcp/bigquery_file_loads_test.py: 3 warnings
<https://ci-beam.apache.org/job/beam_PostCommit_Python39/ws/src/sdks/python/apache_beam/io/gcp/bigquery.py>:2291: BeamDeprecationWarning: options is deprecated since First stable release. References to <pipeline>.options will not be supported
experiments = p.options.view_as(DebugOptions).experiments or []
apache_beam/dataframe/io_it_test.py: 2 warnings
apache_beam/io/gcp/bigquery_json_it_test.py: 1 warning
apache_beam/io/gcp/bigquery_read_it_test.py: 9 warnings
<https://ci-beam.apache.org/job/beam_PostCommit_Python39/ws/src/sdks/python/apache_beam/io/gcp/bigquery.py>:2818: BeamDeprecationWarning: options is deprecated since First stable release. References to <pipeline>.options will not be supported
project_id = pcoll.pipeline.options.view_as(GoogleCloudOptions).project
apache_beam/dataframe/io_it_test.py: 2 warnings
apache_beam/io/gcp/bigquery_json_it_test.py: 1 warning
apache_beam/io/gcp/bigquery_read_it_test.py: 9 warnings
<https://ci-beam.apache.org/job/beam_PostCommit_Python39/ws/src/sdks/python/apache_beam/io/gcp/bigquery.py>:2839: BeamDeprecationWarning: options is deprecated since First stable release. References to <pipeline>.options will not be supported
pipeline_options=pcoll.pipeline.options,
apache_beam/examples/cookbook/bigquery_tornadoes_it_test.py: 1 warning
apache_beam/io/gcp/big_query_query_to_table_it_test.py: 6 warnings
apache_beam/io/gcp/bigquery_write_it_test.py: 4 warnings
apache_beam/io/gcp/bigquery_test.py: 2 warnings
<https://ci-beam.apache.org/job/beam_PostCommit_Python39/ws/src/sdks/python/apache_beam/io/gcp/bigquery.py>:2281: BeamDeprecationWarning: options is deprecated since First stable release. References to <pipeline>.options will not be supported
self.table_reference.projectId = pcoll.pipeline.options.view_as(
apache_beam/examples/cookbook/bigquery_tornadoes_it_test.py: 1 warning
apache_beam/examples/complete/game/hourly_team_score_it_test.py: 1 warning
apache_beam/io/gcp/big_query_query_to_table_it_test.py: 6 warnings
apache_beam/io/gcp/bigquery_write_it_test.py: 3 warnings
apache_beam/io/gcp/bigquery_test.py: 3 warnings
apache_beam/io/gcp/bigquery_file_loads_test.py: 3 warnings
<https://ci-beam.apache.org/job/beam_PostCommit_Python39/ws/src/sdks/python/apache_beam/io/gcp/bigquery_file_loads.py>:1129: BeamDeprecationWarning: options is deprecated since First stable release. References to <pipeline>.options will not be supported
temp_location = p.options.view_as(GoogleCloudOptions).temp_location
apache_beam/examples/cookbook/bigquery_tornadoes_it_test.py: 1 warning
apache_beam/examples/complete/game/hourly_team_score_it_test.py: 1 warning
apache_beam/io/gcp/big_query_query_to_table_it_test.py: 6 warnings
apache_beam/io/gcp/bigquery_write_it_test.py: 3 warnings
apache_beam/io/gcp/bigquery_test.py: 3 warnings
apache_beam/io/gcp/bigquery_file_loads_test.py: 3 warnings
<https://ci-beam.apache.org/job/beam_PostCommit_Python39/ws/src/sdks/python/apache_beam/io/gcp/bigquery_file_loads.py>:1131: BeamDeprecationWarning: options is deprecated since First stable release. References to <pipeline>.options will not be supported
p.options.view_as(GoogleCloudOptions).job_name or 'AUTOMATIC_JOB_NAME')
apache_beam/examples/cookbook/bigquery_tornadoes_it_test.py::BigqueryTornadoesIT::test_bigquery_tornadoes_it
<https://ci-beam.apache.org/job/beam_PostCommit_Python39/ws/src/sdks/python/apache_beam/io/gcp/tests/utils.py>:100: PendingDeprecationWarning: Client.dataset is deprecated and will be removed in a future version. Use a string like 'my_project.my_dataset' or a cloud.google.bigquery.DatasetReference object, instead.
table_ref = client.dataset(dataset_id).table(table_id)
apache_beam/examples/dataframe/flight_delays_it_test.py::FlightDelaysTest::test_flight_delays
<https://ci-beam.apache.org/job/beam_PostCommit_Python39/ws/src/sdks/python/apache_beam/examples/dataframe/flight_delays.py>:47: FutureWarning: Dropping of nuisance columns in DataFrame reductions (with 'numeric_only=None') is deprecated; in a future version this will raise TypeError. Select only valid columns before calling the reduction.
return airline_df[at_top_airports].mean()
apache_beam/examples/dataframe/flight_delays_it_test.py::FlightDelaysTest::test_flight_delays
apache_beam/examples/dataframe/taxiride_it_test.py::TaxirideIT::test_aggregation
apache_beam/examples/dataframe/taxiride_it_test.py::TaxirideIT::test_enrich
<https://ci-beam.apache.org/job/beam_PostCommit_Python39/ws/src/sdks/python/apache_beam/dataframe/io.py>:659: FutureWarning: WriteToFiles is experimental.
return pcoll | fileio.WriteToFiles(
apache_beam/examples/dataframe/flight_delays_it_test.py::FlightDelaysTest::test_flight_delays
apache_beam/examples/dataframe/taxiride_it_test.py::TaxirideIT::test_aggregation
apache_beam/examples/dataframe/taxiride_it_test.py::TaxirideIT::test_enrich
<https://ci-beam.apache.org/job/beam_PostCommit_Python39/ws/src/sdks/python/apache_beam/io/fileio.py>:590: BeamDeprecationWarning: options is deprecated since First stable release. References to <pipeline>.options will not be supported
p.options.view_as(GoogleCloudOptions).temp_location or
apache_beam/io/gcp/bigquery_test.py::BigQueryStreamingInsertTransformIntegrationTests::test_multiple_destinations_transform
<https://ci-beam.apache.org/job/beam_PostCommit_Python39/ws/src/sdks/python/apache_beam/io/gcp/bigquery_test.py>:1846: BeamDeprecationWarning: options is deprecated since First stable release. References to <pipeline>.options will not be supported
streaming = self.test_pipeline.options.view_as(StandardOptions).streaming
apache_beam/io/gcp/bigquery_read_it_test.py::ReadTests::test_native_source
<https://ci-beam.apache.org/job/beam_PostCommit_Python39/ws/src/sdks/python/apache_beam/io/gcp/bigquery_read_it_test.py>:171: BeamDeprecationWarning: BigQuerySource is deprecated since 2.25.0. Use ReadFromBigQuery instead.
beam.io.BigQuerySource(query=self.query, use_standard_sql=True)))
apache_beam/io/gcp/big_query_query_to_table_it_test.py::BigQueryQueryToTableIT::test_big_query_new_types_native
apache_beam/io/gcp/big_query_query_to_table_it_test.py::BigQueryQueryToTableIT::test_big_query_standard_sql_kms_key_native
<https://ci-beam.apache.org/job/beam_PostCommit_Python39/ws/src/sdks/python/apache_beam/io/gcp/big_query_query_to_table_pipeline.py>:81: BeamDeprecationWarning: BigQuerySource is deprecated since 2.25.0. Use ReadFromBigQuery instead.
beam.io.BigQuerySource(
apache_beam/io/gcp/big_query_query_to_table_it_test.py::BigQueryQueryToTableIT::test_big_query_new_types_native
apache_beam/io/gcp/big_query_query_to_table_it_test.py::BigQueryQueryToTableIT::test_big_query_standard_sql_kms_key_native
<https://ci-beam.apache.org/job/beam_PostCommit_Python39/ws/src/sdks/python/apache_beam/runners/dataflow/ptransform_overrides.py>:316: BeamDeprecationWarning: BigQuerySink is deprecated since 2.11.0. Use WriteToBigQuery instead.
io.BigQuerySink(
apache_beam/ml/gcp/cloud_dlp_it_test.py::CloudDLPIT::test_deidentification
<https://ci-beam.apache.org/job/beam_PostCommit_Python39/ws/src/sdks/python/apache_beam/ml/gcp/cloud_dlp_it_test.py>:74: FutureWarning: MaskDetectedDetails is experimental.
| MaskDetectedDetails(
apache_beam/ml/gcp/cloud_dlp_it_test.py::CloudDLPIT::test_inspection
<https://ci-beam.apache.org/job/beam_PostCommit_Python39/ws/src/sdks/python/apache_beam/ml/gcp/cloud_dlp_it_test.py>:85: FutureWarning: InspectForDetails is experimental.
| InspectForDetails(
apache_beam/ml/inference/sklearn_inference_it_test.py::SklearnInference::test_sklearn_regression
<https://ci-beam.apache.org/job/beam_PostCommit_Python39/ws/src/sdks/python/apache_beam/examples/inference/sklearn_japanese_housing_regression.py>:128: FutureWarning: SklearnModelHandlerPandas is experimental. No backwards-compatibility guarantees.
model_loader = SklearnModelHandlerPandas(
apache_beam/ml/inference/sklearn_inference_it_test.py::SklearnInference::test_sklearn_regression
<https://ci-beam.apache.org/job/beam_PostCommit_Python39/ws/src/build/gradleenv/-1734967050/lib/python3.9/site-packages/dill/_dill.py>:472: FutureWarning: SklearnModelHandlerPandas is experimental. No backwards-compatibility guarantees.
obj = StockUnpickler.load(self)
apache_beam/io/gcp/bigquery_read_it_test.py::ReadNewTypesTests::test_native_source
<https://ci-beam.apache.org/job/beam_PostCommit_Python39/ws/src/sdks/python/apache_beam/io/gcp/bigquery_read_it_test.py>:646: BeamDeprecationWarning: BigQuerySource is deprecated since 2.25.0. Use ReadFromBigQuery instead.
beam.io.BigQuerySource(query=self.query, use_standard_sql=True)))
apache_beam/io/gcp/bigquery_read_it_test.py::ReadAllBQTests::test_read_queries
<https://ci-beam.apache.org/job/beam_PostCommit_Python39/ws/src/sdks/python/apache_beam/io/gcp/bigquery_read_it_test.py>:761: FutureWarning: ReadAllFromBigQuery is experimental.
| beam.io.ReadAllFromBigQuery())
apache_beam/io/gcp/bigquery_read_it_test.py::ReadAllBQTests::test_read_queries
<https://ci-beam.apache.org/job/beam_PostCommit_Python39/ws/src/sdks/python/apache_beam/io/gcp/bigquery.py>:2947: BeamDeprecationWarning: options is deprecated since First stable release. References to <pipeline>.options will not be supported
job_name = pcoll.pipeline.options.view_as(GoogleCloudOptions).job_name
apache_beam/io/gcp/bigquery_read_it_test.py::ReadAllBQTests::test_read_queries
<https://ci-beam.apache.org/job/beam_PostCommit_Python39/ws/src/sdks/python/apache_beam/io/gcp/bigquery.py>:2948: BeamDeprecationWarning: options is deprecated since First stable release. References to <pipeline>.options will not be supported
project = pcoll.pipeline.options.view_as(GoogleCloudOptions).project
apache_beam/io/gcp/bigquery_read_it_test.py::ReadAllBQTests::test_read_queries
<https://ci-beam.apache.org/job/beam_PostCommit_Python39/ws/src/sdks/python/apache_beam/io/gcp/bigquery.py>:2961: BeamDeprecationWarning: options is deprecated since First stable release. References to <pipeline>.options will not be supported
options=pcoll.pipeline.options,
-- Docs: https://docs.pytest.org/en/stable/how-to/capture-warnings.html
- generated xml file: <https://ci-beam.apache.org/job/beam_PostCommit_Python39/ws/src/sdks/python/pytest_postCommitIT-df-py39.xml> -
=========================== short test summary info ============================
FAILED apache_beam/ml/inference/sklearn_inference_it_test.py::SklearnInference::test_sklearn_mnist_classification
[31m===== [31m[1m1 failed[0m, [32m87 passed[0m, [33m12 skipped[0m, [33m272 warnings[0m[31m in 11785.30s (3:16:25)[0m[31m =====[0m
> Task :sdks:python:test-suites:dataflow:py39:postCommitIT FAILED
FAILURE: Build completed with 2 failures.
1: Task failed with an exception.
-----------
* Where:
Script '<https://ci-beam.apache.org/job/beam_PostCommit_Python39/ws/src/sdks/python/test-suites/direct/common.gradle'> line: 229
* What went wrong:
Execution failed for task ':sdks:python:test-suites:direct:py39:sklearnInferenceTest'.
> Process 'command 'sh'' finished with non-zero exit value 1
* Try:
> Run with --stacktrace option to get the stack trace.
> Run with --info or --debug option to get more log output.
==============================================================================
2: Task failed with an exception.
-----------
* Where:
Script '<https://ci-beam.apache.org/job/beam_PostCommit_Python39/ws/src/sdks/python/test-suites/dataflow/common.gradle'> line: 121
* What went wrong:
Execution failed for task ':sdks:python:test-suites:dataflow:py39:postCommitIT'.
> Process 'command 'sh'' finished with non-zero exit value 1
* Try:
> Run with --stacktrace option to get the stack trace.
> Run with --info or --debug option to get more log output.
==============================================================================
* Get more help at https://help.gradle.org
Deprecated Gradle features were used in this build, making it incompatible with Gradle 8.0.
You can use '--warning-mode all' to show the individual deprecation warnings and determine if they come from your own scripts or plugins.
See https://docs.gradle.org/7.5.1/userguide/command_line_interface.html#sec:command_line_warnings
Execution optimizations have been disabled for 1 invalid unit(s) of work during this build to ensure correctness.
Please consult deprecation warnings for more details.
BUILD FAILED in 3h 21m
222 actionable tasks: 163 executed, 53 from cache, 6 up-to-date
Publishing build scan...
https://gradle.com/s/glwuv3ofhrjts
Build step 'Invoke Gradle script' changed build result to FAILURE
Build step 'Invoke Gradle script' marked build as failure
---------------------------------------------------------------------
To unsubscribe, e-mail: builds-unsubscribe@beam.apache.org
For additional commands, e-mail: builds-help@beam.apache.org
Build failed in Jenkins: beam_PostCommit_Python39 #821
Posted by Apache Jenkins Server <je...@builds.apache.org>.
See <https://ci-beam.apache.org/job/beam_PostCommit_Python39/821/display/redirect?page=changes>
Changes:
[Robert Bradshaw] Allow expansion service to choose pickler.
[Robert Bradshaw] Accept "default" as pickler library.
[Robert Bradshaw] Clarifying comment.
[Heejong Lee] [BEAM-22856] PythonService Beam version compatibility
------------------------------------------
[...truncated 43.71 MB...]
apache_beam/typehints/pandas_type_compatibility_test.py:89
apache_beam/typehints/pandas_type_compatibility_test.py:89
apache_beam/typehints/pandas_type_compatibility_test.py:89
<https://ci-beam.apache.org/job/beam_PostCommit_Python39/ws/src/sdks/python/apache_beam/typehints/pandas_type_compatibility_test.py>:89: FutureWarning: pandas.Int64Index is deprecated and will be removed from pandas in a future version. Use pandas.Index with the appropriate dtype instead.
pd.Int64Index(range(123, 223), name='an_index'),
apache_beam/typehints/pandas_type_compatibility_test.py:90
apache_beam/typehints/pandas_type_compatibility_test.py:90
apache_beam/typehints/pandas_type_compatibility_test.py:90
apache_beam/typehints/pandas_type_compatibility_test.py:90
apache_beam/typehints/pandas_type_compatibility_test.py:90
apache_beam/typehints/pandas_type_compatibility_test.py:90
apache_beam/typehints/pandas_type_compatibility_test.py:90
apache_beam/typehints/pandas_type_compatibility_test.py:90
<https://ci-beam.apache.org/job/beam_PostCommit_Python39/ws/src/sdks/python/apache_beam/typehints/pandas_type_compatibility_test.py>:90: FutureWarning: pandas.Int64Index is deprecated and will be removed from pandas in a future version. Use pandas.Index with the appropriate dtype instead.
pd.Int64Index(range(475, 575), name='another_index'),
apache_beam/dataframe/io_it_test.py: 3 warnings
apache_beam/examples/cookbook/bigquery_tornadoes_it_test.py: 1 warning
apache_beam/examples/dataframe/flight_delays_it_test.py: 1 warning
apache_beam/io/gcp/big_query_query_to_table_it_test.py: 6 warnings
apache_beam/io/gcp/bigquery_read_it_test.py: 7 warnings
apache_beam/io/gcp/bigquery_io_read_it_test.py: 2 warnings
apache_beam/io/gcp/bigquery_json_it_test.py: 3 warnings
<https://ci-beam.apache.org/job/beam_PostCommit_Python39/ws/src/sdks/python/apache_beam/io/gcp/bigquery.py>:2774: BeamDeprecationWarning: options is deprecated since First stable release. References to <pipeline>.options will not be supported
temp_location = pcoll.pipeline.options.view_as(
apache_beam/dataframe/io_it_test.py: 3 warnings
apache_beam/examples/cookbook/bigquery_tornadoes_it_test.py: 1 warning
apache_beam/examples/dataframe/flight_delays_it_test.py: 1 warning
apache_beam/io/gcp/big_query_query_to_table_it_test.py: 6 warnings
apache_beam/io/gcp/bigquery_read_it_test.py: 7 warnings
apache_beam/io/gcp/bigquery_io_read_it_test.py: 2 warnings
apache_beam/io/gcp/bigquery_json_it_test.py: 3 warnings
<https://ci-beam.apache.org/job/beam_PostCommit_Python39/ws/src/sdks/python/apache_beam/io/gcp/bigquery.py>:2776: BeamDeprecationWarning: options is deprecated since First stable release. References to <pipeline>.options will not be supported
job_name = pcoll.pipeline.options.view_as(GoogleCloudOptions).job_name
apache_beam/dataframe/io_it_test.py: 3 warnings
apache_beam/examples/cookbook/bigquery_tornadoes_it_test.py: 1 warning
apache_beam/examples/dataframe/flight_delays_it_test.py: 1 warning
apache_beam/io/gcp/big_query_query_to_table_it_test.py: 6 warnings
apache_beam/io/gcp/bigquery_read_it_test.py: 7 warnings
apache_beam/io/gcp/bigquery_io_read_it_test.py: 2 warnings
apache_beam/io/gcp/bigquery_json_it_test.py: 3 warnings
<https://ci-beam.apache.org/job/beam_PostCommit_Python39/ws/src/sdks/python/apache_beam/io/gcp/bigquery.py>:2800: BeamDeprecationWarning: options is deprecated since First stable release. References to <pipeline>.options will not be supported
pipeline_options=pcoll.pipeline.options,
apache_beam/examples/complete/game/game_stats_it_test.py::GameStatsIT::test_game_stats_it
apache_beam/examples/complete/game/hourly_team_score_it_test.py::HourlyTeamScoreIT::test_hourly_team_score_it
apache_beam/examples/complete/game/leader_board_it_test.py::LeaderBoardIT::test_leader_board_it
apache_beam/io/gcp/bigquery_test.py::PubSubBigQueryIT::test_file_loads
apache_beam/io/gcp/bigquery_test.py::PubSubBigQueryIT::test_streaming_inserts
<https://ci-beam.apache.org/job/beam_PostCommit_Python39/ws/src/sdks/python/apache_beam/io/gcp/tests/utils.py>:63: PendingDeprecationWarning: Client.dataset is deprecated and will be removed in a future version. Use a string like 'my_project.my_dataset' or a cloud.google.bigquery.DatasetReference object, instead.
dataset_ref = client.dataset(unique_dataset_name, project=project)
apache_beam/examples/complete/game/game_stats_it_test.py: 2 warnings
apache_beam/examples/cookbook/bigquery_tornadoes_it_test.py: 1 warning
apache_beam/examples/complete/game/hourly_team_score_it_test.py: 1 warning
apache_beam/examples/complete/game/leader_board_it_test.py: 2 warnings
apache_beam/io/gcp/big_query_query_to_table_it_test.py: 6 warnings
apache_beam/io/gcp/bigquery_write_it_test.py: 4 warnings
apache_beam/io/gcp/bigquery_json_it_test.py: 2 warnings
apache_beam/io/gcp/bigquery_test.py: 6 warnings
apache_beam/io/gcp/bigquery_file_loads_test.py: 3 warnings
<https://ci-beam.apache.org/job/beam_PostCommit_Python39/ws/src/sdks/python/apache_beam/io/gcp/bigquery.py>:2285: BeamDeprecationWarning: options is deprecated since First stable release. References to <pipeline>.options will not be supported
is_streaming_pipeline = p.options.view_as(StandardOptions).streaming
apache_beam/examples/complete/game/game_stats_it_test.py: 2 warnings
apache_beam/examples/cookbook/bigquery_tornadoes_it_test.py: 1 warning
apache_beam/examples/complete/game/hourly_team_score_it_test.py: 1 warning
apache_beam/examples/complete/game/leader_board_it_test.py: 2 warnings
apache_beam/io/gcp/big_query_query_to_table_it_test.py: 6 warnings
apache_beam/io/gcp/bigquery_write_it_test.py: 4 warnings
apache_beam/io/gcp/bigquery_json_it_test.py: 2 warnings
apache_beam/io/gcp/bigquery_test.py: 6 warnings
apache_beam/io/gcp/bigquery_file_loads_test.py: 3 warnings
<https://ci-beam.apache.org/job/beam_PostCommit_Python39/ws/src/sdks/python/apache_beam/io/gcp/bigquery.py>:2291: BeamDeprecationWarning: options is deprecated since First stable release. References to <pipeline>.options will not be supported
experiments = p.options.view_as(DebugOptions).experiments or []
apache_beam/examples/cookbook/bigquery_tornadoes_it_test.py: 1 warning
apache_beam/io/gcp/big_query_query_to_table_it_test.py: 6 warnings
apache_beam/io/gcp/bigquery_write_it_test.py: 4 warnings
apache_beam/io/gcp/bigquery_test.py: 2 warnings
<https://ci-beam.apache.org/job/beam_PostCommit_Python39/ws/src/sdks/python/apache_beam/io/gcp/bigquery.py>:2281: BeamDeprecationWarning: options is deprecated since First stable release. References to <pipeline>.options will not be supported
self.table_reference.projectId = pcoll.pipeline.options.view_as(
apache_beam/examples/cookbook/bigquery_tornadoes_it_test.py: 1 warning
apache_beam/examples/complete/game/hourly_team_score_it_test.py: 1 warning
apache_beam/io/gcp/big_query_query_to_table_it_test.py: 6 warnings
apache_beam/io/gcp/bigquery_write_it_test.py: 3 warnings
apache_beam/io/gcp/bigquery_test.py: 3 warnings
apache_beam/io/gcp/bigquery_file_loads_test.py: 3 warnings
<https://ci-beam.apache.org/job/beam_PostCommit_Python39/ws/src/sdks/python/apache_beam/io/gcp/bigquery_file_loads.py>:1129: BeamDeprecationWarning: options is deprecated since First stable release. References to <pipeline>.options will not be supported
temp_location = p.options.view_as(GoogleCloudOptions).temp_location
apache_beam/examples/cookbook/bigquery_tornadoes_it_test.py: 1 warning
apache_beam/examples/complete/game/hourly_team_score_it_test.py: 1 warning
apache_beam/io/gcp/big_query_query_to_table_it_test.py: 6 warnings
apache_beam/io/gcp/bigquery_write_it_test.py: 3 warnings
apache_beam/io/gcp/bigquery_test.py: 3 warnings
apache_beam/io/gcp/bigquery_file_loads_test.py: 3 warnings
<https://ci-beam.apache.org/job/beam_PostCommit_Python39/ws/src/sdks/python/apache_beam/io/gcp/bigquery_file_loads.py>:1131: BeamDeprecationWarning: options is deprecated since First stable release. References to <pipeline>.options will not be supported
p.options.view_as(GoogleCloudOptions).job_name or 'AUTOMATIC_JOB_NAME')
apache_beam/examples/cookbook/bigquery_tornadoes_it_test.py::BigqueryTornadoesIT::test_bigquery_tornadoes_it
<https://ci-beam.apache.org/job/beam_PostCommit_Python39/ws/src/sdks/python/apache_beam/io/gcp/tests/utils.py>:100: PendingDeprecationWarning: Client.dataset is deprecated and will be removed in a future version. Use a string like 'my_project.my_dataset' or a cloud.google.bigquery.DatasetReference object, instead.
table_ref = client.dataset(dataset_id).table(table_id)
apache_beam/dataframe/io_it_test.py: 2 warnings
apache_beam/io/gcp/bigquery_json_it_test.py: 1 warning
apache_beam/io/gcp/bigquery_read_it_test.py: 9 warnings
<https://ci-beam.apache.org/job/beam_PostCommit_Python39/ws/src/sdks/python/apache_beam/io/gcp/bigquery.py>:2818: BeamDeprecationWarning: options is deprecated since First stable release. References to <pipeline>.options will not be supported
project_id = pcoll.pipeline.options.view_as(GoogleCloudOptions).project
apache_beam/dataframe/io_it_test.py: 2 warnings
apache_beam/io/gcp/bigquery_json_it_test.py: 1 warning
apache_beam/io/gcp/bigquery_read_it_test.py: 9 warnings
<https://ci-beam.apache.org/job/beam_PostCommit_Python39/ws/src/sdks/python/apache_beam/io/gcp/bigquery.py>:2839: BeamDeprecationWarning: options is deprecated since First stable release. References to <pipeline>.options will not be supported
pipeline_options=pcoll.pipeline.options,
apache_beam/examples/dataframe/flight_delays_it_test.py::FlightDelaysTest::test_flight_delays
<https://ci-beam.apache.org/job/beam_PostCommit_Python39/ws/src/sdks/python/apache_beam/examples/dataframe/flight_delays.py>:47: FutureWarning: Dropping of nuisance columns in DataFrame reductions (with 'numeric_only=None') is deprecated; in a future version this will raise TypeError. Select only valid columns before calling the reduction.
return airline_df[at_top_airports].mean()
apache_beam/examples/dataframe/flight_delays_it_test.py::FlightDelaysTest::test_flight_delays
apache_beam/examples/dataframe/taxiride_it_test.py::TaxirideIT::test_aggregation
apache_beam/examples/dataframe/taxiride_it_test.py::TaxirideIT::test_enrich
<https://ci-beam.apache.org/job/beam_PostCommit_Python39/ws/src/sdks/python/apache_beam/dataframe/io.py>:659: FutureWarning: WriteToFiles is experimental.
return pcoll | fileio.WriteToFiles(
apache_beam/examples/dataframe/flight_delays_it_test.py::FlightDelaysTest::test_flight_delays
apache_beam/examples/dataframe/taxiride_it_test.py::TaxirideIT::test_aggregation
apache_beam/examples/dataframe/taxiride_it_test.py::TaxirideIT::test_enrich
<https://ci-beam.apache.org/job/beam_PostCommit_Python39/ws/src/sdks/python/apache_beam/io/fileio.py>:590: BeamDeprecationWarning: options is deprecated since First stable release. References to <pipeline>.options will not be supported
p.options.view_as(GoogleCloudOptions).temp_location or
apache_beam/io/gcp/bigquery_read_it_test.py::ReadTests::test_native_source
<https://ci-beam.apache.org/job/beam_PostCommit_Python39/ws/src/sdks/python/apache_beam/io/gcp/bigquery_read_it_test.py>:171: BeamDeprecationWarning: BigQuerySource is deprecated since 2.25.0. Use ReadFromBigQuery instead.
beam.io.BigQuerySource(query=self.query, use_standard_sql=True)))
apache_beam/io/gcp/bigquery_test.py::BigQueryStreamingInsertTransformIntegrationTests::test_multiple_destinations_transform
<https://ci-beam.apache.org/job/beam_PostCommit_Python39/ws/src/sdks/python/apache_beam/io/gcp/bigquery_test.py>:1846: BeamDeprecationWarning: options is deprecated since First stable release. References to <pipeline>.options will not be supported
streaming = self.test_pipeline.options.view_as(StandardOptions).streaming
apache_beam/ml/gcp/cloud_dlp_it_test.py::CloudDLPIT::test_deidentification
<https://ci-beam.apache.org/job/beam_PostCommit_Python39/ws/src/sdks/python/apache_beam/ml/gcp/cloud_dlp_it_test.py>:74: FutureWarning: MaskDetectedDetails is experimental.
| MaskDetectedDetails(
apache_beam/io/gcp/big_query_query_to_table_it_test.py::BigQueryQueryToTableIT::test_big_query_new_types_native
apache_beam/io/gcp/big_query_query_to_table_it_test.py::BigQueryQueryToTableIT::test_big_query_standard_sql_kms_key_native
<https://ci-beam.apache.org/job/beam_PostCommit_Python39/ws/src/sdks/python/apache_beam/io/gcp/big_query_query_to_table_pipeline.py>:81: BeamDeprecationWarning: BigQuerySource is deprecated since 2.25.0. Use ReadFromBigQuery instead.
beam.io.BigQuerySource(
apache_beam/io/gcp/big_query_query_to_table_it_test.py::BigQueryQueryToTableIT::test_big_query_new_types_native
apache_beam/io/gcp/big_query_query_to_table_it_test.py::BigQueryQueryToTableIT::test_big_query_standard_sql_kms_key_native
<https://ci-beam.apache.org/job/beam_PostCommit_Python39/ws/src/sdks/python/apache_beam/runners/dataflow/ptransform_overrides.py>:316: BeamDeprecationWarning: BigQuerySink is deprecated since 2.11.0. Use WriteToBigQuery instead.
io.BigQuerySink(
apache_beam/ml/gcp/cloud_dlp_it_test.py::CloudDLPIT::test_inspection
<https://ci-beam.apache.org/job/beam_PostCommit_Python39/ws/src/sdks/python/apache_beam/ml/gcp/cloud_dlp_it_test.py>:85: FutureWarning: InspectForDetails is experimental.
| InspectForDetails(
apache_beam/ml/inference/sklearn_inference_it_test.py::SklearnInference::test_sklearn_regression
<https://ci-beam.apache.org/job/beam_PostCommit_Python39/ws/src/sdks/python/apache_beam/examples/inference/sklearn_japanese_housing_regression.py>:128: FutureWarning: SklearnModelHandlerPandas is experimental. No backwards-compatibility guarantees.
model_loader = SklearnModelHandlerPandas(
apache_beam/ml/inference/sklearn_inference_it_test.py::SklearnInference::test_sklearn_regression
<https://ci-beam.apache.org/job/beam_PostCommit_Python39/ws/src/build/gradleenv/-1734967050/lib/python3.9/site-packages/dill/_dill.py>:472: FutureWarning: SklearnModelHandlerPandas is experimental. No backwards-compatibility guarantees.
obj = StockUnpickler.load(self)
apache_beam/io/gcp/bigquery_read_it_test.py::ReadNewTypesTests::test_native_source
<https://ci-beam.apache.org/job/beam_PostCommit_Python39/ws/src/sdks/python/apache_beam/io/gcp/bigquery_read_it_test.py>:646: BeamDeprecationWarning: BigQuerySource is deprecated since 2.25.0. Use ReadFromBigQuery instead.
beam.io.BigQuerySource(query=self.query, use_standard_sql=True)))
apache_beam/io/gcp/bigquery_read_it_test.py::ReadAllBQTests::test_read_queries
<https://ci-beam.apache.org/job/beam_PostCommit_Python39/ws/src/sdks/python/apache_beam/io/gcp/bigquery_read_it_test.py>:761: FutureWarning: ReadAllFromBigQuery is experimental.
| beam.io.ReadAllFromBigQuery())
apache_beam/io/gcp/bigquery_read_it_test.py::ReadAllBQTests::test_read_queries
<https://ci-beam.apache.org/job/beam_PostCommit_Python39/ws/src/sdks/python/apache_beam/io/gcp/bigquery.py>:2947: BeamDeprecationWarning: options is deprecated since First stable release. References to <pipeline>.options will not be supported
job_name = pcoll.pipeline.options.view_as(GoogleCloudOptions).job_name
apache_beam/io/gcp/bigquery_read_it_test.py::ReadAllBQTests::test_read_queries
<https://ci-beam.apache.org/job/beam_PostCommit_Python39/ws/src/sdks/python/apache_beam/io/gcp/bigquery.py>:2948: BeamDeprecationWarning: options is deprecated since First stable release. References to <pipeline>.options will not be supported
project = pcoll.pipeline.options.view_as(GoogleCloudOptions).project
apache_beam/io/gcp/bigquery_read_it_test.py::ReadAllBQTests::test_read_queries
<https://ci-beam.apache.org/job/beam_PostCommit_Python39/ws/src/sdks/python/apache_beam/io/gcp/bigquery.py>:2961: BeamDeprecationWarning: options is deprecated since First stable release. References to <pipeline>.options will not be supported
options=pcoll.pipeline.options,
-- Docs: https://docs.pytest.org/en/stable/how-to/capture-warnings.html
- generated xml file: <https://ci-beam.apache.org/job/beam_PostCommit_Python39/ws/src/sdks/python/pytest_postCommitIT-df-py39.xml> -
=========================== short test summary info ============================
FAILED apache_beam/ml/inference/sklearn_inference_it_test.py::SklearnInference::test_sklearn_mnist_classification
[31m===== [31m[1m1 failed[0m, [32m87 passed[0m, [33m12 skipped[0m, [33m272 warnings[0m[31m in 12124.77s (3:22:04)[0m[31m =====[0m
> Task :sdks:python:test-suites:dataflow:py39:postCommitIT FAILED
FAILURE: Build completed with 2 failures.
1: Task failed with an exception.
-----------
* Where:
Script '<https://ci-beam.apache.org/job/beam_PostCommit_Python39/ws/src/sdks/python/test-suites/direct/common.gradle'> line: 229
* What went wrong:
Execution failed for task ':sdks:python:test-suites:direct:py39:sklearnInferenceTest'.
> Process 'command 'sh'' finished with non-zero exit value 1
* Try:
> Run with --stacktrace option to get the stack trace.
> Run with --info or --debug option to get more log output.
> Run with --scan to get full insights.
==============================================================================
2: Task failed with an exception.
-----------
* Where:
Script '<https://ci-beam.apache.org/job/beam_PostCommit_Python39/ws/src/sdks/python/test-suites/dataflow/common.gradle'> line: 121
* What went wrong:
Execution failed for task ':sdks:python:test-suites:dataflow:py39:postCommitIT'.
> Process 'command 'sh'' finished with non-zero exit value 1
* Try:
> Run with --stacktrace option to get the stack trace.
> Run with --info or --debug option to get more log output.
> Run with --scan to get full insights.
==============================================================================
* Get more help at https://help.gradle.org
Deprecated Gradle features were used in this build, making it incompatible with Gradle 8.0.
You can use '--warning-mode all' to show the individual deprecation warnings and determine if they come from your own scripts or plugins.
See https://docs.gradle.org/7.4/userguide/command_line_interface.html#sec:command_line_warnings
Execution optimizations have been disabled for 1 invalid unit(s) of work during this build to ensure correctness.
Please consult deprecation warnings for more details.
BUILD FAILED in 3h 24m 31s
222 actionable tasks: 152 executed, 64 from cache, 6 up-to-date
Publishing build scan...
https://gradle.com/s/geahgozdtpwnq
Build step 'Invoke Gradle script' changed build result to FAILURE
Build step 'Invoke Gradle script' marked build as failure
---------------------------------------------------------------------
To unsubscribe, e-mail: builds-unsubscribe@beam.apache.org
For additional commands, e-mail: builds-help@beam.apache.org
Build failed in Jenkins: beam_PostCommit_Python39 #820
Posted by Apache Jenkins Server <je...@builds.apache.org>.
See <https://ci-beam.apache.org/job/beam_PostCommit_Python39/820/display/redirect?page=changes>
Changes:
[Brian Hulette] Use typehints in benchmark utilities
[oleg.borisevich] fixing condition for db index creation
[noreply] Allow users to pass classloader to dynamically load JDBC drivers.
[noreply] Fix withCheckStopReadingFn to not cause the pipeline to crash (#22962)
[noreply] Inference benchmark tests (#21738)
[noreply] [Go SDK]: Add support for Google Cloud Profiler for pipelines (#22824)
[noreply] Listen to window messages to switch SDK and to load content (#22959)
[noreply] Disable singleIterate (#23042)
------------------------------------------
[...truncated 43.54 MB...]
apache_beam/typehints/pandas_type_compatibility_test.py:89
apache_beam/typehints/pandas_type_compatibility_test.py:89
apache_beam/typehints/pandas_type_compatibility_test.py:89
<https://ci-beam.apache.org/job/beam_PostCommit_Python39/ws/src/sdks/python/apache_beam/typehints/pandas_type_compatibility_test.py>:89: FutureWarning: pandas.Int64Index is deprecated and will be removed from pandas in a future version. Use pandas.Index with the appropriate dtype instead.
pd.Int64Index(range(123, 223), name='an_index'),
apache_beam/typehints/pandas_type_compatibility_test.py:90
apache_beam/typehints/pandas_type_compatibility_test.py:90
apache_beam/typehints/pandas_type_compatibility_test.py:90
apache_beam/typehints/pandas_type_compatibility_test.py:90
apache_beam/typehints/pandas_type_compatibility_test.py:90
apache_beam/typehints/pandas_type_compatibility_test.py:90
apache_beam/typehints/pandas_type_compatibility_test.py:90
apache_beam/typehints/pandas_type_compatibility_test.py:90
<https://ci-beam.apache.org/job/beam_PostCommit_Python39/ws/src/sdks/python/apache_beam/typehints/pandas_type_compatibility_test.py>:90: FutureWarning: pandas.Int64Index is deprecated and will be removed from pandas in a future version. Use pandas.Index with the appropriate dtype instead.
pd.Int64Index(range(475, 575), name='another_index'),
apache_beam/dataframe/io_it_test.py: 3 warnings
apache_beam/examples/cookbook/bigquery_tornadoes_it_test.py: 1 warning
apache_beam/examples/dataframe/flight_delays_it_test.py: 1 warning
apache_beam/io/gcp/big_query_query_to_table_it_test.py: 6 warnings
apache_beam/io/gcp/bigquery_io_read_it_test.py: 2 warnings
apache_beam/io/gcp/bigquery_read_it_test.py: 7 warnings
apache_beam/io/gcp/bigquery_json_it_test.py: 3 warnings
<https://ci-beam.apache.org/job/beam_PostCommit_Python39/ws/src/sdks/python/apache_beam/io/gcp/bigquery.py>:2774: BeamDeprecationWarning: options is deprecated since First stable release. References to <pipeline>.options will not be supported
temp_location = pcoll.pipeline.options.view_as(
apache_beam/dataframe/io_it_test.py: 3 warnings
apache_beam/examples/cookbook/bigquery_tornadoes_it_test.py: 1 warning
apache_beam/examples/dataframe/flight_delays_it_test.py: 1 warning
apache_beam/io/gcp/big_query_query_to_table_it_test.py: 6 warnings
apache_beam/io/gcp/bigquery_io_read_it_test.py: 2 warnings
apache_beam/io/gcp/bigquery_read_it_test.py: 7 warnings
apache_beam/io/gcp/bigquery_json_it_test.py: 3 warnings
<https://ci-beam.apache.org/job/beam_PostCommit_Python39/ws/src/sdks/python/apache_beam/io/gcp/bigquery.py>:2776: BeamDeprecationWarning: options is deprecated since First stable release. References to <pipeline>.options will not be supported
job_name = pcoll.pipeline.options.view_as(GoogleCloudOptions).job_name
apache_beam/dataframe/io_it_test.py: 3 warnings
apache_beam/examples/cookbook/bigquery_tornadoes_it_test.py: 1 warning
apache_beam/examples/dataframe/flight_delays_it_test.py: 1 warning
apache_beam/io/gcp/big_query_query_to_table_it_test.py: 6 warnings
apache_beam/io/gcp/bigquery_io_read_it_test.py: 2 warnings
apache_beam/io/gcp/bigquery_read_it_test.py: 7 warnings
apache_beam/io/gcp/bigquery_json_it_test.py: 3 warnings
<https://ci-beam.apache.org/job/beam_PostCommit_Python39/ws/src/sdks/python/apache_beam/io/gcp/bigquery.py>:2800: BeamDeprecationWarning: options is deprecated since First stable release. References to <pipeline>.options will not be supported
pipeline_options=pcoll.pipeline.options,
apache_beam/examples/complete/game/game_stats_it_test.py::GameStatsIT::test_game_stats_it
apache_beam/examples/complete/game/hourly_team_score_it_test.py::HourlyTeamScoreIT::test_hourly_team_score_it
apache_beam/examples/complete/game/leader_board_it_test.py::LeaderBoardIT::test_leader_board_it
apache_beam/io/gcp/bigquery_test.py::PubSubBigQueryIT::test_file_loads
apache_beam/io/gcp/bigquery_test.py::PubSubBigQueryIT::test_streaming_inserts
<https://ci-beam.apache.org/job/beam_PostCommit_Python39/ws/src/sdks/python/apache_beam/io/gcp/tests/utils.py>:63: PendingDeprecationWarning: Client.dataset is deprecated and will be removed in a future version. Use a string like 'my_project.my_dataset' or a cloud.google.bigquery.DatasetReference object, instead.
dataset_ref = client.dataset(unique_dataset_name, project=project)
apache_beam/examples/complete/game/game_stats_it_test.py: 2 warnings
apache_beam/examples/cookbook/bigquery_tornadoes_it_test.py: 1 warning
apache_beam/examples/complete/game/hourly_team_score_it_test.py: 1 warning
apache_beam/io/gcp/big_query_query_to_table_it_test.py: 6 warnings
apache_beam/examples/complete/game/leader_board_it_test.py: 2 warnings
apache_beam/io/gcp/bigquery_write_it_test.py: 4 warnings
apache_beam/io/gcp/bigquery_json_it_test.py: 2 warnings
apache_beam/io/gcp/bigquery_test.py: 6 warnings
apache_beam/io/gcp/bigquery_file_loads_test.py: 3 warnings
<https://ci-beam.apache.org/job/beam_PostCommit_Python39/ws/src/sdks/python/apache_beam/io/gcp/bigquery.py>:2285: BeamDeprecationWarning: options is deprecated since First stable release. References to <pipeline>.options will not be supported
is_streaming_pipeline = p.options.view_as(StandardOptions).streaming
apache_beam/examples/complete/game/game_stats_it_test.py: 2 warnings
apache_beam/examples/cookbook/bigquery_tornadoes_it_test.py: 1 warning
apache_beam/examples/complete/game/hourly_team_score_it_test.py: 1 warning
apache_beam/io/gcp/big_query_query_to_table_it_test.py: 6 warnings
apache_beam/examples/complete/game/leader_board_it_test.py: 2 warnings
apache_beam/io/gcp/bigquery_write_it_test.py: 4 warnings
apache_beam/io/gcp/bigquery_json_it_test.py: 2 warnings
apache_beam/io/gcp/bigquery_test.py: 6 warnings
apache_beam/io/gcp/bigquery_file_loads_test.py: 3 warnings
<https://ci-beam.apache.org/job/beam_PostCommit_Python39/ws/src/sdks/python/apache_beam/io/gcp/bigquery.py>:2291: BeamDeprecationWarning: options is deprecated since First stable release. References to <pipeline>.options will not be supported
experiments = p.options.view_as(DebugOptions).experiments or []
apache_beam/dataframe/io_it_test.py: 2 warnings
apache_beam/io/gcp/bigquery_json_it_test.py: 1 warning
apache_beam/io/gcp/bigquery_read_it_test.py: 9 warnings
<https://ci-beam.apache.org/job/beam_PostCommit_Python39/ws/src/sdks/python/apache_beam/io/gcp/bigquery.py>:2818: BeamDeprecationWarning: options is deprecated since First stable release. References to <pipeline>.options will not be supported
project_id = pcoll.pipeline.options.view_as(GoogleCloudOptions).project
apache_beam/dataframe/io_it_test.py: 2 warnings
apache_beam/io/gcp/bigquery_json_it_test.py: 1 warning
apache_beam/io/gcp/bigquery_read_it_test.py: 9 warnings
<https://ci-beam.apache.org/job/beam_PostCommit_Python39/ws/src/sdks/python/apache_beam/io/gcp/bigquery.py>:2839: BeamDeprecationWarning: options is deprecated since First stable release. References to <pipeline>.options will not be supported
pipeline_options=pcoll.pipeline.options,
apache_beam/examples/cookbook/bigquery_tornadoes_it_test.py: 1 warning
apache_beam/io/gcp/big_query_query_to_table_it_test.py: 6 warnings
apache_beam/io/gcp/bigquery_write_it_test.py: 4 warnings
apache_beam/io/gcp/bigquery_test.py: 2 warnings
<https://ci-beam.apache.org/job/beam_PostCommit_Python39/ws/src/sdks/python/apache_beam/io/gcp/bigquery.py>:2281: BeamDeprecationWarning: options is deprecated since First stable release. References to <pipeline>.options will not be supported
self.table_reference.projectId = pcoll.pipeline.options.view_as(
apache_beam/examples/cookbook/bigquery_tornadoes_it_test.py: 1 warning
apache_beam/examples/complete/game/hourly_team_score_it_test.py: 1 warning
apache_beam/io/gcp/big_query_query_to_table_it_test.py: 6 warnings
apache_beam/io/gcp/bigquery_write_it_test.py: 3 warnings
apache_beam/io/gcp/bigquery_test.py: 3 warnings
apache_beam/io/gcp/bigquery_file_loads_test.py: 3 warnings
<https://ci-beam.apache.org/job/beam_PostCommit_Python39/ws/src/sdks/python/apache_beam/io/gcp/bigquery_file_loads.py>:1129: BeamDeprecationWarning: options is deprecated since First stable release. References to <pipeline>.options will not be supported
temp_location = p.options.view_as(GoogleCloudOptions).temp_location
apache_beam/examples/cookbook/bigquery_tornadoes_it_test.py: 1 warning
apache_beam/examples/complete/game/hourly_team_score_it_test.py: 1 warning
apache_beam/io/gcp/big_query_query_to_table_it_test.py: 6 warnings
apache_beam/io/gcp/bigquery_write_it_test.py: 3 warnings
apache_beam/io/gcp/bigquery_test.py: 3 warnings
apache_beam/io/gcp/bigquery_file_loads_test.py: 3 warnings
<https://ci-beam.apache.org/job/beam_PostCommit_Python39/ws/src/sdks/python/apache_beam/io/gcp/bigquery_file_loads.py>:1131: BeamDeprecationWarning: options is deprecated since First stable release. References to <pipeline>.options will not be supported
p.options.view_as(GoogleCloudOptions).job_name or 'AUTOMATIC_JOB_NAME')
apache_beam/examples/cookbook/bigquery_tornadoes_it_test.py::BigqueryTornadoesIT::test_bigquery_tornadoes_it
<https://ci-beam.apache.org/job/beam_PostCommit_Python39/ws/src/sdks/python/apache_beam/io/gcp/tests/utils.py>:100: PendingDeprecationWarning: Client.dataset is deprecated and will be removed in a future version. Use a string like 'my_project.my_dataset' or a cloud.google.bigquery.DatasetReference object, instead.
table_ref = client.dataset(dataset_id).table(table_id)
apache_beam/examples/dataframe/flight_delays_it_test.py::FlightDelaysTest::test_flight_delays
<https://ci-beam.apache.org/job/beam_PostCommit_Python39/ws/src/sdks/python/apache_beam/examples/dataframe/flight_delays.py>:47: FutureWarning: Dropping of nuisance columns in DataFrame reductions (with 'numeric_only=None') is deprecated; in a future version this will raise TypeError. Select only valid columns before calling the reduction.
return airline_df[at_top_airports].mean()
apache_beam/examples/dataframe/flight_delays_it_test.py::FlightDelaysTest::test_flight_delays
apache_beam/examples/dataframe/taxiride_it_test.py::TaxirideIT::test_aggregation
apache_beam/examples/dataframe/taxiride_it_test.py::TaxirideIT::test_enrich
<https://ci-beam.apache.org/job/beam_PostCommit_Python39/ws/src/sdks/python/apache_beam/dataframe/io.py>:659: FutureWarning: WriteToFiles is experimental.
return pcoll | fileio.WriteToFiles(
apache_beam/examples/dataframe/flight_delays_it_test.py::FlightDelaysTest::test_flight_delays
apache_beam/examples/dataframe/taxiride_it_test.py::TaxirideIT::test_aggregation
apache_beam/examples/dataframe/taxiride_it_test.py::TaxirideIT::test_enrich
<https://ci-beam.apache.org/job/beam_PostCommit_Python39/ws/src/sdks/python/apache_beam/io/fileio.py>:590: BeamDeprecationWarning: options is deprecated since First stable release. References to <pipeline>.options will not be supported
p.options.view_as(GoogleCloudOptions).temp_location or
apache_beam/io/gcp/bigquery_test.py::BigQueryStreamingInsertTransformIntegrationTests::test_multiple_destinations_transform
<https://ci-beam.apache.org/job/beam_PostCommit_Python39/ws/src/sdks/python/apache_beam/io/gcp/bigquery_test.py>:1846: BeamDeprecationWarning: options is deprecated since First stable release. References to <pipeline>.options will not be supported
streaming = self.test_pipeline.options.view_as(StandardOptions).streaming
apache_beam/io/gcp/bigquery_read_it_test.py::ReadTests::test_native_source
<https://ci-beam.apache.org/job/beam_PostCommit_Python39/ws/src/sdks/python/apache_beam/io/gcp/bigquery_read_it_test.py>:171: BeamDeprecationWarning: BigQuerySource is deprecated since 2.25.0. Use ReadFromBigQuery instead.
beam.io.BigQuerySource(query=self.query, use_standard_sql=True)))
apache_beam/ml/gcp/cloud_dlp_it_test.py::CloudDLPIT::test_deidentification
<https://ci-beam.apache.org/job/beam_PostCommit_Python39/ws/src/sdks/python/apache_beam/ml/gcp/cloud_dlp_it_test.py>:74: FutureWarning: MaskDetectedDetails is experimental.
| MaskDetectedDetails(
apache_beam/io/gcp/big_query_query_to_table_it_test.py::BigQueryQueryToTableIT::test_big_query_new_types_native
apache_beam/io/gcp/big_query_query_to_table_it_test.py::BigQueryQueryToTableIT::test_big_query_standard_sql_kms_key_native
<https://ci-beam.apache.org/job/beam_PostCommit_Python39/ws/src/sdks/python/apache_beam/io/gcp/big_query_query_to_table_pipeline.py>:81: BeamDeprecationWarning: BigQuerySource is deprecated since 2.25.0. Use ReadFromBigQuery instead.
beam.io.BigQuerySource(
apache_beam/io/gcp/big_query_query_to_table_it_test.py::BigQueryQueryToTableIT::test_big_query_new_types_native
apache_beam/io/gcp/big_query_query_to_table_it_test.py::BigQueryQueryToTableIT::test_big_query_standard_sql_kms_key_native
<https://ci-beam.apache.org/job/beam_PostCommit_Python39/ws/src/sdks/python/apache_beam/runners/dataflow/ptransform_overrides.py>:316: BeamDeprecationWarning: BigQuerySink is deprecated since 2.11.0. Use WriteToBigQuery instead.
io.BigQuerySink(
apache_beam/ml/gcp/cloud_dlp_it_test.py::CloudDLPIT::test_inspection
<https://ci-beam.apache.org/job/beam_PostCommit_Python39/ws/src/sdks/python/apache_beam/ml/gcp/cloud_dlp_it_test.py>:85: FutureWarning: InspectForDetails is experimental.
| InspectForDetails(
apache_beam/ml/inference/sklearn_inference_it_test.py::SklearnInference::test_sklearn_regression
<https://ci-beam.apache.org/job/beam_PostCommit_Python39/ws/src/sdks/python/apache_beam/examples/inference/sklearn_japanese_housing_regression.py>:128: FutureWarning: SklearnModelHandlerPandas is experimental. No backwards-compatibility guarantees.
model_loader = SklearnModelHandlerPandas(
apache_beam/ml/inference/sklearn_inference_it_test.py::SklearnInference::test_sklearn_regression
<https://ci-beam.apache.org/job/beam_PostCommit_Python39/ws/src/build/gradleenv/-1734967050/lib/python3.9/site-packages/dill/_dill.py>:472: FutureWarning: SklearnModelHandlerPandas is experimental. No backwards-compatibility guarantees.
obj = StockUnpickler.load(self)
apache_beam/io/gcp/bigquery_read_it_test.py::ReadNewTypesTests::test_native_source
<https://ci-beam.apache.org/job/beam_PostCommit_Python39/ws/src/sdks/python/apache_beam/io/gcp/bigquery_read_it_test.py>:646: BeamDeprecationWarning: BigQuerySource is deprecated since 2.25.0. Use ReadFromBigQuery instead.
beam.io.BigQuerySource(query=self.query, use_standard_sql=True)))
apache_beam/io/gcp/bigquery_read_it_test.py::ReadAllBQTests::test_read_queries
<https://ci-beam.apache.org/job/beam_PostCommit_Python39/ws/src/sdks/python/apache_beam/io/gcp/bigquery_read_it_test.py>:761: FutureWarning: ReadAllFromBigQuery is experimental.
| beam.io.ReadAllFromBigQuery())
apache_beam/io/gcp/bigquery_read_it_test.py::ReadAllBQTests::test_read_queries
<https://ci-beam.apache.org/job/beam_PostCommit_Python39/ws/src/sdks/python/apache_beam/io/gcp/bigquery.py>:2947: BeamDeprecationWarning: options is deprecated since First stable release. References to <pipeline>.options will not be supported
job_name = pcoll.pipeline.options.view_as(GoogleCloudOptions).job_name
apache_beam/io/gcp/bigquery_read_it_test.py::ReadAllBQTests::test_read_queries
<https://ci-beam.apache.org/job/beam_PostCommit_Python39/ws/src/sdks/python/apache_beam/io/gcp/bigquery.py>:2948: BeamDeprecationWarning: options is deprecated since First stable release. References to <pipeline>.options will not be supported
project = pcoll.pipeline.options.view_as(GoogleCloudOptions).project
apache_beam/io/gcp/bigquery_read_it_test.py::ReadAllBQTests::test_read_queries
<https://ci-beam.apache.org/job/beam_PostCommit_Python39/ws/src/sdks/python/apache_beam/io/gcp/bigquery.py>:2961: BeamDeprecationWarning: options is deprecated since First stable release. References to <pipeline>.options will not be supported
options=pcoll.pipeline.options,
-- Docs: https://docs.pytest.org/en/stable/how-to/capture-warnings.html
- generated xml file: <https://ci-beam.apache.org/job/beam_PostCommit_Python39/ws/src/sdks/python/pytest_postCommitIT-df-py39.xml> -
=========================== short test summary info ============================
FAILED apache_beam/ml/inference/sklearn_inference_it_test.py::SklearnInference::test_sklearn_mnist_classification
[31m===== [31m[1m1 failed[0m, [32m87 passed[0m, [33m12 skipped[0m, [33m272 warnings[0m[31m in 12012.52s (3:20:12)[0m[31m =====[0m
> Task :sdks:python:test-suites:dataflow:py39:postCommitIT FAILED
FAILURE: Build completed with 2 failures.
1: Task failed with an exception.
-----------
* Where:
Script '<https://ci-beam.apache.org/job/beam_PostCommit_Python39/ws/src/sdks/python/test-suites/direct/common.gradle'> line: 229
* What went wrong:
Execution failed for task ':sdks:python:test-suites:direct:py39:sklearnInferenceTest'.
> Process 'command 'sh'' finished with non-zero exit value 1
* Try:
> Run with --stacktrace option to get the stack trace.
> Run with --info or --debug option to get more log output.
> Run with --scan to get full insights.
==============================================================================
2: Task failed with an exception.
-----------
* Where:
Script '<https://ci-beam.apache.org/job/beam_PostCommit_Python39/ws/src/sdks/python/test-suites/dataflow/common.gradle'> line: 121
* What went wrong:
Execution failed for task ':sdks:python:test-suites:dataflow:py39:postCommitIT'.
> Process 'command 'sh'' finished with non-zero exit value 1
* Try:
> Run with --stacktrace option to get the stack trace.
> Run with --info or --debug option to get more log output.
> Run with --scan to get full insights.
==============================================================================
* Get more help at https://help.gradle.org
Deprecated Gradle features were used in this build, making it incompatible with Gradle 8.0.
You can use '--warning-mode all' to show the individual deprecation warnings and determine if they come from your own scripts or plugins.
See https://docs.gradle.org/7.4/userguide/command_line_interface.html#sec:command_line_warnings
Execution optimizations have been disabled for 1 invalid unit(s) of work during this build to ensure correctness.
Please consult deprecation warnings for more details.
BUILD FAILED in 3h 22m 30s
222 actionable tasks: 152 executed, 64 from cache, 6 up-to-date
Publishing build scan...
https://gradle.com/s/hrqsnja6fqn32
Build step 'Invoke Gradle script' changed build result to FAILURE
Build step 'Invoke Gradle script' marked build as failure
---------------------------------------------------------------------
To unsubscribe, e-mail: builds-unsubscribe@beam.apache.org
For additional commands, e-mail: builds-help@beam.apache.org