You are viewing a plain text version of this content. The canonical link for it is here.
Posted to commits@beam.apache.org by Apache Jenkins Server <je...@builds.apache.org> on 2018/09/03 00:19:25 UTC

Build failed in Jenkins: beam_PerformanceTests_XmlIOIT_HDFS #611

See <https://builds.apache.org/job/beam_PerformanceTests_XmlIOIT_HDFS/611/display/redirect>

------------------------------------------
Started by timer
[EnvInject] - Loading node environment variables.
Building remotely on beam10 (beam) in workspace <https://builds.apache.org/job/beam_PerformanceTests_XmlIOIT_HDFS/ws/>
 > git rev-parse --is-inside-work-tree # timeout=10
Fetching changes from the remote Git repository
 > git config remote.origin.url https://github.com/apache/beam.git # timeout=10
Fetching upstream changes from https://github.com/apache/beam.git
 > git --version # timeout=10
 > git fetch --tags --progress https://github.com/apache/beam.git +refs/heads/*:refs/remotes/origin/* +refs/pull/${ghprbPullId}/*:refs/remotes/origin/pr/${ghprbPullId}/*
 > git rev-parse origin/master^{commit} # timeout=10
Checking out Revision 44f21ece0d6247fbd9a7b94204287bacc1a0f199 (origin/master)
 > git config core.sparsecheckout # timeout=10
 > git checkout -f 44f21ece0d6247fbd9a7b94204287bacc1a0f199
Commit message: "Merge pull request #6322: [BEAM-5283] Add Jenkins script to Python Flink Portable compatibility matrix tests"
 > git rev-list --no-walk 44f21ece0d6247fbd9a7b94204287bacc1a0f199 # timeout=10
Cleaning workspace
 > git rev-parse --verify HEAD # timeout=10
Resetting working tree
 > git reset --hard # timeout=10
 > git clean -fdx # timeout=10
[EnvInject] - Executing scripts and injecting environment variables after the SCM step.
[EnvInject] - Injecting as environment variables the properties content 
SPARK_LOCAL_IP=127.0.0.1

[EnvInject] - Variables injected successfully.
[beam_PerformanceTests_XmlIOIT_HDFS] $ /bin/bash -xe /tmp/jenkins6897661432894667566.sh
+ gcloud container clusters get-credentials io-datastores --zone=us-central1-a --verbosity=debug
DEBUG: Running [gcloud.container.clusters.get-credentials] with arguments: [--verbosity: "debug", --zone: "us-central1-a", NAME: "io-datastores"]
Fetching cluster endpoint and auth data.
DEBUG: Saved kubeconfig to /home/jenkins/.kube/config
kubeconfig entry generated for io-datastores.
INFO: Display format "default".
DEBUG: SDK update checks are disabled.
[beam_PerformanceTests_XmlIOIT_HDFS] $ /bin/bash -xe /tmp/jenkins1225189599494617142.sh
+ cp /home/jenkins/.kube/config <https://builds.apache.org/job/beam_PerformanceTests_XmlIOIT_HDFS/ws/config-beam-performancetests-xmlioit-hdfs-611>
[beam_PerformanceTests_XmlIOIT_HDFS] $ /bin/bash -xe /tmp/jenkins198770524259563459.sh
+ kubectl --kubeconfig=<https://builds.apache.org/job/beam_PerformanceTests_XmlIOIT_HDFS/ws/config-beam-performancetests-xmlioit-hdfs-611> create namespace beam-performancetests-xmlioit-hdfs-611
namespace "beam-performancetests-xmlioit-hdfs-611" created
[beam_PerformanceTests_XmlIOIT_HDFS] $ /bin/bash -xe /tmp/jenkins6842437771545887429.sh
++ kubectl config current-context
+ kubectl --kubeconfig=<https://builds.apache.org/job/beam_PerformanceTests_XmlIOIT_HDFS/ws/config-beam-performancetests-xmlioit-hdfs-611> config set-context gke_apache-beam-testing_us-central1-a_io-datastores --namespace=beam-performancetests-xmlioit-hdfs-611
Context "gke_apache-beam-testing_us-central1-a_io-datastores" modified.
[beam_PerformanceTests_XmlIOIT_HDFS] $ /bin/bash -xe /tmp/jenkins3786852810145439217.sh
+ rm -rf <https://builds.apache.org/job/beam_PerformanceTests_XmlIOIT_HDFS/ws/PerfKitBenchmarker>
[beam_PerformanceTests_XmlIOIT_HDFS] $ /bin/bash -xe /tmp/jenkins3405794387652801058.sh
+ rm -rf <https://builds.apache.org/job/beam_PerformanceTests_XmlIOIT_HDFS/ws/env/.beam_env>
[beam_PerformanceTests_XmlIOIT_HDFS] $ /bin/bash -xe /tmp/jenkins4240023888254696523.sh
+ rm -rf <https://builds.apache.org/job/beam_PerformanceTests_XmlIOIT_HDFS/ws/env/.perfkit_env>
[beam_PerformanceTests_XmlIOIT_HDFS] $ /bin/bash -xe /tmp/jenkins1416476213355808649.sh
+ virtualenv <https://builds.apache.org/job/beam_PerformanceTests_XmlIOIT_HDFS/ws/env/.beam_env> --system-site-packages
New python executable in <https://builds.apache.org/job/beam_PerformanceTests_XmlIOIT_HDFS/ws/env/.beam_env/bin/python2>
Also creating executable in <https://builds.apache.org/job/beam_PerformanceTests_XmlIOIT_HDFS/ws/env/.beam_env/bin/python>
Installing setuptools, pkg_resources, pip, wheel...done.
Running virtualenv with interpreter /usr/bin/python2
[beam_PerformanceTests_XmlIOIT_HDFS] $ /bin/bash -xe /tmp/jenkins2941050220887165593.sh
+ virtualenv <https://builds.apache.org/job/beam_PerformanceTests_XmlIOIT_HDFS/ws/env/.perfkit_env> --system-site-packages
New python executable in <https://builds.apache.org/job/beam_PerformanceTests_XmlIOIT_HDFS/ws/env/.perfkit_env/bin/python2>
Also creating executable in <https://builds.apache.org/job/beam_PerformanceTests_XmlIOIT_HDFS/ws/env/.perfkit_env/bin/python>
Installing setuptools, pkg_resources, pip, wheel...done.
Running virtualenv with interpreter /usr/bin/python2
[beam_PerformanceTests_XmlIOIT_HDFS] $ /bin/bash -xe /tmp/jenkins9115446455096121941.sh
+ <https://builds.apache.org/job/beam_PerformanceTests_XmlIOIT_HDFS/ws/env/.beam_env/bin/pip> install --upgrade setuptools pip grpcio-tools==1.3.5
Requirement already up-to-date: setuptools in ./env/.beam_env/lib/python2.7/site-packages (40.2.0)
Requirement already up-to-date: pip in ./env/.beam_env/lib/python2.7/site-packages (18.0)
Collecting grpcio-tools==1.3.5
  Using cached https://files.pythonhosted.org/packages/05/f6/0296e29b1bac6f85d2a8556d48adf825307f73109a3c2c17fb734292db0a/grpcio_tools-1.3.5-cp27-cp27mu-manylinux1_x86_64.whl
Requirement already satisfied, skipping upgrade: grpcio>=1.3.5 in /home/jenkins/.local/lib/python2.7/site-packages (from grpcio-tools==1.3.5) (1.13.0)
Requirement already satisfied, skipping upgrade: protobuf>=3.2.0 in /home/jenkins/.local/lib/python2.7/site-packages (from grpcio-tools==1.3.5) (3.6.0)
Requirement already satisfied, skipping upgrade: six>=1.5.2 in /usr/local/lib/python2.7/dist-packages (from grpcio>=1.3.5->grpcio-tools==1.3.5) (1.11.0)
Requirement already satisfied, skipping upgrade: enum34>=1.0.4 in /usr/local/lib/python2.7/dist-packages (from grpcio>=1.3.5->grpcio-tools==1.3.5) (1.1.6)
Requirement already satisfied, skipping upgrade: futures>=2.2.0 in /home/jenkins/.local/lib/python2.7/site-packages (from grpcio>=1.3.5->grpcio-tools==1.3.5) (3.2.0)
Installing collected packages: grpcio-tools
Successfully installed grpcio-tools-1.3.5
[beam_PerformanceTests_XmlIOIT_HDFS] $ /bin/bash -xe /tmp/jenkins569568039029927091.sh
+ <https://builds.apache.org/job/beam_PerformanceTests_XmlIOIT_HDFS/ws/env/.perfkit_env/bin/pip> install --upgrade setuptools pip
Requirement already up-to-date: setuptools in ./env/.perfkit_env/lib/python2.7/site-packages (40.2.0)
Requirement already up-to-date: pip in ./env/.perfkit_env/lib/python2.7/site-packages (18.0)
[beam_PerformanceTests_XmlIOIT_HDFS] $ /bin/bash -xe /tmp/jenkins6344561479087428372.sh
+ git clone https://github.com/GoogleCloudPlatform/PerfKitBenchmarker.git <https://builds.apache.org/job/beam_PerformanceTests_XmlIOIT_HDFS/ws/PerfKitBenchmarker>
Cloning into '<https://builds.apache.org/job/beam_PerformanceTests_XmlIOIT_HDFS/ws/PerfKitBenchmarker'...>
[beam_PerformanceTests_XmlIOIT_HDFS] $ /bin/bash -xe /tmp/jenkins2142261954099373870.sh
+ <https://builds.apache.org/job/beam_PerformanceTests_XmlIOIT_HDFS/ws/env/.beam_env/bin/pip> install -e '<https://builds.apache.org/job/beam_PerformanceTests_XmlIOIT_HDFS/ws/src/sdks/python/[gcp,test]'>
Obtaining file://<https://builds.apache.org/job/beam_PerformanceTests_XmlIOIT_HDFS/ws/src/sdks/python>
Exception:
Traceback (most recent call last):
  File "<https://builds.apache.org/job/beam_PerformanceTests_XmlIOIT_HDFS/ws/env/.beam_env/local/lib/python2.7/site-packages/pip/_internal/basecommand.py",> line 141, in main
    status = self.run(options, args)
  File "<https://builds.apache.org/job/beam_PerformanceTests_XmlIOIT_HDFS/ws/env/.beam_env/local/lib/python2.7/site-packages/pip/_internal/commands/install.py",> line 299, in run
    resolver.resolve(requirement_set)
  File "<https://builds.apache.org/job/beam_PerformanceTests_XmlIOIT_HDFS/ws/env/.beam_env/local/lib/python2.7/site-packages/pip/_internal/resolve.py",> line 102, in resolve
    self._resolve_one(requirement_set, req)
  File "<https://builds.apache.org/job/beam_PerformanceTests_XmlIOIT_HDFS/ws/env/.beam_env/local/lib/python2.7/site-packages/pip/_internal/resolve.py",> line 256, in _resolve_one
    abstract_dist = self._get_abstract_dist_for(req_to_install)
  File "<https://builds.apache.org/job/beam_PerformanceTests_XmlIOIT_HDFS/ws/env/.beam_env/local/lib/python2.7/site-packages/pip/_internal/resolve.py",> line 193, in _get_abstract_dist_for
    req, self.require_hashes, self.use_user_site, self.finder,
  File "<https://builds.apache.org/job/beam_PerformanceTests_XmlIOIT_HDFS/ws/env/.beam_env/local/lib/python2.7/site-packages/pip/_internal/operations/prepare.py",> line 329, in prepare_editable_requirement
    req.check_if_exists(use_user_site)
  File "<https://builds.apache.org/job/beam_PerformanceTests_XmlIOIT_HDFS/ws/env/.beam_env/local/lib/python2.7/site-packages/pip/_internal/req/req_install.py",> line 494, in check_if_exists
    self.req.name
  File "<https://builds.apache.org/job/beam_PerformanceTests_XmlIOIT_HDFS/ws/env/.beam_env/local/lib/python2.7/site-packages/pip/_vendor/pkg_resources/__init__.py",> line 468, in get_distribution
    dist = get_provider(dist)
  File "<https://builds.apache.org/job/beam_PerformanceTests_XmlIOIT_HDFS/ws/env/.beam_env/local/lib/python2.7/site-packages/pip/_vendor/pkg_resources/__init__.py",> line 344, in get_provider
    return working_set.find(moduleOrReq) or require(str(moduleOrReq))[0]
  File "<https://builds.apache.org/job/beam_PerformanceTests_XmlIOIT_HDFS/ws/env/.beam_env/local/lib/python2.7/site-packages/pip/_vendor/pkg_resources/__init__.py",> line 888, in require
    needed = self.resolve(parse_requirements(requirements))
  File "<https://builds.apache.org/job/beam_PerformanceTests_XmlIOIT_HDFS/ws/env/.beam_env/local/lib/python2.7/site-packages/pip/_vendor/pkg_resources/__init__.py",> line 779, in resolve
    raise VersionConflict(dist, req).with_context(dependent_req)
ContextualVersionConflict: (fastavro 0.19.7 (/home/jenkins/.local/lib/python2.7/site-packages), Requirement.parse('fastavro==0.21.4'), set(['apache-beam']))
Build step 'Execute shell' marked build as failure

Jenkins build is back to normal : beam_PerformanceTests_XmlIOIT_HDFS #617

Posted by Apache Jenkins Server <je...@builds.apache.org>.
See <https://builds.apache.org/job/beam_PerformanceTests_XmlIOIT_HDFS/617/display/redirect>


Build failed in Jenkins: beam_PerformanceTests_XmlIOIT_HDFS #616

Posted by Apache Jenkins Server <je...@builds.apache.org>.
See <https://builds.apache.org/job/beam_PerformanceTests_XmlIOIT_HDFS/616/display/redirect>

------------------------------------------
Started by timer
[EnvInject] - Loading node environment variables.
Building remotely on beam10 (beam) in workspace <https://builds.apache.org/job/beam_PerformanceTests_XmlIOIT_HDFS/ws/>
 > git rev-parse --is-inside-work-tree # timeout=10
Fetching changes from the remote Git repository
 > git config remote.origin.url https://github.com/apache/beam.git # timeout=10
Fetching upstream changes from https://github.com/apache/beam.git
 > git --version # timeout=10
 > git fetch --tags --progress https://github.com/apache/beam.git +refs/heads/*:refs/remotes/origin/* +refs/pull/${ghprbPullId}/*:refs/remotes/origin/pr/${ghprbPullId}/*
 > git rev-parse origin/master^{commit} # timeout=10
Checking out Revision 4bd3386c5b0d925d03667a46d7fb85657aae36af (origin/master)
 > git config core.sparsecheckout # timeout=10
 > git checkout -f 4bd3386c5b0d925d03667a46d7fb85657aae36af
Commit message: "Merge pull request #6325: [BEAM-5277] Flink portable streaming: Empty side input for ready windows"
 > git rev-list --no-walk 4bd3386c5b0d925d03667a46d7fb85657aae36af # timeout=10
Cleaning workspace
 > git rev-parse --verify HEAD # timeout=10
Resetting working tree
 > git reset --hard # timeout=10
 > git clean -fdx # timeout=10
[EnvInject] - Executing scripts and injecting environment variables after the SCM step.
[EnvInject] - Injecting as environment variables the properties content 
SPARK_LOCAL_IP=127.0.0.1

[EnvInject] - Variables injected successfully.
[beam_PerformanceTests_XmlIOIT_HDFS] $ /bin/bash -xe /tmp/jenkins5531727726699509273.sh
+ gcloud container clusters get-credentials io-datastores --zone=us-central1-a --verbosity=debug
DEBUG: Running [gcloud.container.clusters.get-credentials] with arguments: [--verbosity: "debug", --zone: "us-central1-a", NAME: "io-datastores"]
Fetching cluster endpoint and auth data.
DEBUG: Saved kubeconfig to /home/jenkins/.kube/config
kubeconfig entry generated for io-datastores.
INFO: Display format "default".
DEBUG: SDK update checks are disabled.
[beam_PerformanceTests_XmlIOIT_HDFS] $ /bin/bash -xe /tmp/jenkins4523400393480848784.sh
+ cp /home/jenkins/.kube/config <https://builds.apache.org/job/beam_PerformanceTests_XmlIOIT_HDFS/ws/config-beam-performancetests-xmlioit-hdfs-616>
[beam_PerformanceTests_XmlIOIT_HDFS] $ /bin/bash -xe /tmp/jenkins6404513553114381726.sh
+ kubectl --kubeconfig=<https://builds.apache.org/job/beam_PerformanceTests_XmlIOIT_HDFS/ws/config-beam-performancetests-xmlioit-hdfs-616> create namespace beam-performancetests-xmlioit-hdfs-616
namespace "beam-performancetests-xmlioit-hdfs-616" created
[beam_PerformanceTests_XmlIOIT_HDFS] $ /bin/bash -xe /tmp/jenkins8005488503561763398.sh
++ kubectl config current-context
+ kubectl --kubeconfig=<https://builds.apache.org/job/beam_PerformanceTests_XmlIOIT_HDFS/ws/config-beam-performancetests-xmlioit-hdfs-616> config set-context gke_apache-beam-testing_us-central1-a_io-datastores --namespace=beam-performancetests-xmlioit-hdfs-616
Context "gke_apache-beam-testing_us-central1-a_io-datastores" modified.
[beam_PerformanceTests_XmlIOIT_HDFS] $ /bin/bash -xe /tmp/jenkins3469699023570829634.sh
+ rm -rf <https://builds.apache.org/job/beam_PerformanceTests_XmlIOIT_HDFS/ws/PerfKitBenchmarker>
[beam_PerformanceTests_XmlIOIT_HDFS] $ /bin/bash -xe /tmp/jenkins7802753957535789150.sh
+ rm -rf <https://builds.apache.org/job/beam_PerformanceTests_XmlIOIT_HDFS/ws/env/.beam_env>
[beam_PerformanceTests_XmlIOIT_HDFS] $ /bin/bash -xe /tmp/jenkins1288180863823799169.sh
+ rm -rf <https://builds.apache.org/job/beam_PerformanceTests_XmlIOIT_HDFS/ws/env/.perfkit_env>
[beam_PerformanceTests_XmlIOIT_HDFS] $ /bin/bash -xe /tmp/jenkins229518107014136119.sh
+ virtualenv <https://builds.apache.org/job/beam_PerformanceTests_XmlIOIT_HDFS/ws/env/.beam_env> --system-site-packages
New python executable in <https://builds.apache.org/job/beam_PerformanceTests_XmlIOIT_HDFS/ws/env/.beam_env/bin/python2>
Also creating executable in <https://builds.apache.org/job/beam_PerformanceTests_XmlIOIT_HDFS/ws/env/.beam_env/bin/python>
Installing setuptools, pkg_resources, pip, wheel...done.
Running virtualenv with interpreter /usr/bin/python2
[beam_PerformanceTests_XmlIOIT_HDFS] $ /bin/bash -xe /tmp/jenkins2157498467571558696.sh
+ virtualenv <https://builds.apache.org/job/beam_PerformanceTests_XmlIOIT_HDFS/ws/env/.perfkit_env> --system-site-packages
New python executable in <https://builds.apache.org/job/beam_PerformanceTests_XmlIOIT_HDFS/ws/env/.perfkit_env/bin/python2>
Also creating executable in <https://builds.apache.org/job/beam_PerformanceTests_XmlIOIT_HDFS/ws/env/.perfkit_env/bin/python>
Installing setuptools, pkg_resources, pip, wheel...done.
Running virtualenv with interpreter /usr/bin/python2
[beam_PerformanceTests_XmlIOIT_HDFS] $ /bin/bash -xe /tmp/jenkins3692165006790884475.sh
+ <https://builds.apache.org/job/beam_PerformanceTests_XmlIOIT_HDFS/ws/env/.beam_env/bin/pip> install --upgrade setuptools pip grpcio-tools==1.3.5
Requirement already up-to-date: setuptools in ./env/.beam_env/lib/python2.7/site-packages (40.2.0)
Requirement already up-to-date: pip in ./env/.beam_env/lib/python2.7/site-packages (18.0)
Collecting grpcio-tools==1.3.5
  Using cached https://files.pythonhosted.org/packages/05/f6/0296e29b1bac6f85d2a8556d48adf825307f73109a3c2c17fb734292db0a/grpcio_tools-1.3.5-cp27-cp27mu-manylinux1_x86_64.whl
Requirement already satisfied, skipping upgrade: grpcio>=1.3.5 in /home/jenkins/.local/lib/python2.7/site-packages (from grpcio-tools==1.3.5) (1.13.0)
Requirement already satisfied, skipping upgrade: protobuf>=3.2.0 in /home/jenkins/.local/lib/python2.7/site-packages (from grpcio-tools==1.3.5) (3.6.0)
Requirement already satisfied, skipping upgrade: six>=1.5.2 in /usr/local/lib/python2.7/dist-packages (from grpcio>=1.3.5->grpcio-tools==1.3.5) (1.11.0)
Requirement already satisfied, skipping upgrade: enum34>=1.0.4 in /usr/local/lib/python2.7/dist-packages (from grpcio>=1.3.5->grpcio-tools==1.3.5) (1.1.6)
Requirement already satisfied, skipping upgrade: futures>=2.2.0 in /home/jenkins/.local/lib/python2.7/site-packages (from grpcio>=1.3.5->grpcio-tools==1.3.5) (3.2.0)
Installing collected packages: grpcio-tools
Successfully installed grpcio-tools-1.3.5
[beam_PerformanceTests_XmlIOIT_HDFS] $ /bin/bash -xe /tmp/jenkins5203684746596164989.sh
+ <https://builds.apache.org/job/beam_PerformanceTests_XmlIOIT_HDFS/ws/env/.perfkit_env/bin/pip> install --upgrade setuptools pip
Requirement already up-to-date: setuptools in ./env/.perfkit_env/lib/python2.7/site-packages (40.2.0)
Requirement already up-to-date: pip in ./env/.perfkit_env/lib/python2.7/site-packages (18.0)
[beam_PerformanceTests_XmlIOIT_HDFS] $ /bin/bash -xe /tmp/jenkins1416081952733702646.sh
+ git clone https://github.com/GoogleCloudPlatform/PerfKitBenchmarker.git <https://builds.apache.org/job/beam_PerformanceTests_XmlIOIT_HDFS/ws/PerfKitBenchmarker>
Cloning into '<https://builds.apache.org/job/beam_PerformanceTests_XmlIOIT_HDFS/ws/PerfKitBenchmarker'...>
[beam_PerformanceTests_XmlIOIT_HDFS] $ /bin/bash -xe /tmp/jenkins886309564370059359.sh
+ <https://builds.apache.org/job/beam_PerformanceTests_XmlIOIT_HDFS/ws/env/.beam_env/bin/pip> install -e '<https://builds.apache.org/job/beam_PerformanceTests_XmlIOIT_HDFS/ws/src/sdks/python/[gcp,test]'>
Obtaining file://<https://builds.apache.org/job/beam_PerformanceTests_XmlIOIT_HDFS/ws/src/sdks/python>
Exception:
Traceback (most recent call last):
  File "<https://builds.apache.org/job/beam_PerformanceTests_XmlIOIT_HDFS/ws/env/.beam_env/local/lib/python2.7/site-packages/pip/_internal/basecommand.py",> line 141, in main
    status = self.run(options, args)
  File "<https://builds.apache.org/job/beam_PerformanceTests_XmlIOIT_HDFS/ws/env/.beam_env/local/lib/python2.7/site-packages/pip/_internal/commands/install.py",> line 299, in run
    resolver.resolve(requirement_set)
  File "<https://builds.apache.org/job/beam_PerformanceTests_XmlIOIT_HDFS/ws/env/.beam_env/local/lib/python2.7/site-packages/pip/_internal/resolve.py",> line 102, in resolve
    self._resolve_one(requirement_set, req)
  File "<https://builds.apache.org/job/beam_PerformanceTests_XmlIOIT_HDFS/ws/env/.beam_env/local/lib/python2.7/site-packages/pip/_internal/resolve.py",> line 256, in _resolve_one
    abstract_dist = self._get_abstract_dist_for(req_to_install)
  File "<https://builds.apache.org/job/beam_PerformanceTests_XmlIOIT_HDFS/ws/env/.beam_env/local/lib/python2.7/site-packages/pip/_internal/resolve.py",> line 193, in _get_abstract_dist_for
    req, self.require_hashes, self.use_user_site, self.finder,
  File "<https://builds.apache.org/job/beam_PerformanceTests_XmlIOIT_HDFS/ws/env/.beam_env/local/lib/python2.7/site-packages/pip/_internal/operations/prepare.py",> line 329, in prepare_editable_requirement
    req.check_if_exists(use_user_site)
  File "<https://builds.apache.org/job/beam_PerformanceTests_XmlIOIT_HDFS/ws/env/.beam_env/local/lib/python2.7/site-packages/pip/_internal/req/req_install.py",> line 494, in check_if_exists
    self.req.name
  File "<https://builds.apache.org/job/beam_PerformanceTests_XmlIOIT_HDFS/ws/env/.beam_env/local/lib/python2.7/site-packages/pip/_vendor/pkg_resources/__init__.py",> line 468, in get_distribution
    dist = get_provider(dist)
  File "<https://builds.apache.org/job/beam_PerformanceTests_XmlIOIT_HDFS/ws/env/.beam_env/local/lib/python2.7/site-packages/pip/_vendor/pkg_resources/__init__.py",> line 344, in get_provider
    return working_set.find(moduleOrReq) or require(str(moduleOrReq))[0]
  File "<https://builds.apache.org/job/beam_PerformanceTests_XmlIOIT_HDFS/ws/env/.beam_env/local/lib/python2.7/site-packages/pip/_vendor/pkg_resources/__init__.py",> line 888, in require
    needed = self.resolve(parse_requirements(requirements))
  File "<https://builds.apache.org/job/beam_PerformanceTests_XmlIOIT_HDFS/ws/env/.beam_env/local/lib/python2.7/site-packages/pip/_vendor/pkg_resources/__init__.py",> line 779, in resolve
    raise VersionConflict(dist, req).with_context(dependent_req)
ContextualVersionConflict: (fastavro 0.19.7 (/home/jenkins/.local/lib/python2.7/site-packages), Requirement.parse('fastavro==0.21.4'), set(['apache-beam']))
Build step 'Execute shell' marked build as failure

Build failed in Jenkins: beam_PerformanceTests_XmlIOIT_HDFS #615

Posted by Apache Jenkins Server <je...@builds.apache.org>.
See <https://builds.apache.org/job/beam_PerformanceTests_XmlIOIT_HDFS/615/display/redirect?page=changes>

Changes:

[thw] [BEAM-5277] Flink portable streaming: Empty side input for ready windows

------------------------------------------
Started by timer
[EnvInject] - Loading node environment variables.
Building remotely on beam10 (beam) in workspace <https://builds.apache.org/job/beam_PerformanceTests_XmlIOIT_HDFS/ws/>
 > git rev-parse --is-inside-work-tree # timeout=10
Fetching changes from the remote Git repository
 > git config remote.origin.url https://github.com/apache/beam.git # timeout=10
Fetching upstream changes from https://github.com/apache/beam.git
 > git --version # timeout=10
 > git fetch --tags --progress https://github.com/apache/beam.git +refs/heads/*:refs/remotes/origin/* +refs/pull/${ghprbPullId}/*:refs/remotes/origin/pr/${ghprbPullId}/*
 > git rev-parse origin/master^{commit} # timeout=10
Checking out Revision 4bd3386c5b0d925d03667a46d7fb85657aae36af (origin/master)
 > git config core.sparsecheckout # timeout=10
 > git checkout -f 4bd3386c5b0d925d03667a46d7fb85657aae36af
Commit message: "Merge pull request #6325: [BEAM-5277] Flink portable streaming: Empty side input for ready windows"
 > git rev-list --no-walk 2195cfee24fbe3cc96672fc46f087870ae52784e # timeout=10
Cleaning workspace
 > git rev-parse --verify HEAD # timeout=10
Resetting working tree
 > git reset --hard # timeout=10
 > git clean -fdx # timeout=10
[EnvInject] - Executing scripts and injecting environment variables after the SCM step.
[EnvInject] - Injecting as environment variables the properties content 
SPARK_LOCAL_IP=127.0.0.1

[EnvInject] - Variables injected successfully.
[beam_PerformanceTests_XmlIOIT_HDFS] $ /bin/bash -xe /tmp/jenkins5481745167612438033.sh
+ gcloud container clusters get-credentials io-datastores --zone=us-central1-a --verbosity=debug
DEBUG: Running [gcloud.container.clusters.get-credentials] with arguments: [--verbosity: "debug", --zone: "us-central1-a", NAME: "io-datastores"]
Fetching cluster endpoint and auth data.
DEBUG: Saved kubeconfig to /home/jenkins/.kube/config
kubeconfig entry generated for io-datastores.
INFO: Display format "default".
DEBUG: SDK update checks are disabled.
[beam_PerformanceTests_XmlIOIT_HDFS] $ /bin/bash -xe /tmp/jenkins5666325078999768557.sh
+ cp /home/jenkins/.kube/config <https://builds.apache.org/job/beam_PerformanceTests_XmlIOIT_HDFS/ws/config-beam-performancetests-xmlioit-hdfs-615>
[beam_PerformanceTests_XmlIOIT_HDFS] $ /bin/bash -xe /tmp/jenkins5761617802574775386.sh
+ kubectl --kubeconfig=<https://builds.apache.org/job/beam_PerformanceTests_XmlIOIT_HDFS/ws/config-beam-performancetests-xmlioit-hdfs-615> create namespace beam-performancetests-xmlioit-hdfs-615
namespace "beam-performancetests-xmlioit-hdfs-615" created
[beam_PerformanceTests_XmlIOIT_HDFS] $ /bin/bash -xe /tmp/jenkins3214530072797265780.sh
++ kubectl config current-context
+ kubectl --kubeconfig=<https://builds.apache.org/job/beam_PerformanceTests_XmlIOIT_HDFS/ws/config-beam-performancetests-xmlioit-hdfs-615> config set-context gke_apache-beam-testing_us-central1-a_io-datastores --namespace=beam-performancetests-xmlioit-hdfs-615
Context "gke_apache-beam-testing_us-central1-a_io-datastores" modified.
[beam_PerformanceTests_XmlIOIT_HDFS] $ /bin/bash -xe /tmp/jenkins5061362540178520605.sh
+ rm -rf <https://builds.apache.org/job/beam_PerformanceTests_XmlIOIT_HDFS/ws/PerfKitBenchmarker>
[beam_PerformanceTests_XmlIOIT_HDFS] $ /bin/bash -xe /tmp/jenkins713183062746536892.sh
+ rm -rf <https://builds.apache.org/job/beam_PerformanceTests_XmlIOIT_HDFS/ws/env/.beam_env>
[beam_PerformanceTests_XmlIOIT_HDFS] $ /bin/bash -xe /tmp/jenkins3736057858485949075.sh
+ rm -rf <https://builds.apache.org/job/beam_PerformanceTests_XmlIOIT_HDFS/ws/env/.perfkit_env>
[beam_PerformanceTests_XmlIOIT_HDFS] $ /bin/bash -xe /tmp/jenkins8345844192944613311.sh
+ virtualenv <https://builds.apache.org/job/beam_PerformanceTests_XmlIOIT_HDFS/ws/env/.beam_env> --system-site-packages
New python executable in <https://builds.apache.org/job/beam_PerformanceTests_XmlIOIT_HDFS/ws/env/.beam_env/bin/python2>
Also creating executable in <https://builds.apache.org/job/beam_PerformanceTests_XmlIOIT_HDFS/ws/env/.beam_env/bin/python>
Installing setuptools, pkg_resources, pip, wheel...done.
Running virtualenv with interpreter /usr/bin/python2
[beam_PerformanceTests_XmlIOIT_HDFS] $ /bin/bash -xe /tmp/jenkins7025496162127339061.sh
+ virtualenv <https://builds.apache.org/job/beam_PerformanceTests_XmlIOIT_HDFS/ws/env/.perfkit_env> --system-site-packages
New python executable in <https://builds.apache.org/job/beam_PerformanceTests_XmlIOIT_HDFS/ws/env/.perfkit_env/bin/python2>
Also creating executable in <https://builds.apache.org/job/beam_PerformanceTests_XmlIOIT_HDFS/ws/env/.perfkit_env/bin/python>
Installing setuptools, pkg_resources, pip, wheel...done.
Running virtualenv with interpreter /usr/bin/python2
[beam_PerformanceTests_XmlIOIT_HDFS] $ /bin/bash -xe /tmp/jenkins4439400006706149866.sh
+ <https://builds.apache.org/job/beam_PerformanceTests_XmlIOIT_HDFS/ws/env/.beam_env/bin/pip> install --upgrade setuptools pip grpcio-tools==1.3.5
Requirement already up-to-date: setuptools in ./env/.beam_env/lib/python2.7/site-packages (40.2.0)
Requirement already up-to-date: pip in ./env/.beam_env/lib/python2.7/site-packages (18.0)
Collecting grpcio-tools==1.3.5
  Using cached https://files.pythonhosted.org/packages/05/f6/0296e29b1bac6f85d2a8556d48adf825307f73109a3c2c17fb734292db0a/grpcio_tools-1.3.5-cp27-cp27mu-manylinux1_x86_64.whl
Requirement already satisfied, skipping upgrade: grpcio>=1.3.5 in /home/jenkins/.local/lib/python2.7/site-packages (from grpcio-tools==1.3.5) (1.13.0)
Requirement already satisfied, skipping upgrade: protobuf>=3.2.0 in /home/jenkins/.local/lib/python2.7/site-packages (from grpcio-tools==1.3.5) (3.6.0)
Requirement already satisfied, skipping upgrade: six>=1.5.2 in /usr/local/lib/python2.7/dist-packages (from grpcio>=1.3.5->grpcio-tools==1.3.5) (1.11.0)
Requirement already satisfied, skipping upgrade: enum34>=1.0.4 in /usr/local/lib/python2.7/dist-packages (from grpcio>=1.3.5->grpcio-tools==1.3.5) (1.1.6)
Requirement already satisfied, skipping upgrade: futures>=2.2.0 in /home/jenkins/.local/lib/python2.7/site-packages (from grpcio>=1.3.5->grpcio-tools==1.3.5) (3.2.0)
Installing collected packages: grpcio-tools
Successfully installed grpcio-tools-1.3.5
[beam_PerformanceTests_XmlIOIT_HDFS] $ /bin/bash -xe /tmp/jenkins7619262925617284113.sh
+ <https://builds.apache.org/job/beam_PerformanceTests_XmlIOIT_HDFS/ws/env/.perfkit_env/bin/pip> install --upgrade setuptools pip
Requirement already up-to-date: setuptools in ./env/.perfkit_env/lib/python2.7/site-packages (40.2.0)
Requirement already up-to-date: pip in ./env/.perfkit_env/lib/python2.7/site-packages (18.0)
[beam_PerformanceTests_XmlIOIT_HDFS] $ /bin/bash -xe /tmp/jenkins2830824364078457627.sh
+ git clone https://github.com/GoogleCloudPlatform/PerfKitBenchmarker.git <https://builds.apache.org/job/beam_PerformanceTests_XmlIOIT_HDFS/ws/PerfKitBenchmarker>
Cloning into '<https://builds.apache.org/job/beam_PerformanceTests_XmlIOIT_HDFS/ws/PerfKitBenchmarker'...>
[beam_PerformanceTests_XmlIOIT_HDFS] $ /bin/bash -xe /tmp/jenkins8665394001121952682.sh
+ <https://builds.apache.org/job/beam_PerformanceTests_XmlIOIT_HDFS/ws/env/.beam_env/bin/pip> install -e '<https://builds.apache.org/job/beam_PerformanceTests_XmlIOIT_HDFS/ws/src/sdks/python/[gcp,test]'>
Obtaining file://<https://builds.apache.org/job/beam_PerformanceTests_XmlIOIT_HDFS/ws/src/sdks/python>
Exception:
Traceback (most recent call last):
  File "<https://builds.apache.org/job/beam_PerformanceTests_XmlIOIT_HDFS/ws/env/.beam_env/local/lib/python2.7/site-packages/pip/_internal/basecommand.py",> line 141, in main
    status = self.run(options, args)
  File "<https://builds.apache.org/job/beam_PerformanceTests_XmlIOIT_HDFS/ws/env/.beam_env/local/lib/python2.7/site-packages/pip/_internal/commands/install.py",> line 299, in run
    resolver.resolve(requirement_set)
  File "<https://builds.apache.org/job/beam_PerformanceTests_XmlIOIT_HDFS/ws/env/.beam_env/local/lib/python2.7/site-packages/pip/_internal/resolve.py",> line 102, in resolve
    self._resolve_one(requirement_set, req)
  File "<https://builds.apache.org/job/beam_PerformanceTests_XmlIOIT_HDFS/ws/env/.beam_env/local/lib/python2.7/site-packages/pip/_internal/resolve.py",> line 256, in _resolve_one
    abstract_dist = self._get_abstract_dist_for(req_to_install)
  File "<https://builds.apache.org/job/beam_PerformanceTests_XmlIOIT_HDFS/ws/env/.beam_env/local/lib/python2.7/site-packages/pip/_internal/resolve.py",> line 193, in _get_abstract_dist_for
    req, self.require_hashes, self.use_user_site, self.finder,
  File "<https://builds.apache.org/job/beam_PerformanceTests_XmlIOIT_HDFS/ws/env/.beam_env/local/lib/python2.7/site-packages/pip/_internal/operations/prepare.py",> line 329, in prepare_editable_requirement
    req.check_if_exists(use_user_site)
  File "<https://builds.apache.org/job/beam_PerformanceTests_XmlIOIT_HDFS/ws/env/.beam_env/local/lib/python2.7/site-packages/pip/_internal/req/req_install.py",> line 494, in check_if_exists
    self.req.name
  File "<https://builds.apache.org/job/beam_PerformanceTests_XmlIOIT_HDFS/ws/env/.beam_env/local/lib/python2.7/site-packages/pip/_vendor/pkg_resources/__init__.py",> line 468, in get_distribution
    dist = get_provider(dist)
  File "<https://builds.apache.org/job/beam_PerformanceTests_XmlIOIT_HDFS/ws/env/.beam_env/local/lib/python2.7/site-packages/pip/_vendor/pkg_resources/__init__.py",> line 344, in get_provider
    return working_set.find(moduleOrReq) or require(str(moduleOrReq))[0]
  File "<https://builds.apache.org/job/beam_PerformanceTests_XmlIOIT_HDFS/ws/env/.beam_env/local/lib/python2.7/site-packages/pip/_vendor/pkg_resources/__init__.py",> line 888, in require
    needed = self.resolve(parse_requirements(requirements))
  File "<https://builds.apache.org/job/beam_PerformanceTests_XmlIOIT_HDFS/ws/env/.beam_env/local/lib/python2.7/site-packages/pip/_vendor/pkg_resources/__init__.py",> line 779, in resolve
    raise VersionConflict(dist, req).with_context(dependent_req)
ContextualVersionConflict: (fastavro 0.19.7 (/home/jenkins/.local/lib/python2.7/site-packages), Requirement.parse('fastavro==0.21.4'), set(['apache-beam']))
Build step 'Execute shell' marked build as failure

Build failed in Jenkins: beam_PerformanceTests_XmlIOIT_HDFS #614

Posted by Apache Jenkins Server <je...@builds.apache.org>.
See <https://builds.apache.org/job/beam_PerformanceTests_XmlIOIT_HDFS/614/display/redirect?page=changes>

Changes:

[lukasz.gajowy] [BEAM-5293] Fix build break while running IOIT on s3 filesystem

------------------------------------------
Started by timer
[EnvInject] - Loading node environment variables.
Building remotely on beam10 (beam) in workspace <https://builds.apache.org/job/beam_PerformanceTests_XmlIOIT_HDFS/ws/>
 > git rev-parse --is-inside-work-tree # timeout=10
Fetching changes from the remote Git repository
 > git config remote.origin.url https://github.com/apache/beam.git # timeout=10
Fetching upstream changes from https://github.com/apache/beam.git
 > git --version # timeout=10
 > git fetch --tags --progress https://github.com/apache/beam.git +refs/heads/*:refs/remotes/origin/* +refs/pull/${ghprbPullId}/*:refs/remotes/origin/pr/${ghprbPullId}/*
 > git rev-parse origin/master^{commit} # timeout=10
Checking out Revision 2195cfee24fbe3cc96672fc46f087870ae52784e (origin/master)
 > git config core.sparsecheckout # timeout=10
 > git checkout -f 2195cfee24fbe3cc96672fc46f087870ae52784e
Commit message: "Merge pull request #6327: [BEAM-5293] Fix build break while running IOIT on s3 filesystem"
 > git rev-list --no-walk 2e1387757ff2e81cfd59e3f5280cf89b8987f079 # timeout=10
Cleaning workspace
 > git rev-parse --verify HEAD # timeout=10
Resetting working tree
 > git reset --hard # timeout=10
 > git clean -fdx # timeout=10
[EnvInject] - Executing scripts and injecting environment variables after the SCM step.
[EnvInject] - Injecting as environment variables the properties content 
SPARK_LOCAL_IP=127.0.0.1

[EnvInject] - Variables injected successfully.
[beam_PerformanceTests_XmlIOIT_HDFS] $ /bin/bash -xe /tmp/jenkins4192780506213278656.sh
+ gcloud container clusters get-credentials io-datastores --zone=us-central1-a --verbosity=debug
DEBUG: Running [gcloud.container.clusters.get-credentials] with arguments: [--verbosity: "debug", --zone: "us-central1-a", NAME: "io-datastores"]
Fetching cluster endpoint and auth data.
DEBUG: Saved kubeconfig to /home/jenkins/.kube/config
kubeconfig entry generated for io-datastores.
INFO: Display format "default".
DEBUG: SDK update checks are disabled.
[beam_PerformanceTests_XmlIOIT_HDFS] $ /bin/bash -xe /tmp/jenkins8823911706362251788.sh
+ cp /home/jenkins/.kube/config <https://builds.apache.org/job/beam_PerformanceTests_XmlIOIT_HDFS/ws/config-beam-performancetests-xmlioit-hdfs-614>
[beam_PerformanceTests_XmlIOIT_HDFS] $ /bin/bash -xe /tmp/jenkins802494183368733145.sh
+ kubectl --kubeconfig=<https://builds.apache.org/job/beam_PerformanceTests_XmlIOIT_HDFS/ws/config-beam-performancetests-xmlioit-hdfs-614> create namespace beam-performancetests-xmlioit-hdfs-614
namespace "beam-performancetests-xmlioit-hdfs-614" created
[beam_PerformanceTests_XmlIOIT_HDFS] $ /bin/bash -xe /tmp/jenkins6660392858171612949.sh
++ kubectl config current-context
+ kubectl --kubeconfig=<https://builds.apache.org/job/beam_PerformanceTests_XmlIOIT_HDFS/ws/config-beam-performancetests-xmlioit-hdfs-614> config set-context gke_apache-beam-testing_us-central1-a_io-datastores --namespace=beam-performancetests-xmlioit-hdfs-614
Context "gke_apache-beam-testing_us-central1-a_io-datastores" modified.
[beam_PerformanceTests_XmlIOIT_HDFS] $ /bin/bash -xe /tmp/jenkins2677360477857426722.sh
+ rm -rf <https://builds.apache.org/job/beam_PerformanceTests_XmlIOIT_HDFS/ws/PerfKitBenchmarker>
[beam_PerformanceTests_XmlIOIT_HDFS] $ /bin/bash -xe /tmp/jenkins6219320825403582878.sh
+ rm -rf <https://builds.apache.org/job/beam_PerformanceTests_XmlIOIT_HDFS/ws/env/.beam_env>
[beam_PerformanceTests_XmlIOIT_HDFS] $ /bin/bash -xe /tmp/jenkins5950691061411416798.sh
+ rm -rf <https://builds.apache.org/job/beam_PerformanceTests_XmlIOIT_HDFS/ws/env/.perfkit_env>
[beam_PerformanceTests_XmlIOIT_HDFS] $ /bin/bash -xe /tmp/jenkins5007633443909825765.sh
+ virtualenv <https://builds.apache.org/job/beam_PerformanceTests_XmlIOIT_HDFS/ws/env/.beam_env> --system-site-packages
New python executable in <https://builds.apache.org/job/beam_PerformanceTests_XmlIOIT_HDFS/ws/env/.beam_env/bin/python2>
Also creating executable in <https://builds.apache.org/job/beam_PerformanceTests_XmlIOIT_HDFS/ws/env/.beam_env/bin/python>
Installing setuptools, pkg_resources, pip, wheel...done.
Running virtualenv with interpreter /usr/bin/python2
[beam_PerformanceTests_XmlIOIT_HDFS] $ /bin/bash -xe /tmp/jenkins8277043815479991515.sh
+ virtualenv <https://builds.apache.org/job/beam_PerformanceTests_XmlIOIT_HDFS/ws/env/.perfkit_env> --system-site-packages
New python executable in <https://builds.apache.org/job/beam_PerformanceTests_XmlIOIT_HDFS/ws/env/.perfkit_env/bin/python2>
Also creating executable in <https://builds.apache.org/job/beam_PerformanceTests_XmlIOIT_HDFS/ws/env/.perfkit_env/bin/python>
Installing setuptools, pkg_resources, pip, wheel...done.
Running virtualenv with interpreter /usr/bin/python2
[beam_PerformanceTests_XmlIOIT_HDFS] $ /bin/bash -xe /tmp/jenkins1178885763234833162.sh
+ <https://builds.apache.org/job/beam_PerformanceTests_XmlIOIT_HDFS/ws/env/.beam_env/bin/pip> install --upgrade setuptools pip grpcio-tools==1.3.5
Requirement already up-to-date: setuptools in ./env/.beam_env/lib/python2.7/site-packages (40.2.0)
Requirement already up-to-date: pip in ./env/.beam_env/lib/python2.7/site-packages (18.0)
Collecting grpcio-tools==1.3.5
  Using cached https://files.pythonhosted.org/packages/05/f6/0296e29b1bac6f85d2a8556d48adf825307f73109a3c2c17fb734292db0a/grpcio_tools-1.3.5-cp27-cp27mu-manylinux1_x86_64.whl
Requirement already satisfied, skipping upgrade: grpcio>=1.3.5 in /home/jenkins/.local/lib/python2.7/site-packages (from grpcio-tools==1.3.5) (1.13.0)
Requirement already satisfied, skipping upgrade: protobuf>=3.2.0 in /home/jenkins/.local/lib/python2.7/site-packages (from grpcio-tools==1.3.5) (3.6.0)
Requirement already satisfied, skipping upgrade: six>=1.5.2 in /usr/local/lib/python2.7/dist-packages (from grpcio>=1.3.5->grpcio-tools==1.3.5) (1.11.0)
Requirement already satisfied, skipping upgrade: enum34>=1.0.4 in /usr/local/lib/python2.7/dist-packages (from grpcio>=1.3.5->grpcio-tools==1.3.5) (1.1.6)
Requirement already satisfied, skipping upgrade: futures>=2.2.0 in /home/jenkins/.local/lib/python2.7/site-packages (from grpcio>=1.3.5->grpcio-tools==1.3.5) (3.2.0)
Installing collected packages: grpcio-tools
Successfully installed grpcio-tools-1.3.5
[beam_PerformanceTests_XmlIOIT_HDFS] $ /bin/bash -xe /tmp/jenkins6823090101692504594.sh
+ <https://builds.apache.org/job/beam_PerformanceTests_XmlIOIT_HDFS/ws/env/.perfkit_env/bin/pip> install --upgrade setuptools pip
Requirement already up-to-date: setuptools in ./env/.perfkit_env/lib/python2.7/site-packages (40.2.0)
Requirement already up-to-date: pip in ./env/.perfkit_env/lib/python2.7/site-packages (18.0)
[beam_PerformanceTests_XmlIOIT_HDFS] $ /bin/bash -xe /tmp/jenkins864663161663837651.sh
+ git clone https://github.com/GoogleCloudPlatform/PerfKitBenchmarker.git <https://builds.apache.org/job/beam_PerformanceTests_XmlIOIT_HDFS/ws/PerfKitBenchmarker>
Cloning into '<https://builds.apache.org/job/beam_PerformanceTests_XmlIOIT_HDFS/ws/PerfKitBenchmarker'...>
[beam_PerformanceTests_XmlIOIT_HDFS] $ /bin/bash -xe /tmp/jenkins8767775299917276565.sh
+ <https://builds.apache.org/job/beam_PerformanceTests_XmlIOIT_HDFS/ws/env/.beam_env/bin/pip> install -e '<https://builds.apache.org/job/beam_PerformanceTests_XmlIOIT_HDFS/ws/src/sdks/python/[gcp,test]'>
Obtaining file://<https://builds.apache.org/job/beam_PerformanceTests_XmlIOIT_HDFS/ws/src/sdks/python>
Exception:
Traceback (most recent call last):
  File "<https://builds.apache.org/job/beam_PerformanceTests_XmlIOIT_HDFS/ws/env/.beam_env/local/lib/python2.7/site-packages/pip/_internal/basecommand.py",> line 141, in main
    status = self.run(options, args)
  File "<https://builds.apache.org/job/beam_PerformanceTests_XmlIOIT_HDFS/ws/env/.beam_env/local/lib/python2.7/site-packages/pip/_internal/commands/install.py",> line 299, in run
    resolver.resolve(requirement_set)
  File "<https://builds.apache.org/job/beam_PerformanceTests_XmlIOIT_HDFS/ws/env/.beam_env/local/lib/python2.7/site-packages/pip/_internal/resolve.py",> line 102, in resolve
    self._resolve_one(requirement_set, req)
  File "<https://builds.apache.org/job/beam_PerformanceTests_XmlIOIT_HDFS/ws/env/.beam_env/local/lib/python2.7/site-packages/pip/_internal/resolve.py",> line 256, in _resolve_one
    abstract_dist = self._get_abstract_dist_for(req_to_install)
  File "<https://builds.apache.org/job/beam_PerformanceTests_XmlIOIT_HDFS/ws/env/.beam_env/local/lib/python2.7/site-packages/pip/_internal/resolve.py",> line 193, in _get_abstract_dist_for
    req, self.require_hashes, self.use_user_site, self.finder,
  File "<https://builds.apache.org/job/beam_PerformanceTests_XmlIOIT_HDFS/ws/env/.beam_env/local/lib/python2.7/site-packages/pip/_internal/operations/prepare.py",> line 329, in prepare_editable_requirement
    req.check_if_exists(use_user_site)
  File "<https://builds.apache.org/job/beam_PerformanceTests_XmlIOIT_HDFS/ws/env/.beam_env/local/lib/python2.7/site-packages/pip/_internal/req/req_install.py",> line 494, in check_if_exists
    self.req.name
  File "<https://builds.apache.org/job/beam_PerformanceTests_XmlIOIT_HDFS/ws/env/.beam_env/local/lib/python2.7/site-packages/pip/_vendor/pkg_resources/__init__.py",> line 468, in get_distribution
    dist = get_provider(dist)
  File "<https://builds.apache.org/job/beam_PerformanceTests_XmlIOIT_HDFS/ws/env/.beam_env/local/lib/python2.7/site-packages/pip/_vendor/pkg_resources/__init__.py",> line 344, in get_provider
    return working_set.find(moduleOrReq) or require(str(moduleOrReq))[0]
  File "<https://builds.apache.org/job/beam_PerformanceTests_XmlIOIT_HDFS/ws/env/.beam_env/local/lib/python2.7/site-packages/pip/_vendor/pkg_resources/__init__.py",> line 888, in require
    needed = self.resolve(parse_requirements(requirements))
  File "<https://builds.apache.org/job/beam_PerformanceTests_XmlIOIT_HDFS/ws/env/.beam_env/local/lib/python2.7/site-packages/pip/_vendor/pkg_resources/__init__.py",> line 779, in resolve
    raise VersionConflict(dist, req).with_context(dependent_req)
ContextualVersionConflict: (fastavro 0.19.7 (/home/jenkins/.local/lib/python2.7/site-packages), Requirement.parse('fastavro==0.21.4'), set(['apache-beam']))
Build step 'Execute shell' marked build as failure

Build failed in Jenkins: beam_PerformanceTests_XmlIOIT_HDFS #613

Posted by Apache Jenkins Server <je...@builds.apache.org>.
See <https://builds.apache.org/job/beam_PerformanceTests_XmlIOIT_HDFS/613/display/redirect?page=changes>

Changes:

[rpathak] [BEAM-3820] Exposing batchSize for SolrIO Writes

[rpathak] [BEAM-3820] Updating comments adding default batch size in javadoc

[Jozef.Vilcek] Remove slf4j-simple binding from dependencies

------------------------------------------
Started by timer
[EnvInject] - Loading node environment variables.
Building remotely on beam10 (beam) in workspace <https://builds.apache.org/job/beam_PerformanceTests_XmlIOIT_HDFS/ws/>
 > git rev-parse --is-inside-work-tree # timeout=10
Fetching changes from the remote Git repository
 > git config remote.origin.url https://github.com/apache/beam.git # timeout=10
Fetching upstream changes from https://github.com/apache/beam.git
 > git --version # timeout=10
 > git fetch --tags --progress https://github.com/apache/beam.git +refs/heads/*:refs/remotes/origin/* +refs/pull/${ghprbPullId}/*:refs/remotes/origin/pr/${ghprbPullId}/*
 > git rev-parse origin/master^{commit} # timeout=10
Checking out Revision 2e1387757ff2e81cfd59e3f5280cf89b8987f079 (origin/master)
 > git config core.sparsecheckout # timeout=10
 > git checkout -f 2e1387757ff2e81cfd59e3f5280cf89b8987f079
Commit message: "Merge pull request #6284: [BEAM-5247] Remove slf4j-simple binding from dependencies"
 > git rev-list --no-walk 44f21ece0d6247fbd9a7b94204287bacc1a0f199 # timeout=10
Cleaning workspace
 > git rev-parse --verify HEAD # timeout=10
Resetting working tree
 > git reset --hard # timeout=10
 > git clean -fdx # timeout=10
[EnvInject] - Executing scripts and injecting environment variables after the SCM step.
[EnvInject] - Injecting as environment variables the properties content 
SPARK_LOCAL_IP=127.0.0.1

[EnvInject] - Variables injected successfully.
[beam_PerformanceTests_XmlIOIT_HDFS] $ /bin/bash -xe /tmp/jenkins6233058550438767818.sh
+ gcloud container clusters get-credentials io-datastores --zone=us-central1-a --verbosity=debug
DEBUG: Running [gcloud.container.clusters.get-credentials] with arguments: [--verbosity: "debug", --zone: "us-central1-a", NAME: "io-datastores"]
Fetching cluster endpoint and auth data.
DEBUG: Saved kubeconfig to /home/jenkins/.kube/config
kubeconfig entry generated for io-datastores.
INFO: Display format "default".
DEBUG: SDK update checks are disabled.
[beam_PerformanceTests_XmlIOIT_HDFS] $ /bin/bash -xe /tmp/jenkins2393195130228114352.sh
+ cp /home/jenkins/.kube/config <https://builds.apache.org/job/beam_PerformanceTests_XmlIOIT_HDFS/ws/config-beam-performancetests-xmlioit-hdfs-613>
[beam_PerformanceTests_XmlIOIT_HDFS] $ /bin/bash -xe /tmp/jenkins4144905920515088035.sh
+ kubectl --kubeconfig=<https://builds.apache.org/job/beam_PerformanceTests_XmlIOIT_HDFS/ws/config-beam-performancetests-xmlioit-hdfs-613> create namespace beam-performancetests-xmlioit-hdfs-613
namespace "beam-performancetests-xmlioit-hdfs-613" created
[beam_PerformanceTests_XmlIOIT_HDFS] $ /bin/bash -xe /tmp/jenkins2483965759601311782.sh
++ kubectl config current-context
+ kubectl --kubeconfig=<https://builds.apache.org/job/beam_PerformanceTests_XmlIOIT_HDFS/ws/config-beam-performancetests-xmlioit-hdfs-613> config set-context gke_apache-beam-testing_us-central1-a_io-datastores --namespace=beam-performancetests-xmlioit-hdfs-613
Context "gke_apache-beam-testing_us-central1-a_io-datastores" modified.
[beam_PerformanceTests_XmlIOIT_HDFS] $ /bin/bash -xe /tmp/jenkins7533661325789193219.sh
+ rm -rf <https://builds.apache.org/job/beam_PerformanceTests_XmlIOIT_HDFS/ws/PerfKitBenchmarker>
[beam_PerformanceTests_XmlIOIT_HDFS] $ /bin/bash -xe /tmp/jenkins4416175474913282432.sh
+ rm -rf <https://builds.apache.org/job/beam_PerformanceTests_XmlIOIT_HDFS/ws/env/.beam_env>
[beam_PerformanceTests_XmlIOIT_HDFS] $ /bin/bash -xe /tmp/jenkins3177684611676380097.sh
+ rm -rf <https://builds.apache.org/job/beam_PerformanceTests_XmlIOIT_HDFS/ws/env/.perfkit_env>
[beam_PerformanceTests_XmlIOIT_HDFS] $ /bin/bash -xe /tmp/jenkins750381597315845569.sh
+ virtualenv <https://builds.apache.org/job/beam_PerformanceTests_XmlIOIT_HDFS/ws/env/.beam_env> --system-site-packages
New python executable in <https://builds.apache.org/job/beam_PerformanceTests_XmlIOIT_HDFS/ws/env/.beam_env/bin/python2>
Also creating executable in <https://builds.apache.org/job/beam_PerformanceTests_XmlIOIT_HDFS/ws/env/.beam_env/bin/python>
Installing setuptools, pkg_resources, pip, wheel...done.
Running virtualenv with interpreter /usr/bin/python2
[beam_PerformanceTests_XmlIOIT_HDFS] $ /bin/bash -xe /tmp/jenkins7487014339417862928.sh
+ virtualenv <https://builds.apache.org/job/beam_PerformanceTests_XmlIOIT_HDFS/ws/env/.perfkit_env> --system-site-packages
New python executable in <https://builds.apache.org/job/beam_PerformanceTests_XmlIOIT_HDFS/ws/env/.perfkit_env/bin/python2>
Also creating executable in <https://builds.apache.org/job/beam_PerformanceTests_XmlIOIT_HDFS/ws/env/.perfkit_env/bin/python>
Installing setuptools, pkg_resources, pip, wheel...done.
Running virtualenv with interpreter /usr/bin/python2
[beam_PerformanceTests_XmlIOIT_HDFS] $ /bin/bash -xe /tmp/jenkins670488420240005966.sh
+ <https://builds.apache.org/job/beam_PerformanceTests_XmlIOIT_HDFS/ws/env/.beam_env/bin/pip> install --upgrade setuptools pip grpcio-tools==1.3.5
Requirement already up-to-date: setuptools in ./env/.beam_env/lib/python2.7/site-packages (40.2.0)
Requirement already up-to-date: pip in ./env/.beam_env/lib/python2.7/site-packages (18.0)
Collecting grpcio-tools==1.3.5
  Using cached https://files.pythonhosted.org/packages/05/f6/0296e29b1bac6f85d2a8556d48adf825307f73109a3c2c17fb734292db0a/grpcio_tools-1.3.5-cp27-cp27mu-manylinux1_x86_64.whl
Requirement already satisfied, skipping upgrade: grpcio>=1.3.5 in /home/jenkins/.local/lib/python2.7/site-packages (from grpcio-tools==1.3.5) (1.13.0)
Requirement already satisfied, skipping upgrade: protobuf>=3.2.0 in /home/jenkins/.local/lib/python2.7/site-packages (from grpcio-tools==1.3.5) (3.6.0)
Requirement already satisfied, skipping upgrade: six>=1.5.2 in /usr/local/lib/python2.7/dist-packages (from grpcio>=1.3.5->grpcio-tools==1.3.5) (1.11.0)
Requirement already satisfied, skipping upgrade: enum34>=1.0.4 in /usr/local/lib/python2.7/dist-packages (from grpcio>=1.3.5->grpcio-tools==1.3.5) (1.1.6)
Requirement already satisfied, skipping upgrade: futures>=2.2.0 in /home/jenkins/.local/lib/python2.7/site-packages (from grpcio>=1.3.5->grpcio-tools==1.3.5) (3.2.0)
Installing collected packages: grpcio-tools
Successfully installed grpcio-tools-1.3.5
[beam_PerformanceTests_XmlIOIT_HDFS] $ /bin/bash -xe /tmp/jenkins998594042556305177.sh
+ <https://builds.apache.org/job/beam_PerformanceTests_XmlIOIT_HDFS/ws/env/.perfkit_env/bin/pip> install --upgrade setuptools pip
Requirement already up-to-date: setuptools in ./env/.perfkit_env/lib/python2.7/site-packages (40.2.0)
Requirement already up-to-date: pip in ./env/.perfkit_env/lib/python2.7/site-packages (18.0)
[beam_PerformanceTests_XmlIOIT_HDFS] $ /bin/bash -xe /tmp/jenkins5685655094568913907.sh
+ git clone https://github.com/GoogleCloudPlatform/PerfKitBenchmarker.git <https://builds.apache.org/job/beam_PerformanceTests_XmlIOIT_HDFS/ws/PerfKitBenchmarker>
Cloning into '<https://builds.apache.org/job/beam_PerformanceTests_XmlIOIT_HDFS/ws/PerfKitBenchmarker'...>
[beam_PerformanceTests_XmlIOIT_HDFS] $ /bin/bash -xe /tmp/jenkins2774632768111397859.sh
+ <https://builds.apache.org/job/beam_PerformanceTests_XmlIOIT_HDFS/ws/env/.beam_env/bin/pip> install -e '<https://builds.apache.org/job/beam_PerformanceTests_XmlIOIT_HDFS/ws/src/sdks/python/[gcp,test]'>
Obtaining file://<https://builds.apache.org/job/beam_PerformanceTests_XmlIOIT_HDFS/ws/src/sdks/python>
Exception:
Traceback (most recent call last):
  File "<https://builds.apache.org/job/beam_PerformanceTests_XmlIOIT_HDFS/ws/env/.beam_env/local/lib/python2.7/site-packages/pip/_internal/basecommand.py",> line 141, in main
    status = self.run(options, args)
  File "<https://builds.apache.org/job/beam_PerformanceTests_XmlIOIT_HDFS/ws/env/.beam_env/local/lib/python2.7/site-packages/pip/_internal/commands/install.py",> line 299, in run
    resolver.resolve(requirement_set)
  File "<https://builds.apache.org/job/beam_PerformanceTests_XmlIOIT_HDFS/ws/env/.beam_env/local/lib/python2.7/site-packages/pip/_internal/resolve.py",> line 102, in resolve
    self._resolve_one(requirement_set, req)
  File "<https://builds.apache.org/job/beam_PerformanceTests_XmlIOIT_HDFS/ws/env/.beam_env/local/lib/python2.7/site-packages/pip/_internal/resolve.py",> line 256, in _resolve_one
    abstract_dist = self._get_abstract_dist_for(req_to_install)
  File "<https://builds.apache.org/job/beam_PerformanceTests_XmlIOIT_HDFS/ws/env/.beam_env/local/lib/python2.7/site-packages/pip/_internal/resolve.py",> line 193, in _get_abstract_dist_for
    req, self.require_hashes, self.use_user_site, self.finder,
  File "<https://builds.apache.org/job/beam_PerformanceTests_XmlIOIT_HDFS/ws/env/.beam_env/local/lib/python2.7/site-packages/pip/_internal/operations/prepare.py",> line 329, in prepare_editable_requirement
    req.check_if_exists(use_user_site)
  File "<https://builds.apache.org/job/beam_PerformanceTests_XmlIOIT_HDFS/ws/env/.beam_env/local/lib/python2.7/site-packages/pip/_internal/req/req_install.py",> line 494, in check_if_exists
    self.req.name
  File "<https://builds.apache.org/job/beam_PerformanceTests_XmlIOIT_HDFS/ws/env/.beam_env/local/lib/python2.7/site-packages/pip/_vendor/pkg_resources/__init__.py",> line 468, in get_distribution
    dist = get_provider(dist)
  File "<https://builds.apache.org/job/beam_PerformanceTests_XmlIOIT_HDFS/ws/env/.beam_env/local/lib/python2.7/site-packages/pip/_vendor/pkg_resources/__init__.py",> line 344, in get_provider
    return working_set.find(moduleOrReq) or require(str(moduleOrReq))[0]
  File "<https://builds.apache.org/job/beam_PerformanceTests_XmlIOIT_HDFS/ws/env/.beam_env/local/lib/python2.7/site-packages/pip/_vendor/pkg_resources/__init__.py",> line 888, in require
    needed = self.resolve(parse_requirements(requirements))
  File "<https://builds.apache.org/job/beam_PerformanceTests_XmlIOIT_HDFS/ws/env/.beam_env/local/lib/python2.7/site-packages/pip/_vendor/pkg_resources/__init__.py",> line 779, in resolve
    raise VersionConflict(dist, req).with_context(dependent_req)
ContextualVersionConflict: (fastavro 0.19.7 (/home/jenkins/.local/lib/python2.7/site-packages), Requirement.parse('fastavro==0.21.4'), set(['apache-beam']))
Build step 'Execute shell' marked build as failure

Build failed in Jenkins: beam_PerformanceTests_XmlIOIT_HDFS #612

Posted by Apache Jenkins Server <je...@builds.apache.org>.
See <https://builds.apache.org/job/beam_PerformanceTests_XmlIOIT_HDFS/612/display/redirect>

------------------------------------------
Started by timer
[EnvInject] - Loading node environment variables.
Building remotely on beam10 (beam) in workspace <https://builds.apache.org/job/beam_PerformanceTests_XmlIOIT_HDFS/ws/>
 > git rev-parse --is-inside-work-tree # timeout=10
Fetching changes from the remote Git repository
 > git config remote.origin.url https://github.com/apache/beam.git # timeout=10
Fetching upstream changes from https://github.com/apache/beam.git
 > git --version # timeout=10
 > git fetch --tags --progress https://github.com/apache/beam.git +refs/heads/*:refs/remotes/origin/* +refs/pull/${ghprbPullId}/*:refs/remotes/origin/pr/${ghprbPullId}/*
 > git rev-parse origin/master^{commit} # timeout=10
Checking out Revision 44f21ece0d6247fbd9a7b94204287bacc1a0f199 (origin/master)
 > git config core.sparsecheckout # timeout=10
 > git checkout -f 44f21ece0d6247fbd9a7b94204287bacc1a0f199
Commit message: "Merge pull request #6322: [BEAM-5283] Add Jenkins script to Python Flink Portable compatibility matrix tests"
 > git rev-list --no-walk 44f21ece0d6247fbd9a7b94204287bacc1a0f199 # timeout=10
Cleaning workspace
 > git rev-parse --verify HEAD # timeout=10
Resetting working tree
 > git reset --hard # timeout=10
 > git clean -fdx # timeout=10
[EnvInject] - Executing scripts and injecting environment variables after the SCM step.
[EnvInject] - Injecting as environment variables the properties content 
SPARK_LOCAL_IP=127.0.0.1

[EnvInject] - Variables injected successfully.
[beam_PerformanceTests_XmlIOIT_HDFS] $ /bin/bash -xe /tmp/jenkins5839346246637418845.sh
+ gcloud container clusters get-credentials io-datastores --zone=us-central1-a --verbosity=debug
DEBUG: Running [gcloud.container.clusters.get-credentials] with arguments: [--verbosity: "debug", --zone: "us-central1-a", NAME: "io-datastores"]
Fetching cluster endpoint and auth data.
DEBUG: Saved kubeconfig to /home/jenkins/.kube/config
kubeconfig entry generated for io-datastores.
INFO: Display format "default".
DEBUG: SDK update checks are disabled.
[beam_PerformanceTests_XmlIOIT_HDFS] $ /bin/bash -xe /tmp/jenkins6565203506187491832.sh
+ cp /home/jenkins/.kube/config <https://builds.apache.org/job/beam_PerformanceTests_XmlIOIT_HDFS/ws/config-beam-performancetests-xmlioit-hdfs-612>
[beam_PerformanceTests_XmlIOIT_HDFS] $ /bin/bash -xe /tmp/jenkins1392287996975485652.sh
+ kubectl --kubeconfig=<https://builds.apache.org/job/beam_PerformanceTests_XmlIOIT_HDFS/ws/config-beam-performancetests-xmlioit-hdfs-612> create namespace beam-performancetests-xmlioit-hdfs-612
namespace "beam-performancetests-xmlioit-hdfs-612" created
[beam_PerformanceTests_XmlIOIT_HDFS] $ /bin/bash -xe /tmp/jenkins531286812640817936.sh
++ kubectl config current-context
+ kubectl --kubeconfig=<https://builds.apache.org/job/beam_PerformanceTests_XmlIOIT_HDFS/ws/config-beam-performancetests-xmlioit-hdfs-612> config set-context gke_apache-beam-testing_us-central1-a_io-datastores --namespace=beam-performancetests-xmlioit-hdfs-612
Context "gke_apache-beam-testing_us-central1-a_io-datastores" modified.
[beam_PerformanceTests_XmlIOIT_HDFS] $ /bin/bash -xe /tmp/jenkins7673882850676021751.sh
+ rm -rf <https://builds.apache.org/job/beam_PerformanceTests_XmlIOIT_HDFS/ws/PerfKitBenchmarker>
[beam_PerformanceTests_XmlIOIT_HDFS] $ /bin/bash -xe /tmp/jenkins4049968492028078861.sh
+ rm -rf <https://builds.apache.org/job/beam_PerformanceTests_XmlIOIT_HDFS/ws/env/.beam_env>
[beam_PerformanceTests_XmlIOIT_HDFS] $ /bin/bash -xe /tmp/jenkins8582321039939135430.sh
+ rm -rf <https://builds.apache.org/job/beam_PerformanceTests_XmlIOIT_HDFS/ws/env/.perfkit_env>
[beam_PerformanceTests_XmlIOIT_HDFS] $ /bin/bash -xe /tmp/jenkins3987498932634059810.sh
+ virtualenv <https://builds.apache.org/job/beam_PerformanceTests_XmlIOIT_HDFS/ws/env/.beam_env> --system-site-packages
New python executable in <https://builds.apache.org/job/beam_PerformanceTests_XmlIOIT_HDFS/ws/env/.beam_env/bin/python2>
Also creating executable in <https://builds.apache.org/job/beam_PerformanceTests_XmlIOIT_HDFS/ws/env/.beam_env/bin/python>
Installing setuptools, pkg_resources, pip, wheel...done.
Running virtualenv with interpreter /usr/bin/python2
[beam_PerformanceTests_XmlIOIT_HDFS] $ /bin/bash -xe /tmp/jenkins7587179377712815344.sh
+ virtualenv <https://builds.apache.org/job/beam_PerformanceTests_XmlIOIT_HDFS/ws/env/.perfkit_env> --system-site-packages
New python executable in <https://builds.apache.org/job/beam_PerformanceTests_XmlIOIT_HDFS/ws/env/.perfkit_env/bin/python2>
Also creating executable in <https://builds.apache.org/job/beam_PerformanceTests_XmlIOIT_HDFS/ws/env/.perfkit_env/bin/python>
Installing setuptools, pkg_resources, pip, wheel...done.
Running virtualenv with interpreter /usr/bin/python2
[beam_PerformanceTests_XmlIOIT_HDFS] $ /bin/bash -xe /tmp/jenkins5747191780054498258.sh
+ <https://builds.apache.org/job/beam_PerformanceTests_XmlIOIT_HDFS/ws/env/.beam_env/bin/pip> install --upgrade setuptools pip grpcio-tools==1.3.5
Requirement already up-to-date: setuptools in ./env/.beam_env/lib/python2.7/site-packages (40.2.0)
Requirement already up-to-date: pip in ./env/.beam_env/lib/python2.7/site-packages (18.0)
Collecting grpcio-tools==1.3.5
  Using cached https://files.pythonhosted.org/packages/05/f6/0296e29b1bac6f85d2a8556d48adf825307f73109a3c2c17fb734292db0a/grpcio_tools-1.3.5-cp27-cp27mu-manylinux1_x86_64.whl
Requirement already satisfied, skipping upgrade: grpcio>=1.3.5 in /home/jenkins/.local/lib/python2.7/site-packages (from grpcio-tools==1.3.5) (1.13.0)
Requirement already satisfied, skipping upgrade: protobuf>=3.2.0 in /home/jenkins/.local/lib/python2.7/site-packages (from grpcio-tools==1.3.5) (3.6.0)
Requirement already satisfied, skipping upgrade: six>=1.5.2 in /usr/local/lib/python2.7/dist-packages (from grpcio>=1.3.5->grpcio-tools==1.3.5) (1.11.0)
Requirement already satisfied, skipping upgrade: enum34>=1.0.4 in /usr/local/lib/python2.7/dist-packages (from grpcio>=1.3.5->grpcio-tools==1.3.5) (1.1.6)
Requirement already satisfied, skipping upgrade: futures>=2.2.0 in /home/jenkins/.local/lib/python2.7/site-packages (from grpcio>=1.3.5->grpcio-tools==1.3.5) (3.2.0)
Installing collected packages: grpcio-tools
Successfully installed grpcio-tools-1.3.5
[beam_PerformanceTests_XmlIOIT_HDFS] $ /bin/bash -xe /tmp/jenkins1891091679420409387.sh
+ <https://builds.apache.org/job/beam_PerformanceTests_XmlIOIT_HDFS/ws/env/.perfkit_env/bin/pip> install --upgrade setuptools pip
Requirement already up-to-date: setuptools in ./env/.perfkit_env/lib/python2.7/site-packages (40.2.0)
Requirement already up-to-date: pip in ./env/.perfkit_env/lib/python2.7/site-packages (18.0)
[beam_PerformanceTests_XmlIOIT_HDFS] $ /bin/bash -xe /tmp/jenkins3800520702777994185.sh
+ git clone https://github.com/GoogleCloudPlatform/PerfKitBenchmarker.git <https://builds.apache.org/job/beam_PerformanceTests_XmlIOIT_HDFS/ws/PerfKitBenchmarker>
Cloning into '<https://builds.apache.org/job/beam_PerformanceTests_XmlIOIT_HDFS/ws/PerfKitBenchmarker'...>
[beam_PerformanceTests_XmlIOIT_HDFS] $ /bin/bash -xe /tmp/jenkins7369290347405548678.sh
+ <https://builds.apache.org/job/beam_PerformanceTests_XmlIOIT_HDFS/ws/env/.beam_env/bin/pip> install -e '<https://builds.apache.org/job/beam_PerformanceTests_XmlIOIT_HDFS/ws/src/sdks/python/[gcp,test]'>
Obtaining file://<https://builds.apache.org/job/beam_PerformanceTests_XmlIOIT_HDFS/ws/src/sdks/python>
Exception:
Traceback (most recent call last):
  File "<https://builds.apache.org/job/beam_PerformanceTests_XmlIOIT_HDFS/ws/env/.beam_env/local/lib/python2.7/site-packages/pip/_internal/basecommand.py",> line 141, in main
    status = self.run(options, args)
  File "<https://builds.apache.org/job/beam_PerformanceTests_XmlIOIT_HDFS/ws/env/.beam_env/local/lib/python2.7/site-packages/pip/_internal/commands/install.py",> line 299, in run
    resolver.resolve(requirement_set)
  File "<https://builds.apache.org/job/beam_PerformanceTests_XmlIOIT_HDFS/ws/env/.beam_env/local/lib/python2.7/site-packages/pip/_internal/resolve.py",> line 102, in resolve
    self._resolve_one(requirement_set, req)
  File "<https://builds.apache.org/job/beam_PerformanceTests_XmlIOIT_HDFS/ws/env/.beam_env/local/lib/python2.7/site-packages/pip/_internal/resolve.py",> line 256, in _resolve_one
    abstract_dist = self._get_abstract_dist_for(req_to_install)
  File "<https://builds.apache.org/job/beam_PerformanceTests_XmlIOIT_HDFS/ws/env/.beam_env/local/lib/python2.7/site-packages/pip/_internal/resolve.py",> line 193, in _get_abstract_dist_for
    req, self.require_hashes, self.use_user_site, self.finder,
  File "<https://builds.apache.org/job/beam_PerformanceTests_XmlIOIT_HDFS/ws/env/.beam_env/local/lib/python2.7/site-packages/pip/_internal/operations/prepare.py",> line 329, in prepare_editable_requirement
    req.check_if_exists(use_user_site)
  File "<https://builds.apache.org/job/beam_PerformanceTests_XmlIOIT_HDFS/ws/env/.beam_env/local/lib/python2.7/site-packages/pip/_internal/req/req_install.py",> line 494, in check_if_exists
    self.req.name
  File "<https://builds.apache.org/job/beam_PerformanceTests_XmlIOIT_HDFS/ws/env/.beam_env/local/lib/python2.7/site-packages/pip/_vendor/pkg_resources/__init__.py",> line 468, in get_distribution
    dist = get_provider(dist)
  File "<https://builds.apache.org/job/beam_PerformanceTests_XmlIOIT_HDFS/ws/env/.beam_env/local/lib/python2.7/site-packages/pip/_vendor/pkg_resources/__init__.py",> line 344, in get_provider
    return working_set.find(moduleOrReq) or require(str(moduleOrReq))[0]
  File "<https://builds.apache.org/job/beam_PerformanceTests_XmlIOIT_HDFS/ws/env/.beam_env/local/lib/python2.7/site-packages/pip/_vendor/pkg_resources/__init__.py",> line 888, in require
    needed = self.resolve(parse_requirements(requirements))
  File "<https://builds.apache.org/job/beam_PerformanceTests_XmlIOIT_HDFS/ws/env/.beam_env/local/lib/python2.7/site-packages/pip/_vendor/pkg_resources/__init__.py",> line 779, in resolve
    raise VersionConflict(dist, req).with_context(dependent_req)
ContextualVersionConflict: (fastavro 0.19.7 (/home/jenkins/.local/lib/python2.7/site-packages), Requirement.parse('fastavro==0.21.4'), set(['apache-beam']))
Build step 'Execute shell' marked build as failure