You are viewing a plain text version of this content. The canonical link for it is here.
Posted to dev@shindig.apache.org by Apache Hudson Server <hu...@hudson.apache.org> on 2010/12/16 00:54:54 UTC

Build failed in Hudson: Shindig #2056

See <https://hudson.apache.org/hudson/job/Shindig/2056/changes>

Changes:

[mhermanto] Refactor getHeight() calculation, so it can be re-used independent of dynamic-height.
http://codereview.appspot.com/3651041/

------------------------------------------
[...truncated 543 lines...]
Tests run: 2, Failures: 0, Errors: 0, Skipped: 0, Time elapsed: 0.024 sec
Running org.apache.shindig.common.JsonSerializerTest
Tests run: 15, Failures: 0, Errors: 0, Skipped: 0, Time elapsed: 0.027 sec
Running org.apache.shindig.common.cache.LruCacheProviderTest
Dec 15, 2010 11:54:26 PM org.apache.shindig.common.cache.LruCacheProvider getCapacity(String name)
WARNING: Invalid LRU capacity configured for foo.
Tests run: 5, Failures: 0, Errors: 0, Skipped: 0, Time elapsed: 0.011 sec
Running org.apache.shindig.common.xml.DomUtilTest
Tests run: 3, Failures: 0, Errors: 0, Skipped: 0, Time elapsed: 0.005 sec
Running org.apache.shindig.config.JsonContainerConfigLoaderTest
Dec 15, 2010 11:54:26 PM org.apache.shindig.config.JsonContainerConfigLoader loadContainers
INFO: Loading files from/tmp/org.apache.shindig.config.JsonContainerConfigLoaderTest1000074925793077314.json
Dec 15, 2010 11:54:26 PM org.apache.shindig.config.JsonContainerConfigLoader loadFiles
INFO: Reading container config: org.apache.shindig.config.JsonContainerConfigLoaderTest1000074925793077314.json.
Dec 15, 2010 11:54:26 PM org.apache.shindig.config.JsonContainerConfigLoader loadContainers
INFO: Loading files from/tmp/org.apache.shindig.config.JsonContainerConfigLoaderTest1407167574766180653.json
Dec 15, 2010 11:54:26 PM org.apache.shindig.config.JsonContainerConfigLoader loadFiles
INFO: Reading container config: org.apache.shindig.config.JsonContainerConfigLoaderTest1407167574766180653.json.
Dec 15, 2010 11:54:26 PM org.apache.shindig.config.JsonContainerConfigLoader loadContainers
INFO: Loading files from/tmp/org.apache.shindig.config.JsonContainerConfigLoaderTest2988710314418769056.json
Dec 15, 2010 11:54:26 PM org.apache.shindig.config.JsonContainerConfigLoader loadFiles
INFO: Reading container config: org.apache.shindig.config.JsonContainerConfigLoaderTest2988710314418769056.json.
Dec 15, 2010 11:54:26 PM org.apache.shindig.config.JsonContainerConfigLoader loadContainers
INFO: Loading files from/tmp/org.apache.shindig.config.JsonContainerConfigLoaderTest1371720809337694482.json
Dec 15, 2010 11:54:26 PM org.apache.shindig.config.JsonContainerConfigLoader loadFiles
INFO: Reading container config: org.apache.shindig.config.JsonContainerConfigLoaderTest1371720809337694482.json.
Dec 15, 2010 11:54:26 PM org.apache.shindig.config.JsonContainerConfigLoader loadContainers
INFO: Loading files from/tmp/org.apache.shindig.config.JsonContainerConfigLoaderTest611937573955186441.json
Dec 15, 2010 11:54:26 PM org.apache.shindig.config.JsonContainerConfigLoader loadFiles
INFO: Reading container config: org.apache.shindig.config.JsonContainerConfigLoaderTest611937573955186441.json.
Dec 15, 2010 11:54:26 PM org.apache.shindig.config.JsonContainerConfigLoader loadContainers
INFO: Loading files from/tmp/org.apache.shindig.config.JsonContainerConfigLoaderTest3202123295948735602.json
Dec 15, 2010 11:54:26 PM org.apache.shindig.config.JsonContainerConfigLoader loadFiles
INFO: Reading container config: org.apache.shindig.config.JsonContainerConfigLoaderTest3202123295948735602.json.
Dec 15, 2010 11:54:26 PM org.apache.shindig.config.JsonContainerConfigLoader loadContainers
INFO: Loading files from/tmp/org.apache.shindig.config.JsonContainerConfigLoaderTest8511850357860679385.json
Dec 15, 2010 11:54:26 PM org.apache.shindig.config.JsonContainerConfigLoader loadFiles
INFO: Reading container config: org.apache.shindig.config.JsonContainerConfigLoaderTest8511850357860679385.json.
Dec 15, 2010 11:54:26 PM org.apache.shindig.config.JsonContainerConfigLoader loadContainers
INFO: Loading files from/tmp/org.apache.shindig.config.JsonContainerConfigLoaderTest779412601790281385.json
Dec 15, 2010 11:54:26 PM org.apache.shindig.config.JsonContainerConfigLoader loadFiles
INFO: Reading container config: org.apache.shindig.config.JsonContainerConfigLoaderTest779412601790281385.json.
Dec 15, 2010 11:54:26 PM org.apache.shindig.config.JsonContainerConfigLoader loadContainers
INFO: Loading files from/tmp/org.apache.shindig.config.JsonContainerConfigLoaderTest9094621631171097041.json
Dec 15, 2010 11:54:26 PM org.apache.shindig.config.JsonContainerConfigLoader loadFiles
INFO: Reading container config: org.apache.shindig.config.JsonContainerConfigLoaderTest9094621631171097041.json.
Dec 15, 2010 11:54:26 PM org.apache.shindig.config.JsonContainerConfigLoader loadContainers
INFO: Loading files from/tmp/org.apache.shindig.config.JsonContainerConfigLoaderTest4867565034022630333.json
Dec 15, 2010 11:54:26 PM org.apache.shindig.config.JsonContainerConfigLoader loadFiles
INFO: Reading container config: org.apache.shindig.config.JsonContainerConfigLoaderTest4867565034022630333.json.
Dec 15, 2010 11:54:26 PM org.apache.shindig.config.JsonContainerConfigLoader loadContainers
INFO: Loading files from/tmp/org.apache.shindig.config.JsonContainerConfigLoaderTest2011167012912780565.json
Dec 15, 2010 11:54:26 PM org.apache.shindig.config.JsonContainerConfigLoader loadFiles
INFO: Reading container config: org.apache.shindig.config.JsonContainerConfigLoaderTest2011167012912780565.json.
Dec 15, 2010 11:54:26 PM org.apache.shindig.config.JsonContainerConfigLoader loadContainers
INFO: Loading files from/tmp/org.apache.shindig.config.JsonContainerConfigLoaderTest1545524448038289135.json
Dec 15, 2010 11:54:26 PM org.apache.shindig.config.JsonContainerConfigLoader loadFiles
INFO: Reading container config: org.apache.shindig.config.JsonContainerConfigLoaderTest1545524448038289135.json.
Dec 15, 2010 11:54:26 PM org.apache.shindig.config.JsonContainerConfigLoader loadContainers
INFO: Loading files from/tmp/org.apache.shindig.config.JsonContainerConfigLoaderTest2824441862506493092.json
Dec 15, 2010 11:54:26 PM org.apache.shindig.config.JsonContainerConfigLoader loadFiles
INFO: Reading container config: org.apache.shindig.config.JsonContainerConfigLoaderTest2824441862506493092.json.
Dec 15, 2010 11:54:26 PM org.apache.shindig.config.JsonContainerConfigLoader loadContainers
INFO: Loading files from/tmp/org.apache.shindig.config.JsonContainerConfigLoaderTest1880018792483794025.json
Dec 15, 2010 11:54:26 PM org.apache.shindig.config.JsonContainerConfigLoader loadFiles
INFO: Reading container config: org.apache.shindig.config.JsonContainerConfigLoaderTest1880018792483794025.json.
Dec 15, 2010 11:54:26 PM org.apache.shindig.config.JsonContainerConfigLoader loadContainers
INFO: Loading files from/tmp/org.apache.shindig.config.JsonContainerConfigLoaderTest3942795523734897049.json
Dec 15, 2010 11:54:26 PM org.apache.shindig.config.JsonContainerConfigLoader loadFiles
INFO: Reading container config: org.apache.shindig.config.JsonContainerConfigLoaderTest3942795523734897049.json.
Dec 15, 2010 11:54:26 PM org.apache.shindig.config.JsonContainerConfigLoader loadContainers
INFO: Loading files from/tmp/org.apache.shindig.config.JsonContainerConfigLoaderTest7994251878558027721.json
Dec 15, 2010 11:54:26 PM org.apache.shindig.config.JsonContainerConfigLoader loadFiles
INFO: Reading container config: org.apache.shindig.config.JsonContainerConfigLoaderTest7994251878558027721.json.
Dec 15, 2010 11:54:26 PM org.apache.shindig.config.JsonContainerConfigLoader loadContainers
INFO: Loading files from/tmp/org.apache.shindig.config.JsonContainerConfigLoaderTest3666971986256146307.json
Dec 15, 2010 11:54:26 PM org.apache.shindig.config.JsonContainerConfigLoader loadFiles
INFO: Reading container config: org.apache.shindig.config.JsonContainerConfigLoaderTest3666971986256146307.json.
Tests run: 12, Failures: 0, Errors: 0, Skipped: 0, Time elapsed: 0.021 sec
Running org.apache.shindig.protocol.conversion.BeanJsonConverterTest
Tests run: 7, Failures: 0, Errors: 0, Skipped: 0, Time elapsed: 0.022 sec
Running org.apache.shindig.protocol.ContentTypesTest
Tests run: 8, Failures: 0, Errors: 0, Skipped: 0, Time elapsed: 0.005 sec
Running org.apache.shindig.auth.UrlParameterAuthenticationHandlerTest
Tests run: 6, Failures: 0, Errors: 0, Skipped: 0, Time elapsed: 0.01 sec
Running org.apache.shindig.protocol.conversion.BeanFilterTest
Tests run: 8, Failures: 0, Errors: 0, Skipped: 0, Time elapsed: 0.014 sec
Running org.apache.shindig.common.util.ImmediateFutureTest
Tests run: 6, Failures: 0, Errors: 0, Skipped: 0, Time elapsed: 0.004 sec
Running org.apache.shindig.common.uri.UriTest
Tests run: 24, Failures: 0, Errors: 0, Skipped: 0, Time elapsed: 0.015 sec
Running org.apache.shindig.common.cache.ehcache.EhCacheCacheProviderTest
Tests run: 1, Failures: 0, Errors: 0, Skipped: 0, Time elapsed: 0.146 sec
Running org.apache.shindig.common.PairTest
Tests run: 1, Failures: 0, Errors: 0, Skipped: 0, Time elapsed: 0.002 sec
Running org.apache.shindig.common.util.DateUtilTest
Tests run: 11, Failures: 0, Errors: 0, Skipped: 0, Time elapsed: 0.018 sec
Running org.apache.shindig.auth.AuthInfoUtilTest
Tests run: 2, Failures: 0, Errors: 0, Skipped: 0, Time elapsed: 0.006 sec
Running org.apache.shindig.common.cache.LruCacheTest
Tests run: 2, Failures: 0, Errors: 0, Skipped: 0, Time elapsed: 0.002 sec

Results :

Tests run: 404, Failures: 0, Errors: 0, Skipped: 3

[TASKS] Skipping maven reporter: there is already a result available.
[HUDSON] Recording test results
[INFO] [jar:jar {execution: default-jar}]
[INFO] Building jar: <https://hudson.apache.org/hudson/job/Shindig/ws/trunk/java/common/target/shindig-common-3.0.0-SNAPSHOT.jar>
[TASKS] Skipping maven reporter: there is already a result available.[INFO] Preparing source:jar
[WARNING] Removing: jar from forked lifecycle, to prevent recursive invocation.

[HUDSON] Archiving <https://hudson.apache.org/hudson/job/Shindig/ws/trunk/java/common/pom.xml> to /home/hudson/hudson/jobs/Shindig/modules/org.apache.shindig$shindig-common/builds/2010-12-15_23-52-58/archive/org.apache.shindig/shindig-common/3.0.0-SNAPSHOT/pom.xml
[HUDSON] Archiving <https://hudson.apache.org/hudson/job/Shindig/ws/trunk/java/common/target/shindig-common-3.0.0-SNAPSHOT.jar> to /home/hudson/hudson/jobs/Shindig/modules/org.apache.shindig$shindig-common/builds/2010-12-15_23-52-58/archive/org.apache.shindig/shindig-common/3.0.0-SNAPSHOT/shindig-common-3.0.0-SNAPSHOT.jar
[INFO] [enforcer:enforce {execution: enforce-java}]
[TASKS] Skipping maven reporter: there is already a result available.
[INFO] [source:jar {execution: attach-sources}]
[INFO] org already added, skipping
[INFO] org/apache already added, skipping
[INFO] org/apache/shindig already added, skipping
[INFO] org/apache/shindig/common already added, skipping
[INFO] org/apache/shindig/common/cache already added, skipping
[INFO] org/apache/shindig/common/cache/ehcache already added, skipping
[INFO] org/apache/shindig/common/logging already added, skipping
[INFO] org/apache/shindig/common/logging/i18n already added, skipping
[INFO] META-INF already added, skipping
[INFO] META-INF/LICENSE already added, skipping
[INFO] META-INF/DEPENDENCIES already added, skipping
[INFO] META-INF/NOTICE already added, skipping
[INFO] Building jar: <https://hudson.apache.org/hudson/job/Shindig/ws/trunk/java/common/target/shindig-common-3.0.0-SNAPSHOT-sources.jar>
[INFO] org already added, skipping
[INFO] org/apache already added, skipping
[INFO] org/apache/shindig already added, skipping
[INFO] org/apache/shindig/common already added, skipping
[INFO] org/apache/shindig/common/cache already added, skipping
[INFO] org/apache/shindig/common/cache/ehcache already added, skipping
[INFO] org/apache/shindig/common/logging already added, skipping
[INFO] org/apache/shindig/common/logging/i18n already added, skipping
[INFO] META-INF already added, skipping
[INFO] META-INF/LICENSE already added, skipping
[INFO] META-INF/DEPENDENCIES already added, skipping
[INFO] META-INF/NOTICE already added, skipping
[TASKS] Skipping maven reporter: there is already a result available.
[INFO] Preparing source:test-jar
[WARNING] Removing: jar from forked lifecycle, to prevent recursive invocation.
[WARNING] Removing: test-jar from forked lifecycle, to prevent recursive invocation.
[HUDSON] Archiving <https://hudson.apache.org/hudson/job/Shindig/ws/trunk/java/common/target/shindig-common-3.0.0-SNAPSHOT-sources.jar> to /home/hudson/hudson/jobs/Shindig/modules/org.apache.shindig$shindig-common/builds/2010-12-15_23-52-58/archive/org.apache.shindig/shindig-common/3.0.0-SNAPSHOT/shindig-common-3.0.0-SNAPSHOT-sources.jar
[INFO] [enforcer:enforce {execution: enforce-java}]
[TASKS] Skipping maven reporter: there is already a result available.
[INFO] [source:test-jar {execution: attach-sources}]
[INFO] META-INF already added, skipping
[INFO] META-INF/LICENSE already added, skipping
[INFO] META-INF/DEPENDENCIES already added, skipping
[INFO] META-INF/NOTICE already added, skipping
[INFO] Building jar: <https://hudson.apache.org/hudson/job/Shindig/ws/trunk/java/common/target/shindig-common-3.0.0-SNAPSHOT-test-sources.jar>
[INFO] META-INF already added, skipping
[INFO] META-INF/LICENSE already added, skipping
[INFO] META-INF/DEPENDENCIES already added, skipping
[INFO] META-INF/NOTICE already added, skipping
[TASKS] Skipping maven reporter: there is already a result available.
[INFO] [jar:test-jar {execution: default}]
[INFO] Building jar: <https://hudson.apache.org/hudson/job/Shindig/ws/trunk/java/common/target/shindig-common-3.0.0-SNAPSHOT-tests.jar>
[TASKS] Skipping maven reporter: there is already a result available.[INFO] [tools:verify-legal-files {execution: verify-legal-files}]
[INFO] Checking legal files in: shindig-common-3.0.0-SNAPSHOT.jar
[INFO] Checking legal files in: shindig-common-3.0.0-SNAPSHOT-sources.jar
[INFO] Checking legal files in: shindig-common-3.0.0-SNAPSHOT-test-sources.jar
[INFO] Checking legal files in: shindig-common-3.0.0-SNAPSHOT-tests.jar

[TASKS] Skipping maven reporter: there is already a result available.[INFO] [install:install {execution: default-install}]
[INFO] Installing <https://hudson.apache.org/hudson/job/Shindig/ws/trunk/java/common/target/shindig-common-3.0.0-SNAPSHOT.jar> to /home/hudson/.m2/repository/org/apache/shindig/shindig-common/3.0.0-SNAPSHOT/shindig-common-3.0.0-SNAPSHOT.jar
[INFO] Installing <https://hudson.apache.org/hudson/job/Shindig/ws/trunk/java/common/target/shindig-common-3.0.0-SNAPSHOT-sources.jar> to /home/hudson/.m2/repository/org/apache/shindig/shindig-common/3.0.0-SNAPSHOT/shindig-common-3.0.0-SNAPSHOT-sources.jar
[INFO] Installing <https://hudson.apache.org/hudson/job/Shindig/ws/trunk/java/common/target/shindig-common-3.0.0-SNAPSHOT-test-sources.jar> to /home/hudson/.m2/repository/org/apache/shindig/shindig-common/3.0.0-SNAPSHOT/shindig-common-3.0.0-SNAPSHOT-test-sources.jar
[INFO] Installing <https://hudson.apache.org/hudson/job/Shindig/ws/trunk/java/common/target/shindig-common-3.0.0-SNAPSHOT-tests.jar> to /home/hudson/.m2/repository/org/apache/shindig/shindig-common/3.0.0-SNAPSHOT/shindig-common-3.0.0-SNAPSHOT-tests.jar

[TASKS] Skipping maven reporter: there is already a result available.
[HUDSON] Archiving <https://hudson.apache.org/hudson/job/Shindig/ws/trunk/java/common/target/shindig-common-3.0.0-SNAPSHOT-test-sources.jar> to /home/hudson/hudson/jobs/Shindig/modules/org.apache.shindig$shindig-common/builds/2010-12-15_23-52-58/archive/org.apache.shindig/shindig-common/3.0.0-SNAPSHOT/shindig-common-3.0.0-SNAPSHOT-test-sources.jar
[HUDSON] Archiving <https://hudson.apache.org/hudson/job/Shindig/ws/trunk/java/common/target/shindig-common-3.0.0-SNAPSHOT-tests.jar> to /home/hudson/hudson/jobs/Shindig/modules/org.apache.shindig$shindig-common/builds/2010-12-15_23-52-58/archive/org.apache.shindig/shindig-common/3.0.0-SNAPSHOT/shindig-common-3.0.0-SNAPSHOT-tests.jar
[INFO] ------------------------------------------------------------------------
[INFO] Building Apache Shindig Gadget Renderer
[INFO]    task-segment: [clean, install]
[INFO] ------------------------------------------------------------------------
[INFO] [clean:clean {execution: default-clean}]
[INFO] Deleting <https://hudson.apache.org/hudson/job/Shindig/ws/trunk/java/gadgets/target>
[TASKS] Scanning folder '<https://hudson.apache.org/hudson/job/Shindig/ws/trunk/java/gadgets/src/main/java'> for tasks ... 
[TASKS] Found 0.
[TASKS] Scanning folder '<https://hudson.apache.org/hudson/job/Shindig/ws/trunk/java/gadgets/src/test/java'> for tasks ... 
[TASKS] Found 0.
[TASKS] Scanning folder '<https://hudson.apache.org/hudson/job/Shindig/ws/trunk/java/gadgets/../../config'> for tasks ... 
[TASKS] Found 0.
[TASKS] Scanning folder '<https://hudson.apache.org/hudson/job/Shindig/ws/trunk/java/gadgets/src/main/resources'> for tasks ... 
[TASKS] Found 0.
[TASKS] Scanning folder '<https://hudson.apache.org/hudson/job/Shindig/ws/trunk/java/gadgets/../../content'> for tasks ... 
[TASKS] Found 0.
[TASKS] Scanning folder '<https://hudson.apache.org/hudson/job/Shindig/ws/trunk/java/gadgets/src/test/resources'> for tasks ... 
[TASKS] Found 0.
[WARNING] While downloading xml-apis:xml-apis:2.0.2
  This artifact has been relocated to xml-apis:xml-apis:1.0.b2.


[INFO] [enforcer:enforce {execution: enforce-java}]
[TASKS] Skipping maven reporter: there is already a result available.
[INFO] [remote-resources:process {execution: default}]
[TASKS] Skipping maven reporter: there is already a result available.[INFO] [resources:resources {execution: default-resources}]
[INFO] Using 'UTF-8' encoding to copy filtered resources.
[INFO] Copying 2 resources to config
[INFO] Copying 0 resource
[INFO] Copying 2 resources to files
[INFO] Copying 3 resources

[TASKS] Skipping maven reporter: there is already a result available.[INFO] [compiler:compile {execution: default-compile}]

[INFO] Compiling 260 source files to <https://hudson.apache.org/hudson/job/Shindig/ws/trunk/java/gadgets/target/classes>
[INFO] -------------------------------------------------------------
[WARNING] COMPILATION WARNING : 
[INFO] -------------------------------------------------------------
[WARNING] <https://hudson.apache.org/hudson/job/Shindig/ws/trunk/java/gadgets/src/main/java/org/apache/shindig/gadgets/parse/caja/VanillaCajaHtmlSerializer.java>:[41,21] [deprecation] render(org.w3c.dom.Node,boolean) in com.google.caja.parser.html.Nodes has been deprecated
[WARNING] <https://hudson.apache.org/hudson/job/Shindig/ws/trunk/java/gadgets/src/main/java/org/apache/shindig/gadgets/parse/caja/CajaHtmlSerializer.java>:[39,16] [deprecation] render(org.w3c.dom.Node,boolean) in com.google.caja.parser.html.Nodes has been deprecated
[INFO] 2 warnings 
[INFO] -------------------------------------------------------------
[INFO] -------------------------------------------------------------
[ERROR] COMPILATION ERROR : 
[INFO] -------------------------------------------------------------
[ERROR] <https://hudson.apache.org/hudson/job/Shindig/ws/trunk/java/gadgets/src/main/java/org/apache/shindig/gadgets/rewrite/image/JpegImageUtils.java>:[171,35] cannot find symbol
symbol  : method copyOf(int[],int)
location: class java.util.Arrays
[INFO] 1 error
[INFO] -------------------------------------------------------------
[TASKS] Skipping maven reporter: there is already a result available.
[HUDSON] Archiving <https://hudson.apache.org/hudson/job/Shindig/ws/trunk/java/gadgets/pom.xml> to /home/hudson/hudson/jobs/Shindig/modules/org.apache.shindig$shindig-gadgets/builds/2010-12-15_23-52-58/archive/org.apache.shindig/shindig-gadgets/3.0.0-SNAPSHOT/pom.xml
[INFO] ------------------------------------------------------------------------
[ERROR] BUILD FAILURE
[INFO] ------------------------------------------------------------------------
[INFO] Compilation failure
<https://hudson.apache.org/hudson/job/Shindig/ws/trunk/java/gadgets/src/main/java/org/apache/shindig/gadgets/rewrite/image/JpegImageUtils.java>:[171,35] cannot find symbol
symbol  : method copyOf(int[],int)
location: class java.util.Arrays

[INFO] ------------------------------------------------------------------------
[INFO] For more information, run Maven with the -e switch
[INFO] ------------------------------------------------------------------------
[INFO] Total time: 1 minute 42 seconds
[INFO] Finished at: Wed Dec 15 23:54:52 UTC 2010
[INFO] Final Memory: 58M/264M
[INFO] ------------------------------------------------------------------------
Waiting for Hudson to finish collecting data
Sending e-mails to: dev@shindig.apache.org
channel stopped
[WARNINGS] Skipping publisher since build result is FAILURE


Build failed in Hudson: Shindig #2062

Posted by Apache Hudson Server <hu...@hudson.apache.org>.
See <https://hudson.apache.org/hudson/job/Shindig/2062/changes>

Changes:

[hsaputra] change the path in the common container to point to working gadget.xml url for sample

------------------------------------------
[...truncated 535 lines...]
Running org.apache.shindig.common.cache.SoftExpiringCacheTest
Tests run: 2, Failures: 0, Errors: 0, Skipped: 0, Time elapsed: 0.027 sec
Running org.apache.shindig.common.JsonSerializerTest
Tests run: 15, Failures: 0, Errors: 0, Skipped: 0, Time elapsed: 0.026 sec
Running org.apache.shindig.common.cache.LruCacheProviderTest
Dec 17, 2010 2:46:13 AM org.apache.shindig.common.cache.LruCacheProvider getCapacity(String name)
WARNING: Invalid LRU capacity configured for foo.
Tests run: 5, Failures: 0, Errors: 0, Skipped: 0, Time elapsed: 0.011 sec
Running org.apache.shindig.common.xml.DomUtilTest
Tests run: 3, Failures: 0, Errors: 0, Skipped: 0, Time elapsed: 0.005 sec
Running org.apache.shindig.config.JsonContainerConfigLoaderTest
Dec 17, 2010 2:46:13 AM org.apache.shindig.config.JsonContainerConfigLoader loadContainers
INFO: Loading files from/tmp/org.apache.shindig.config.JsonContainerConfigLoaderTest4172621065731840027.json
Dec 17, 2010 2:46:13 AM org.apache.shindig.config.JsonContainerConfigLoader loadFiles
INFO: Reading container config: org.apache.shindig.config.JsonContainerConfigLoaderTest4172621065731840027.json.
Dec 17, 2010 2:46:13 AM org.apache.shindig.config.JsonContainerConfigLoader loadContainers
INFO: Loading files from/tmp/org.apache.shindig.config.JsonContainerConfigLoaderTest8066046087132728107.json
Dec 17, 2010 2:46:13 AM org.apache.shindig.config.JsonContainerConfigLoader loadFiles
INFO: Reading container config: org.apache.shindig.config.JsonContainerConfigLoaderTest8066046087132728107.json.
Dec 17, 2010 2:46:13 AM org.apache.shindig.config.JsonContainerConfigLoader loadContainers
INFO: Loading files from/tmp/org.apache.shindig.config.JsonContainerConfigLoaderTest9007268530498619322.json
Dec 17, 2010 2:46:13 AM org.apache.shindig.config.JsonContainerConfigLoader loadFiles
INFO: Reading container config: org.apache.shindig.config.JsonContainerConfigLoaderTest9007268530498619322.json.
Dec 17, 2010 2:46:13 AM org.apache.shindig.config.JsonContainerConfigLoader loadContainers
INFO: Loading files from/tmp/org.apache.shindig.config.JsonContainerConfigLoaderTest6919800529503019201.json
Dec 17, 2010 2:46:13 AM org.apache.shindig.config.JsonContainerConfigLoader loadFiles
INFO: Reading container config: org.apache.shindig.config.JsonContainerConfigLoaderTest6919800529503019201.json.
Dec 17, 2010 2:46:13 AM org.apache.shindig.config.JsonContainerConfigLoader loadContainers
INFO: Loading files from/tmp/org.apache.shindig.config.JsonContainerConfigLoaderTest5187892386281057766.json
Dec 17, 2010 2:46:13 AM org.apache.shindig.config.JsonContainerConfigLoader loadFiles
INFO: Reading container config: org.apache.shindig.config.JsonContainerConfigLoaderTest5187892386281057766.json.
Dec 17, 2010 2:46:13 AM org.apache.shindig.config.JsonContainerConfigLoader loadContainers
INFO: Loading files from/tmp/org.apache.shindig.config.JsonContainerConfigLoaderTest2176000524805253408.json
Dec 17, 2010 2:46:13 AM org.apache.shindig.config.JsonContainerConfigLoader loadFiles
INFO: Reading container config: org.apache.shindig.config.JsonContainerConfigLoaderTest2176000524805253408.json.
Dec 17, 2010 2:46:13 AM org.apache.shindig.config.JsonContainerConfigLoader loadContainers
INFO: Loading files from/tmp/org.apache.shindig.config.JsonContainerConfigLoaderTest7144782781319397140.json
Dec 17, 2010 2:46:13 AM org.apache.shindig.config.JsonContainerConfigLoader loadFiles
INFO: Reading container config: org.apache.shindig.config.JsonContainerConfigLoaderTest7144782781319397140.json.
Dec 17, 2010 2:46:13 AM org.apache.shindig.config.JsonContainerConfigLoader loadContainers
INFO: Loading files from/tmp/org.apache.shindig.config.JsonContainerConfigLoaderTest399249483710905953.json
Dec 17, 2010 2:46:13 AM org.apache.shindig.config.JsonContainerConfigLoader loadFiles
INFO: Reading container config: org.apache.shindig.config.JsonContainerConfigLoaderTest399249483710905953.json.
Dec 17, 2010 2:46:13 AM org.apache.shindig.config.JsonContainerConfigLoader loadContainers
INFO: Loading files from/tmp/org.apache.shindig.config.JsonContainerConfigLoaderTest3026442116811936772.json
Dec 17, 2010 2:46:13 AM org.apache.shindig.config.JsonContainerConfigLoader loadFiles
INFO: Reading container config: org.apache.shindig.config.JsonContainerConfigLoaderTest3026442116811936772.json.
Dec 17, 2010 2:46:13 AM org.apache.shindig.config.JsonContainerConfigLoader loadContainers
INFO: Loading files from/tmp/org.apache.shindig.config.JsonContainerConfigLoaderTest8576867686879041255.json
Dec 17, 2010 2:46:13 AM org.apache.shindig.config.JsonContainerConfigLoader loadFiles
INFO: Reading container config: org.apache.shindig.config.JsonContainerConfigLoaderTest8576867686879041255.json.
Dec 17, 2010 2:46:13 AM org.apache.shindig.config.JsonContainerConfigLoader loadContainers
INFO: Loading files from/tmp/org.apache.shindig.config.JsonContainerConfigLoaderTest7550009779767158287.json
Dec 17, 2010 2:46:13 AM org.apache.shindig.config.JsonContainerConfigLoader loadFiles
INFO: Reading container config: org.apache.shindig.config.JsonContainerConfigLoaderTest7550009779767158287.json.
Dec 17, 2010 2:46:13 AM org.apache.shindig.config.JsonContainerConfigLoader loadContainers
INFO: Loading files from/tmp/org.apache.shindig.config.JsonContainerConfigLoaderTest5788311443434510709.json
Dec 17, 2010 2:46:13 AM org.apache.shindig.config.JsonContainerConfigLoader loadFiles
INFO: Reading container config: org.apache.shindig.config.JsonContainerConfigLoaderTest5788311443434510709.json.
Dec 17, 2010 2:46:13 AM org.apache.shindig.config.JsonContainerConfigLoader loadContainers
INFO: Loading files from/tmp/org.apache.shindig.config.JsonContainerConfigLoaderTest3524147769358649446.json
Dec 17, 2010 2:46:13 AM org.apache.shindig.config.JsonContainerConfigLoader loadFiles
INFO: Reading container config: org.apache.shindig.config.JsonContainerConfigLoaderTest3524147769358649446.json.
Dec 17, 2010 2:46:13 AM org.apache.shindig.config.JsonContainerConfigLoader loadContainers
INFO: Loading files from/tmp/org.apache.shindig.config.JsonContainerConfigLoaderTest6993412764713715096.json
Dec 17, 2010 2:46:13 AM org.apache.shindig.config.JsonContainerConfigLoader loadFiles
INFO: Reading container config: org.apache.shindig.config.JsonContainerConfigLoaderTest6993412764713715096.json.
Dec 17, 2010 2:46:13 AM org.apache.shindig.config.JsonContainerConfigLoader loadContainers
INFO: Loading files from/tmp/org.apache.shindig.config.JsonContainerConfigLoaderTest8074386777494135760.json
Dec 17, 2010 2:46:13 AM org.apache.shindig.config.JsonContainerConfigLoader loadFiles
INFO: Reading container config: org.apache.shindig.config.JsonContainerConfigLoaderTest8074386777494135760.json.
Dec 17, 2010 2:46:13 AM org.apache.shindig.config.JsonContainerConfigLoader loadContainers
INFO: Loading files from/tmp/org.apache.shindig.config.JsonContainerConfigLoaderTest8425176190010068891.json
Dec 17, 2010 2:46:13 AM org.apache.shindig.config.JsonContainerConfigLoader loadFiles
INFO: Reading container config: org.apache.shindig.config.JsonContainerConfigLoaderTest8425176190010068891.json.
Dec 17, 2010 2:46:13 AM org.apache.shindig.config.JsonContainerConfigLoader loadContainers
INFO: Loading files from/tmp/org.apache.shindig.config.JsonContainerConfigLoaderTest5639507517977657060.json
Dec 17, 2010 2:46:13 AM org.apache.shindig.config.JsonContainerConfigLoader loadFiles
INFO: Reading container config: org.apache.shindig.config.JsonContainerConfigLoaderTest5639507517977657060.json.
Tests run: 12, Failures: 0, Errors: 0, Skipped: 0, Time elapsed: 0.022 sec
Running org.apache.shindig.protocol.conversion.BeanJsonConverterTest
Tests run: 7, Failures: 0, Errors: 0, Skipped: 0, Time elapsed: 0.024 sec
Running org.apache.shindig.protocol.ContentTypesTest
Tests run: 8, Failures: 0, Errors: 0, Skipped: 0, Time elapsed: 0.005 sec
Running org.apache.shindig.auth.UrlParameterAuthenticationHandlerTest
Tests run: 6, Failures: 0, Errors: 0, Skipped: 0, Time elapsed: 0.01 sec
Running org.apache.shindig.protocol.conversion.BeanFilterTest
Tests run: 8, Failures: 0, Errors: 0, Skipped: 0, Time elapsed: 0.013 sec
Running org.apache.shindig.common.util.ImmediateFutureTest
Tests run: 6, Failures: 0, Errors: 0, Skipped: 0, Time elapsed: 0.004 sec
Running org.apache.shindig.common.uri.UriTest
Tests run: 24, Failures: 0, Errors: 0, Skipped: 0, Time elapsed: 0.015 sec
Running org.apache.shindig.common.cache.ehcache.EhCacheCacheProviderTest
Tests run: 1, Failures: 0, Errors: 0, Skipped: 0, Time elapsed: 0.136 sec
Running org.apache.shindig.common.PairTest
Tests run: 1, Failures: 0, Errors: 0, Skipped: 0, Time elapsed: 0.001 sec
Running org.apache.shindig.common.util.DateUtilTest
Tests run: 11, Failures: 0, Errors: 0, Skipped: 0, Time elapsed: 0.018 sec
Running org.apache.shindig.auth.AuthInfoUtilTest
Tests run: 2, Failures: 0, Errors: 0, Skipped: 0, Time elapsed: 0.002 sec
Running org.apache.shindig.common.cache.LruCacheTest
Tests run: 2, Failures: 0, Errors: 0, Skipped: 0, Time elapsed: 0.002 sec

Results :

Tests run: 404, Failures: 0, Errors: 0, Skipped: 3

[TASKS] Skipping maven reporter: there is already a result available.
[HUDSON] Recording test results
[INFO] [jar:jar {execution: default-jar}]
[INFO] Building jar: <https://hudson.apache.org/hudson/job/Shindig/ws/trunk/java/common/target/shindig-common-3.0.0-SNAPSHOT.jar>
[TASKS] Skipping maven reporter: there is already a result available.[INFO] Preparing source:jar
[WARNING] Removing: jar from forked lifecycle, to prevent recursive invocation.

[HUDSON] Archiving <https://hudson.apache.org/hudson/job/Shindig/ws/trunk/java/common/pom.xml> to /home/hudson/hudson/jobs/Shindig/modules/org.apache.shindig$shindig-common/builds/2010-12-17_02-44-23/archive/org.apache.shindig/shindig-common/3.0.0-SNAPSHOT/pom.xml
[HUDSON] Archiving <https://hudson.apache.org/hudson/job/Shindig/ws/trunk/java/common/target/shindig-common-3.0.0-SNAPSHOT.jar> to /home/hudson/hudson/jobs/Shindig/modules/org.apache.shindig$shindig-common/builds/2010-12-17_02-44-23/archive/org.apache.shindig/shindig-common/3.0.0-SNAPSHOT/shindig-common-3.0.0-SNAPSHOT.jar
[INFO] [enforcer:enforce {execution: enforce-java}]
[TASKS] Skipping maven reporter: there is already a result available.
[INFO] [source:jar {execution: attach-sources}]
[INFO] org already added, skipping
[INFO] org/apache already added, skipping
[INFO] org/apache/shindig already added, skipping
[INFO] org/apache/shindig/common already added, skipping
[INFO] org/apache/shindig/common/cache already added, skipping
[INFO] org/apache/shindig/common/cache/ehcache already added, skipping
[INFO] org/apache/shindig/common/logging already added, skipping
[INFO] org/apache/shindig/common/logging/i18n already added, skipping
[INFO] META-INF already added, skipping
[INFO] META-INF/LICENSE already added, skipping
[INFO] META-INF/DEPENDENCIES already added, skipping
[INFO] META-INF/NOTICE already added, skipping
[INFO] Building jar: <https://hudson.apache.org/hudson/job/Shindig/ws/trunk/java/common/target/shindig-common-3.0.0-SNAPSHOT-sources.jar>
[INFO] org already added, skipping
[INFO] org/apache already added, skipping
[INFO] org/apache/shindig already added, skipping
[INFO] org/apache/shindig/common already added, skipping
[INFO] org/apache/shindig/common/cache already added, skipping
[INFO] org/apache/shindig/common/cache/ehcache already added, skipping
[INFO] org/apache/shindig/common/logging already added, skipping
[INFO] org/apache/shindig/common/logging/i18n already added, skipping
[INFO] META-INF already added, skipping
[INFO] META-INF/LICENSE already added, skipping
[INFO] META-INF/DEPENDENCIES already added, skipping
[INFO] META-INF/NOTICE already added, skipping
[TASKS] Skipping maven reporter: there is already a result available.
[INFO] Preparing source:test-jar
[WARNING] Removing: jar from forked lifecycle, to prevent recursive invocation.
[WARNING] Removing: test-jar from forked lifecycle, to prevent recursive invocation.
[HUDSON] Archiving <https://hudson.apache.org/hudson/job/Shindig/ws/trunk/java/common/target/shindig-common-3.0.0-SNAPSHOT-sources.jar> to /home/hudson/hudson/jobs/Shindig/modules/org.apache.shindig$shindig-common/builds/2010-12-17_02-44-23/archive/org.apache.shindig/shindig-common/3.0.0-SNAPSHOT/shindig-common-3.0.0-SNAPSHOT-sources.jar
[INFO] [enforcer:enforce {execution: enforce-java}]
[TASKS] Skipping maven reporter: there is already a result available.
[INFO] [source:test-jar {execution: attach-sources}]
[INFO] META-INF already added, skipping
[INFO] META-INF/LICENSE already added, skipping
[INFO] META-INF/DEPENDENCIES already added, skipping
[INFO] META-INF/NOTICE already added, skipping
[INFO] Building jar: <https://hudson.apache.org/hudson/job/Shindig/ws/trunk/java/common/target/shindig-common-3.0.0-SNAPSHOT-test-sources.jar>
[INFO] META-INF already added, skipping
[INFO] META-INF/LICENSE already added, skipping
[INFO] META-INF/DEPENDENCIES already added, skipping
[INFO] META-INF/NOTICE already added, skipping
[TASKS] Skipping maven reporter: there is already a result available.
[INFO] [jar:test-jar {execution: default}]
[INFO] Building jar: <https://hudson.apache.org/hudson/job/Shindig/ws/trunk/java/common/target/shindig-common-3.0.0-SNAPSHOT-tests.jar>
[TASKS] Skipping maven reporter: there is already a result available.[INFO] [tools:verify-legal-files {execution: verify-legal-files}]
[INFO] Checking legal files in: shindig-common-3.0.0-SNAPSHOT.jar
[INFO] Checking legal files in: shindig-common-3.0.0-SNAPSHOT-sources.jar
[INFO] Checking legal files in: shindig-common-3.0.0-SNAPSHOT-test-sources.jar
[INFO] Checking legal files in: shindig-common-3.0.0-SNAPSHOT-tests.jar

[TASKS] Skipping maven reporter: there is already a result available.[INFO] [install:install {execution: default-install}]
[INFO] Installing <https://hudson.apache.org/hudson/job/Shindig/ws/trunk/java/common/target/shindig-common-3.0.0-SNAPSHOT.jar> to /home/hudson/.m2/repository/org/apache/shindig/shindig-common/3.0.0-SNAPSHOT/shindig-common-3.0.0-SNAPSHOT.jar
[INFO] Installing <https://hudson.apache.org/hudson/job/Shindig/ws/trunk/java/common/target/shindig-common-3.0.0-SNAPSHOT-sources.jar> to /home/hudson/.m2/repository/org/apache/shindig/shindig-common/3.0.0-SNAPSHOT/shindig-common-3.0.0-SNAPSHOT-sources.jar
[INFO] Installing <https://hudson.apache.org/hudson/job/Shindig/ws/trunk/java/common/target/shindig-common-3.0.0-SNAPSHOT-test-sources.jar> to /home/hudson/.m2/repository/org/apache/shindig/shindig-common/3.0.0-SNAPSHOT/shindig-common-3.0.0-SNAPSHOT-test-sources.jar
[INFO] Installing <https://hudson.apache.org/hudson/job/Shindig/ws/trunk/java/common/target/shindig-common-3.0.0-SNAPSHOT-tests.jar> to /home/hudson/.m2/repository/org/apache/shindig/shindig-common/3.0.0-SNAPSHOT/shindig-common-3.0.0-SNAPSHOT-tests.jar

[TASKS] Skipping maven reporter: there is already a result available.
[HUDSON] Archiving <https://hudson.apache.org/hudson/job/Shindig/ws/trunk/java/common/target/shindig-common-3.0.0-SNAPSHOT-test-sources.jar> to /home/hudson/hudson/jobs/Shindig/modules/org.apache.shindig$shindig-common/builds/2010-12-17_02-44-23/archive/org.apache.shindig/shindig-common/3.0.0-SNAPSHOT/shindig-common-3.0.0-SNAPSHOT-test-sources.jar
[HUDSON] Archiving <https://hudson.apache.org/hudson/job/Shindig/ws/trunk/java/common/target/shindig-common-3.0.0-SNAPSHOT-tests.jar> to /home/hudson/hudson/jobs/Shindig/modules/org.apache.shindig$shindig-common/builds/2010-12-17_02-44-23/archive/org.apache.shindig/shindig-common/3.0.0-SNAPSHOT/shindig-common-3.0.0-SNAPSHOT-tests.jar
[INFO] ------------------------------------------------------------------------
[INFO] Building Apache Shindig Gadget Renderer
[INFO]    task-segment: [clean, install]
[INFO] ------------------------------------------------------------------------
[INFO] [clean:clean {execution: default-clean}]
[INFO] Deleting <https://hudson.apache.org/hudson/job/Shindig/ws/trunk/java/gadgets/target>
[TASKS] Scanning folder '<https://hudson.apache.org/hudson/job/Shindig/ws/trunk/java/gadgets/src/main/java'> for tasks ... 
[TASKS] Found 0.
[TASKS] Scanning folder '<https://hudson.apache.org/hudson/job/Shindig/ws/trunk/java/gadgets/src/test/java'> for tasks ... 
[TASKS] Found 0.
[TASKS] Scanning folder '<https://hudson.apache.org/hudson/job/Shindig/ws/trunk/java/gadgets/../../config'> for tasks ... 
[TASKS] Found 0.
[TASKS] Scanning folder '<https://hudson.apache.org/hudson/job/Shindig/ws/trunk/java/gadgets/src/main/resources'> for tasks ... 
[TASKS] Found 0.
[TASKS] Scanning folder '<https://hudson.apache.org/hudson/job/Shindig/ws/trunk/java/gadgets/../../content'> for tasks ... 
[TASKS] Found 0.
[TASKS] Scanning folder '<https://hudson.apache.org/hudson/job/Shindig/ws/trunk/java/gadgets/src/test/resources'> for tasks ... 
[TASKS] Found 0.
[WARNING] While downloading xml-apis:xml-apis:2.0.2
  This artifact has been relocated to xml-apis:xml-apis:1.0.b2.


[INFO] [enforcer:enforce {execution: enforce-java}]
[TASKS] Skipping maven reporter: there is already a result available.
[INFO] [remote-resources:process {execution: default}]
[TASKS] Skipping maven reporter: there is already a result available.[INFO] [resources:resources {execution: default-resources}]
[INFO] Using 'UTF-8' encoding to copy filtered resources.
[INFO] Copying 2 resources to config
[INFO] Copying 0 resource
[INFO] Copying 2 resources to files
[INFO] Copying 3 resources

[TASKS] Skipping maven reporter: there is already a result available.[INFO] [compiler:compile {execution: default-compile}]
[INFO] Compiling 260 source files to <https://hudson.apache.org/hudson/job/Shindig/ws/trunk/java/gadgets/target/classes>

[INFO] -------------------------------------------------------------
[WARNING] COMPILATION WARNING : 
[INFO] -------------------------------------------------------------
[WARNING] <https://hudson.apache.org/hudson/job/Shindig/ws/trunk/java/gadgets/src/main/java/org/apache/shindig/gadgets/parse/caja/VanillaCajaHtmlSerializer.java>:[41,21] [deprecation] render(org.w3c.dom.Node,boolean) in com.google.caja.parser.html.Nodes has been deprecated
[WARNING] <https://hudson.apache.org/hudson/job/Shindig/ws/trunk/java/gadgets/src/main/java/org/apache/shindig/gadgets/parse/caja/CajaHtmlSerializer.java>:[39,16] [deprecation] render(org.w3c.dom.Node,boolean) in com.google.caja.parser.html.Nodes has been deprecated
[INFO] 2 warnings 
[INFO] -------------------------------------------------------------
[INFO] -------------------------------------------------------------
[ERROR] COMPILATION ERROR : 
[INFO] -------------------------------------------------------------
[ERROR] <https://hudson.apache.org/hudson/job/Shindig/ws/trunk/java/gadgets/src/main/java/org/apache/shindig/gadgets/rewrite/image/JpegImageUtils.java>:[171,35] cannot find symbol
symbol  : method copyOf(int[],int)
location: class java.util.Arrays
[INFO] 1 error
[INFO] -------------------------------------------------------------
[TASKS] Skipping maven reporter: there is already a result available.
[HUDSON] Archiving <https://hudson.apache.org/hudson/job/Shindig/ws/trunk/java/gadgets/pom.xml> to /home/hudson/hudson/jobs/Shindig/modules/org.apache.shindig$shindig-gadgets/builds/2010-12-17_02-44-23/archive/org.apache.shindig/shindig-gadgets/3.0.0-SNAPSHOT/pom.xml
[INFO] ------------------------------------------------------------------------
[ERROR] BUILD FAILURE
[INFO] ------------------------------------------------------------------------
[INFO] Compilation failure
<https://hudson.apache.org/hudson/job/Shindig/ws/trunk/java/gadgets/src/main/java/org/apache/shindig/gadgets/rewrite/image/JpegImageUtils.java>:[171,35] cannot find symbol
symbol  : method copyOf(int[],int)
location: class java.util.Arrays

[INFO] ------------------------------------------------------------------------
[INFO] For more information, run Maven with the -e switch
[INFO] ------------------------------------------------------------------------
[INFO] Total time: 2 minutes 13 seconds
[INFO] Finished at: Fri Dec 17 02:46:54 UTC 2010
[INFO] Final Memory: 59M/265M
[INFO] ------------------------------------------------------------------------
Sending e-mails to: dev@shindig.apache.org
channel stopped
[WARNINGS] Skipping publisher since build result is FAILURE


Build failed in Hudson: Shindig #2061

Posted by Apache Hudson Server <hu...@hudson.apache.org>.
See <https://hudson.apache.org/hudson/job/Shindig/2061/>

------------------------------------------
[...truncated 536 lines...]
Running org.apache.shindig.common.cache.SoftExpiringCacheTest
Tests run: 2, Failures: 0, Errors: 0, Skipped: 0, Time elapsed: 0.024 sec
Running org.apache.shindig.common.JsonSerializerTest
Tests run: 15, Failures: 0, Errors: 0, Skipped: 0, Time elapsed: 0.025 sec
Running org.apache.shindig.common.cache.LruCacheProviderTest
Dec 17, 2010 1:48:30 AM org.apache.shindig.common.cache.LruCacheProvider getCapacity(String name)
WARNING: Invalid LRU capacity configured for foo.
Tests run: 5, Failures: 0, Errors: 0, Skipped: 0, Time elapsed: 0.009 sec
Running org.apache.shindig.common.xml.DomUtilTest
Tests run: 3, Failures: 0, Errors: 0, Skipped: 0, Time elapsed: 0.004 sec
Running org.apache.shindig.config.JsonContainerConfigLoaderTest
Dec 17, 2010 1:48:30 AM org.apache.shindig.config.JsonContainerConfigLoader loadContainers
INFO: Loading files from/tmp/org.apache.shindig.config.JsonContainerConfigLoaderTest289035101880166908.json
Dec 17, 2010 1:48:30 AM org.apache.shindig.config.JsonContainerConfigLoader loadFiles
INFO: Reading container config: org.apache.shindig.config.JsonContainerConfigLoaderTest289035101880166908.json.
Dec 17, 2010 1:48:30 AM org.apache.shindig.config.JsonContainerConfigLoader loadContainers
INFO: Loading files from/tmp/org.apache.shindig.config.JsonContainerConfigLoaderTest1692317017972372176.json
Dec 17, 2010 1:48:30 AM org.apache.shindig.config.JsonContainerConfigLoader loadFiles
INFO: Reading container config: org.apache.shindig.config.JsonContainerConfigLoaderTest1692317017972372176.json.
Dec 17, 2010 1:48:30 AM org.apache.shindig.config.JsonContainerConfigLoader loadContainers
INFO: Loading files from/tmp/org.apache.shindig.config.JsonContainerConfigLoaderTest189236686865667139.json
Dec 17, 2010 1:48:30 AM org.apache.shindig.config.JsonContainerConfigLoader loadFiles
INFO: Reading container config: org.apache.shindig.config.JsonContainerConfigLoaderTest189236686865667139.json.
Dec 17, 2010 1:48:30 AM org.apache.shindig.config.JsonContainerConfigLoader loadContainers
INFO: Loading files from/tmp/org.apache.shindig.config.JsonContainerConfigLoaderTest5122169873038423731.json
Dec 17, 2010 1:48:30 AM org.apache.shindig.config.JsonContainerConfigLoader loadFiles
INFO: Reading container config: org.apache.shindig.config.JsonContainerConfigLoaderTest5122169873038423731.json.
Dec 17, 2010 1:48:30 AM org.apache.shindig.config.JsonContainerConfigLoader loadContainers
INFO: Loading files from/tmp/org.apache.shindig.config.JsonContainerConfigLoaderTest8433778213199499701.json
Dec 17, 2010 1:48:30 AM org.apache.shindig.config.JsonContainerConfigLoader loadFiles
INFO: Reading container config: org.apache.shindig.config.JsonContainerConfigLoaderTest8433778213199499701.json.
Dec 17, 2010 1:48:30 AM org.apache.shindig.config.JsonContainerConfigLoader loadContainers
INFO: Loading files from/tmp/org.apache.shindig.config.JsonContainerConfigLoaderTest1825329762395472699.json
Dec 17, 2010 1:48:30 AM org.apache.shindig.config.JsonContainerConfigLoader loadFiles
INFO: Reading container config: org.apache.shindig.config.JsonContainerConfigLoaderTest1825329762395472699.json.
Dec 17, 2010 1:48:30 AM org.apache.shindig.config.JsonContainerConfigLoader loadContainers
INFO: Loading files from/tmp/org.apache.shindig.config.JsonContainerConfigLoaderTest6144239135930928454.json
Dec 17, 2010 1:48:30 AM org.apache.shindig.config.JsonContainerConfigLoader loadFiles
INFO: Reading container config: org.apache.shindig.config.JsonContainerConfigLoaderTest6144239135930928454.json.
Dec 17, 2010 1:48:30 AM org.apache.shindig.config.JsonContainerConfigLoader loadContainers
INFO: Loading files from/tmp/org.apache.shindig.config.JsonContainerConfigLoaderTest4550822482023460953.json
Dec 17, 2010 1:48:30 AM org.apache.shindig.config.JsonContainerConfigLoader loadFiles
INFO: Reading container config: org.apache.shindig.config.JsonContainerConfigLoaderTest4550822482023460953.json.
Dec 17, 2010 1:48:30 AM org.apache.shindig.config.JsonContainerConfigLoader loadContainers
INFO: Loading files from/tmp/org.apache.shindig.config.JsonContainerConfigLoaderTest9106595591236135650.json
Dec 17, 2010 1:48:30 AM org.apache.shindig.config.JsonContainerConfigLoader loadFiles
INFO: Reading container config: org.apache.shindig.config.JsonContainerConfigLoaderTest9106595591236135650.json.
Dec 17, 2010 1:48:30 AM org.apache.shindig.config.JsonContainerConfigLoader loadContainers
INFO: Loading files from/tmp/org.apache.shindig.config.JsonContainerConfigLoaderTest4130468774762275231.json
Dec 17, 2010 1:48:30 AM org.apache.shindig.config.JsonContainerConfigLoader loadFiles
INFO: Reading container config: org.apache.shindig.config.JsonContainerConfigLoaderTest4130468774762275231.json.
Dec 17, 2010 1:48:30 AM org.apache.shindig.config.JsonContainerConfigLoader loadContainers
INFO: Loading files from/tmp/org.apache.shindig.config.JsonContainerConfigLoaderTest526362591559310633.json
Dec 17, 2010 1:48:30 AM org.apache.shindig.config.JsonContainerConfigLoader loadFiles
INFO: Reading container config: org.apache.shindig.config.JsonContainerConfigLoaderTest526362591559310633.json.
Dec 17, 2010 1:48:30 AM org.apache.shindig.config.JsonContainerConfigLoader loadContainers
INFO: Loading files from/tmp/org.apache.shindig.config.JsonContainerConfigLoaderTest794462276425336553.json
Dec 17, 2010 1:48:30 AM org.apache.shindig.config.JsonContainerConfigLoader loadFiles
INFO: Reading container config: org.apache.shindig.config.JsonContainerConfigLoaderTest794462276425336553.json.
Dec 17, 2010 1:48:30 AM org.apache.shindig.config.JsonContainerConfigLoader loadContainers
INFO: Loading files from/tmp/org.apache.shindig.config.JsonContainerConfigLoaderTest7188232397625674874.json
Dec 17, 2010 1:48:30 AM org.apache.shindig.config.JsonContainerConfigLoader loadFiles
INFO: Reading container config: org.apache.shindig.config.JsonContainerConfigLoaderTest7188232397625674874.json.
Dec 17, 2010 1:48:30 AM org.apache.shindig.config.JsonContainerConfigLoader loadContainers
INFO: Loading files from/tmp/org.apache.shindig.config.JsonContainerConfigLoaderTest4639333873479504916.json
Dec 17, 2010 1:48:30 AM org.apache.shindig.config.JsonContainerConfigLoader loadFiles
INFO: Reading container config: org.apache.shindig.config.JsonContainerConfigLoaderTest4639333873479504916.json.
Dec 17, 2010 1:48:30 AM org.apache.shindig.config.JsonContainerConfigLoader loadContainers
INFO: Loading files from/tmp/org.apache.shindig.config.JsonContainerConfigLoaderTest787571859729505091.json
Dec 17, 2010 1:48:30 AM org.apache.shindig.config.JsonContainerConfigLoader loadFiles
INFO: Reading container config: org.apache.shindig.config.JsonContainerConfigLoaderTest787571859729505091.json.
Dec 17, 2010 1:48:30 AM org.apache.shindig.config.JsonContainerConfigLoader loadContainers
INFO: Loading files from/tmp/org.apache.shindig.config.JsonContainerConfigLoaderTest2066145352149383972.json
Dec 17, 2010 1:48:30 AM org.apache.shindig.config.JsonContainerConfigLoader loadFiles
INFO: Reading container config: org.apache.shindig.config.JsonContainerConfigLoaderTest2066145352149383972.json.
Dec 17, 2010 1:48:30 AM org.apache.shindig.config.JsonContainerConfigLoader loadContainers
INFO: Loading files from/tmp/org.apache.shindig.config.JsonContainerConfigLoaderTest3379484731701199676.json
Dec 17, 2010 1:48:30 AM org.apache.shindig.config.JsonContainerConfigLoader loadFiles
INFO: Reading container config: org.apache.shindig.config.JsonContainerConfigLoaderTest3379484731701199676.json.
Tests run: 12, Failures: 0, Errors: 0, Skipped: 0, Time elapsed: 0.027 sec
Running org.apache.shindig.protocol.conversion.BeanJsonConverterTest
Tests run: 7, Failures: 0, Errors: 0, Skipped: 0, Time elapsed: 0.022 sec
Running org.apache.shindig.protocol.ContentTypesTest
Tests run: 8, Failures: 0, Errors: 0, Skipped: 0, Time elapsed: 0.004 sec
Running org.apache.shindig.auth.UrlParameterAuthenticationHandlerTest
Tests run: 6, Failures: 0, Errors: 0, Skipped: 0, Time elapsed: 0.009 sec
Running org.apache.shindig.protocol.conversion.BeanFilterTest
Tests run: 8, Failures: 0, Errors: 0, Skipped: 0, Time elapsed: 0.012 sec
Running org.apache.shindig.common.util.ImmediateFutureTest
Tests run: 6, Failures: 0, Errors: 0, Skipped: 0, Time elapsed: 0.004 sec
Running org.apache.shindig.common.uri.UriTest
Tests run: 24, Failures: 0, Errors: 0, Skipped: 0, Time elapsed: 0.015 sec
Running org.apache.shindig.common.cache.ehcache.EhCacheCacheProviderTest
Tests run: 1, Failures: 0, Errors: 0, Skipped: 0, Time elapsed: 0.124 sec
Running org.apache.shindig.common.PairTest
Tests run: 1, Failures: 0, Errors: 0, Skipped: 0, Time elapsed: 0.001 sec
Running org.apache.shindig.common.util.DateUtilTest
Tests run: 11, Failures: 0, Errors: 0, Skipped: 0, Time elapsed: 0.017 sec
Running org.apache.shindig.auth.AuthInfoUtilTest
Tests run: 2, Failures: 0, Errors: 0, Skipped: 0, Time elapsed: 0.002 sec
Running org.apache.shindig.common.cache.LruCacheTest
Tests run: 2, Failures: 0, Errors: 0, Skipped: 0, Time elapsed: 0.002 sec

Results :

Tests run: 404, Failures: 0, Errors: 0, Skipped: 3

[TASKS] Skipping maven reporter: there is already a result available.
[HUDSON] Recording test results
[INFO] [jar:jar {execution: default-jar}]
[INFO] Building jar: <https://hudson.apache.org/hudson/job/Shindig/ws/trunk/java/common/target/shindig-common-3.0.0-SNAPSHOT.jar>
[TASKS] Skipping maven reporter: there is already a result available.
[INFO] Preparing source:jar
[WARNING] Removing: jar from forked lifecycle, to prevent recursive invocation.
[HUDSON] Archiving <https://hudson.apache.org/hudson/job/Shindig/ws/trunk/java/common/pom.xml> to /home/hudson/hudson/jobs/Shindig/modules/org.apache.shindig$shindig-common/builds/2010-12-17_01-46-30/archive/org.apache.shindig/shindig-common/3.0.0-SNAPSHOT/pom.xml
[HUDSON] Archiving <https://hudson.apache.org/hudson/job/Shindig/ws/trunk/java/common/target/shindig-common-3.0.0-SNAPSHOT.jar> to /home/hudson/hudson/jobs/Shindig/modules/org.apache.shindig$shindig-common/builds/2010-12-17_01-46-30/archive/org.apache.shindig/shindig-common/3.0.0-SNAPSHOT/shindig-common-3.0.0-SNAPSHOT.jar
[INFO] [enforcer:enforce {execution: enforce-java}]
[TASKS] Skipping maven reporter: there is already a result available.
[INFO] [source:jar {execution: attach-sources}]
[INFO] org already added, skipping
[INFO] org/apache already added, skipping
[INFO] org/apache/shindig already added, skipping
[INFO] org/apache/shindig/common already added, skipping
[INFO] org/apache/shindig/common/cache already added, skipping
[INFO] org/apache/shindig/common/cache/ehcache already added, skipping
[INFO] org/apache/shindig/common/logging already added, skipping
[INFO] org/apache/shindig/common/logging/i18n already added, skipping
[INFO] META-INF already added, skipping
[INFO] META-INF/LICENSE already added, skipping
[INFO] META-INF/DEPENDENCIES already added, skipping
[INFO] META-INF/NOTICE already added, skipping
[INFO] Building jar: <https://hudson.apache.org/hudson/job/Shindig/ws/trunk/java/common/target/shindig-common-3.0.0-SNAPSHOT-sources.jar>
[INFO] org already added, skipping
[INFO] org/apache already added, skipping
[INFO] org/apache/shindig already added, skipping
[INFO] org/apache/shindig/common already added, skipping
[INFO] org/apache/shindig/common/cache already added, skipping
[INFO] org/apache/shindig/common/cache/ehcache already added, skipping
[INFO] org/apache/shindig/common/logging already added, skipping
[INFO] org/apache/shindig/common/logging/i18n already added, skipping
[INFO] META-INF already added, skipping
[INFO] META-INF/LICENSE already added, skipping
[INFO] META-INF/DEPENDENCIES already added, skipping
[INFO] META-INF/NOTICE already added, skipping
[TASKS] Skipping maven reporter: there is already a result available.
[INFO] Preparing source:test-jar
[WARNING] Removing: jar from forked lifecycle, to prevent recursive invocation.
[WARNING] Removing: test-jar from forked lifecycle, to prevent recursive invocation.
[HUDSON] Archiving <https://hudson.apache.org/hudson/job/Shindig/ws/trunk/java/common/target/shindig-common-3.0.0-SNAPSHOT-sources.jar> to /home/hudson/hudson/jobs/Shindig/modules/org.apache.shindig$shindig-common/builds/2010-12-17_01-46-30/archive/org.apache.shindig/shindig-common/3.0.0-SNAPSHOT/shindig-common-3.0.0-SNAPSHOT-sources.jar
[INFO] [enforcer:enforce {execution: enforce-java}]
[TASKS] Skipping maven reporter: there is already a result available.
[INFO] [source:test-jar {execution: attach-sources}]
[INFO] META-INF already added, skipping
[INFO] META-INF/LICENSE already added, skipping
[INFO] META-INF/DEPENDENCIES already added, skipping
[INFO] META-INF/NOTICE already added, skipping
[INFO] Building jar: <https://hudson.apache.org/hudson/job/Shindig/ws/trunk/java/common/target/shindig-common-3.0.0-SNAPSHOT-test-sources.jar>
[INFO] META-INF already added, skipping
[INFO] META-INF/LICENSE already added, skipping
[INFO] META-INF/DEPENDENCIES already added, skipping
[INFO] META-INF/NOTICE already added, skipping
[TASKS] Skipping maven reporter: there is already a result available.
[INFO] [jar:test-jar {execution: default}]
[INFO] Building jar: <https://hudson.apache.org/hudson/job/Shindig/ws/trunk/java/common/target/shindig-common-3.0.0-SNAPSHOT-tests.jar>
[TASKS] Skipping maven reporter: there is already a result available.[INFO] [tools:verify-legal-files {execution: verify-legal-files}]
[INFO] Checking legal files in: shindig-common-3.0.0-SNAPSHOT.jar
[INFO] Checking legal files in: shindig-common-3.0.0-SNAPSHOT-sources.jar
[INFO] Checking legal files in: shindig-common-3.0.0-SNAPSHOT-test-sources.jar
[INFO] Checking legal files in: shindig-common-3.0.0-SNAPSHOT-tests.jar

[TASKS] Skipping maven reporter: there is already a result available.[INFO] [install:install {execution: default-install}]
[INFO] Installing <https://hudson.apache.org/hudson/job/Shindig/ws/trunk/java/common/target/shindig-common-3.0.0-SNAPSHOT.jar> to /home/hudson/.m2/repository/org/apache/shindig/shindig-common/3.0.0-SNAPSHOT/shindig-common-3.0.0-SNAPSHOT.jar
[INFO] Installing <https://hudson.apache.org/hudson/job/Shindig/ws/trunk/java/common/target/shindig-common-3.0.0-SNAPSHOT-sources.jar> to /home/hudson/.m2/repository/org/apache/shindig/shindig-common/3.0.0-SNAPSHOT/shindig-common-3.0.0-SNAPSHOT-sources.jar
[INFO] Installing <https://hudson.apache.org/hudson/job/Shindig/ws/trunk/java/common/target/shindig-common-3.0.0-SNAPSHOT-test-sources.jar> to /home/hudson/.m2/repository/org/apache/shindig/shindig-common/3.0.0-SNAPSHOT/shindig-common-3.0.0-SNAPSHOT-test-sources.jar
[INFO] Installing <https://hudson.apache.org/hudson/job/Shindig/ws/trunk/java/common/target/shindig-common-3.0.0-SNAPSHOT-tests.jar> to /home/hudson/.m2/repository/org/apache/shindig/shindig-common/3.0.0-SNAPSHOT/shindig-common-3.0.0-SNAPSHOT-tests.jar

[TASKS] Skipping maven reporter: there is already a result available.
[HUDSON] Archiving <https://hudson.apache.org/hudson/job/Shindig/ws/trunk/java/common/target/shindig-common-3.0.0-SNAPSHOT-test-sources.jar> to /home/hudson/hudson/jobs/Shindig/modules/org.apache.shindig$shindig-common/builds/2010-12-17_01-46-30/archive/org.apache.shindig/shindig-common/3.0.0-SNAPSHOT/shindig-common-3.0.0-SNAPSHOT-test-sources.jar
[HUDSON] Archiving <https://hudson.apache.org/hudson/job/Shindig/ws/trunk/java/common/target/shindig-common-3.0.0-SNAPSHOT-tests.jar> to /home/hudson/hudson/jobs/Shindig/modules/org.apache.shindig$shindig-common/builds/2010-12-17_01-46-30/archive/org.apache.shindig/shindig-common/3.0.0-SNAPSHOT/shindig-common-3.0.0-SNAPSHOT-tests.jar
[INFO] ------------------------------------------------------------------------
[INFO] Building Apache Shindig Gadget Renderer
[INFO]    task-segment: [clean, install]
[INFO] ------------------------------------------------------------------------
[INFO] [clean:clean {execution: default-clean}]
[INFO] Deleting <https://hudson.apache.org/hudson/job/Shindig/ws/trunk/java/gadgets/target>
[TASKS] Scanning folder '<https://hudson.apache.org/hudson/job/Shindig/ws/trunk/java/gadgets/src/main/java'> for tasks ... 
[TASKS] Found 0.
[TASKS] Scanning folder '<https://hudson.apache.org/hudson/job/Shindig/ws/trunk/java/gadgets/src/test/java'> for tasks ... 
[TASKS] Found 0.
[TASKS] Scanning folder '<https://hudson.apache.org/hudson/job/Shindig/ws/trunk/java/gadgets/../../config'> for tasks ... 
[TASKS] Found 0.
[TASKS] Scanning folder '<https://hudson.apache.org/hudson/job/Shindig/ws/trunk/java/gadgets/src/main/resources'> for tasks ... 
[TASKS] Found 0.
[TASKS] Scanning folder '<https://hudson.apache.org/hudson/job/Shindig/ws/trunk/java/gadgets/../../content'> for tasks ... 
[TASKS] Found 0.
[TASKS] Scanning folder '<https://hudson.apache.org/hudson/job/Shindig/ws/trunk/java/gadgets/src/test/resources'> for tasks ... 
[TASKS] Found 0.
[WARNING] While downloading xml-apis:xml-apis:2.0.2
  This artifact has been relocated to xml-apis:xml-apis:1.0.b2.


[INFO] [enforcer:enforce {execution: enforce-java}]
[TASKS] Skipping maven reporter: there is already a result available.
[INFO] [remote-resources:process {execution: default}]
[TASKS] Skipping maven reporter: there is already a result available.[INFO] [resources:resources {execution: default-resources}]
[INFO] Using 'UTF-8' encoding to copy filtered resources.
[INFO] Copying 2 resources to config
[INFO] Copying 0 resource
[INFO] Copying 2 resources to files
[INFO] Copying 3 resources

[TASKS] Skipping maven reporter: there is already a result available.[INFO] [compiler:compile {execution: default-compile}]

[INFO] Compiling 260 source files to <https://hudson.apache.org/hudson/job/Shindig/ws/trunk/java/gadgets/target/classes>
[INFO] -------------------------------------------------------------
[WARNING] COMPILATION WARNING : 
[INFO] -------------------------------------------------------------
[WARNING] <https://hudson.apache.org/hudson/job/Shindig/ws/trunk/java/gadgets/src/main/java/org/apache/shindig/gadgets/parse/caja/VanillaCajaHtmlSerializer.java>:[41,21] [deprecation] render(org.w3c.dom.Node,boolean) in com.google.caja.parser.html.Nodes has been deprecated
[WARNING] <https://hudson.apache.org/hudson/job/Shindig/ws/trunk/java/gadgets/src/main/java/org/apache/shindig/gadgets/parse/caja/CajaHtmlSerializer.java>:[39,16] [deprecation] render(org.w3c.dom.Node,boolean) in com.google.caja.parser.html.Nodes has been deprecated
[INFO] 2 warnings 
[INFO] -------------------------------------------------------------
[INFO] -------------------------------------------------------------
[ERROR] COMPILATION ERROR : 
[INFO] -------------------------------------------------------------
[ERROR] <https://hudson.apache.org/hudson/job/Shindig/ws/trunk/java/gadgets/src/main/java/org/apache/shindig/gadgets/rewrite/image/JpegImageUtils.java>:[171,35] cannot find symbol
symbol  : method copyOf(int[],int)
location: class java.util.Arrays
[INFO] 1 error
[INFO] -------------------------------------------------------------
[TASKS] Skipping maven reporter: there is already a result available.
[HUDSON] Archiving <https://hudson.apache.org/hudson/job/Shindig/ws/trunk/java/gadgets/pom.xml> to /home/hudson/hudson/jobs/Shindig/modules/org.apache.shindig$shindig-gadgets/builds/2010-12-17_01-46-30/archive/org.apache.shindig/shindig-gadgets/3.0.0-SNAPSHOT/pom.xml
[INFO] ------------------------------------------------------------------------
[ERROR] BUILD FAILURE
[INFO] ------------------------------------------------------------------------
[INFO] Compilation failure
<https://hudson.apache.org/hudson/job/Shindig/ws/trunk/java/gadgets/src/main/java/org/apache/shindig/gadgets/rewrite/image/JpegImageUtils.java>:[171,35] cannot find symbol
symbol  : method copyOf(int[],int)
location: class java.util.Arrays

[INFO] ------------------------------------------------------------------------
[INFO] For more information, run Maven with the -e switch
[INFO] ------------------------------------------------------------------------
[INFO] Total time: 2 minutes 23 seconds
[INFO] Finished at: Fri Dec 17 01:49:06 UTC 2010
[INFO] Final Memory: 59M/264M
[INFO] ------------------------------------------------------------------------
Sending e-mails to: dev@shindig.apache.org
channel stopped
[WARNINGS] Skipping publisher since build result is FAILURE


Build failed in Hudson: Shindig #2060

Posted by Apache Hudson Server <hu...@hudson.apache.org>.
See <https://hudson.apache.org/hudson/job/Shindig/2060/changes>

Changes:

[hsaputra] Add new line to JavaScript file for easy read. Mostly it will be minified in production env anyway.

------------------------------------------
[...truncated 537 lines...]
Running org.apache.shindig.common.cache.SoftExpiringCacheTest
Tests run: 2, Failures: 0, Errors: 0, Skipped: 0, Time elapsed: 0.024 sec
Running org.apache.shindig.common.JsonSerializerTest
Tests run: 15, Failures: 0, Errors: 0, Skipped: 0, Time elapsed: 0.025 sec
Running org.apache.shindig.common.cache.LruCacheProviderTest
Dec 16, 2010 9:25:59 PM org.apache.shindig.common.cache.LruCacheProvider getCapacity(String name)
WARNING: Invalid LRU capacity configured for foo.
Tests run: 5, Failures: 0, Errors: 0, Skipped: 0, Time elapsed: 0.01 sec
Running org.apache.shindig.common.xml.DomUtilTest
Tests run: 3, Failures: 0, Errors: 0, Skipped: 0, Time elapsed: 0.005 sec
Running org.apache.shindig.config.JsonContainerConfigLoaderTest
Dec 16, 2010 9:25:59 PM org.apache.shindig.config.JsonContainerConfigLoader loadContainers
INFO: Loading files from/tmp/org.apache.shindig.config.JsonContainerConfigLoaderTest1829098645063637219.json
Dec 16, 2010 9:25:59 PM org.apache.shindig.config.JsonContainerConfigLoader loadFiles
INFO: Reading container config: org.apache.shindig.config.JsonContainerConfigLoaderTest1829098645063637219.json.
Dec 16, 2010 9:25:59 PM org.apache.shindig.config.JsonContainerConfigLoader loadContainers
INFO: Loading files from/tmp/org.apache.shindig.config.JsonContainerConfigLoaderTest5683262501359840698.json
Dec 16, 2010 9:25:59 PM org.apache.shindig.config.JsonContainerConfigLoader loadFiles
INFO: Reading container config: org.apache.shindig.config.JsonContainerConfigLoaderTest5683262501359840698.json.
Dec 16, 2010 9:25:59 PM org.apache.shindig.config.JsonContainerConfigLoader loadContainers
INFO: Loading files from/tmp/org.apache.shindig.config.JsonContainerConfigLoaderTest418297172778835109.json
Dec 16, 2010 9:25:59 PM org.apache.shindig.config.JsonContainerConfigLoader loadFiles
INFO: Reading container config: org.apache.shindig.config.JsonContainerConfigLoaderTest418297172778835109.json.
Dec 16, 2010 9:25:59 PM org.apache.shindig.config.JsonContainerConfigLoader loadContainers
INFO: Loading files from/tmp/org.apache.shindig.config.JsonContainerConfigLoaderTest8413435217332144611.json
Dec 16, 2010 9:25:59 PM org.apache.shindig.config.JsonContainerConfigLoader loadFiles
INFO: Reading container config: org.apache.shindig.config.JsonContainerConfigLoaderTest8413435217332144611.json.
Dec 16, 2010 9:25:59 PM org.apache.shindig.config.JsonContainerConfigLoader loadContainers
INFO: Loading files from/tmp/org.apache.shindig.config.JsonContainerConfigLoaderTest6509207183842805691.json
Dec 16, 2010 9:25:59 PM org.apache.shindig.config.JsonContainerConfigLoader loadFiles
INFO: Reading container config: org.apache.shindig.config.JsonContainerConfigLoaderTest6509207183842805691.json.
Dec 16, 2010 9:25:59 PM org.apache.shindig.config.JsonContainerConfigLoader loadContainers
INFO: Loading files from/tmp/org.apache.shindig.config.JsonContainerConfigLoaderTest7859420373647560499.json
Dec 16, 2010 9:25:59 PM org.apache.shindig.config.JsonContainerConfigLoader loadFiles
INFO: Reading container config: org.apache.shindig.config.JsonContainerConfigLoaderTest7859420373647560499.json.
Dec 16, 2010 9:25:59 PM org.apache.shindig.config.JsonContainerConfigLoader loadContainers
INFO: Loading files from/tmp/org.apache.shindig.config.JsonContainerConfigLoaderTest5581271935468249503.json
Dec 16, 2010 9:25:59 PM org.apache.shindig.config.JsonContainerConfigLoader loadFiles
INFO: Reading container config: org.apache.shindig.config.JsonContainerConfigLoaderTest5581271935468249503.json.
Dec 16, 2010 9:25:59 PM org.apache.shindig.config.JsonContainerConfigLoader loadContainers
INFO: Loading files from/tmp/org.apache.shindig.config.JsonContainerConfigLoaderTest3600256411168862562.json
Dec 16, 2010 9:25:59 PM org.apache.shindig.config.JsonContainerConfigLoader loadFiles
INFO: Reading container config: org.apache.shindig.config.JsonContainerConfigLoaderTest3600256411168862562.json.
Dec 16, 2010 9:25:59 PM org.apache.shindig.config.JsonContainerConfigLoader loadContainers
INFO: Loading files from/tmp/org.apache.shindig.config.JsonContainerConfigLoaderTest919162549803597668.json
Dec 16, 2010 9:25:59 PM org.apache.shindig.config.JsonContainerConfigLoader loadFiles
INFO: Reading container config: org.apache.shindig.config.JsonContainerConfigLoaderTest919162549803597668.json.
Dec 16, 2010 9:25:59 PM org.apache.shindig.config.JsonContainerConfigLoader loadContainers
INFO: Loading files from/tmp/org.apache.shindig.config.JsonContainerConfigLoaderTest8910515290558804271.json
Dec 16, 2010 9:25:59 PM org.apache.shindig.config.JsonContainerConfigLoader loadFiles
INFO: Reading container config: org.apache.shindig.config.JsonContainerConfigLoaderTest8910515290558804271.json.
Dec 16, 2010 9:25:59 PM org.apache.shindig.config.JsonContainerConfigLoader loadContainers
INFO: Loading files from/tmp/org.apache.shindig.config.JsonContainerConfigLoaderTest3463666081336750281.json
Dec 16, 2010 9:25:59 PM org.apache.shindig.config.JsonContainerConfigLoader loadFiles
INFO: Reading container config: org.apache.shindig.config.JsonContainerConfigLoaderTest3463666081336750281.json.
Dec 16, 2010 9:25:59 PM org.apache.shindig.config.JsonContainerConfigLoader loadContainers
INFO: Loading files from/tmp/org.apache.shindig.config.JsonContainerConfigLoaderTest7086328310544561743.json
Dec 16, 2010 9:25:59 PM org.apache.shindig.config.JsonContainerConfigLoader loadFiles
INFO: Reading container config: org.apache.shindig.config.JsonContainerConfigLoaderTest7086328310544561743.json.
Dec 16, 2010 9:25:59 PM org.apache.shindig.config.JsonContainerConfigLoader loadContainers
INFO: Loading files from/tmp/org.apache.shindig.config.JsonContainerConfigLoaderTest3213536487187438288.json
Dec 16, 2010 9:25:59 PM org.apache.shindig.config.JsonContainerConfigLoader loadFiles
INFO: Reading container config: org.apache.shindig.config.JsonContainerConfigLoaderTest3213536487187438288.json.
Dec 16, 2010 9:25:59 PM org.apache.shindig.config.JsonContainerConfigLoader loadContainers
INFO: Loading files from/tmp/org.apache.shindig.config.JsonContainerConfigLoaderTest7370733422938025596.json
Dec 16, 2010 9:25:59 PM org.apache.shindig.config.JsonContainerConfigLoader loadFiles
INFO: Reading container config: org.apache.shindig.config.JsonContainerConfigLoaderTest7370733422938025596.json.
Dec 16, 2010 9:25:59 PM org.apache.shindig.config.JsonContainerConfigLoader loadContainers
INFO: Loading files from/tmp/org.apache.shindig.config.JsonContainerConfigLoaderTest9219834308018772748.json
Dec 16, 2010 9:25:59 PM org.apache.shindig.config.JsonContainerConfigLoader loadFiles
INFO: Reading container config: org.apache.shindig.config.JsonContainerConfigLoaderTest9219834308018772748.json.
Dec 16, 2010 9:25:59 PM org.apache.shindig.config.JsonContainerConfigLoader loadContainers
INFO: Loading files from/tmp/org.apache.shindig.config.JsonContainerConfigLoaderTest1377442237212944795.json
Dec 16, 2010 9:25:59 PM org.apache.shindig.config.JsonContainerConfigLoader loadFiles
INFO: Reading container config: org.apache.shindig.config.JsonContainerConfigLoaderTest1377442237212944795.json.
Dec 16, 2010 9:25:59 PM org.apache.shindig.config.JsonContainerConfigLoader loadContainers
INFO: Loading files from/tmp/org.apache.shindig.config.JsonContainerConfigLoaderTest8104762881529513952.json
Dec 16, 2010 9:25:59 PM org.apache.shindig.config.JsonContainerConfigLoader loadFiles
INFO: Reading container config: org.apache.shindig.config.JsonContainerConfigLoaderTest8104762881529513952.json.
Tests run: 12, Failures: 0, Errors: 0, Skipped: 0, Time elapsed: 0.021 sec
Running org.apache.shindig.protocol.conversion.BeanJsonConverterTest
Tests run: 7, Failures: 0, Errors: 0, Skipped: 0, Time elapsed: 0.022 sec
Running org.apache.shindig.protocol.ContentTypesTest
Tests run: 8, Failures: 0, Errors: 0, Skipped: 0, Time elapsed: 0.005 sec
Running org.apache.shindig.auth.UrlParameterAuthenticationHandlerTest
Tests run: 6, Failures: 0, Errors: 0, Skipped: 0, Time elapsed: 0.011 sec
Running org.apache.shindig.protocol.conversion.BeanFilterTest
Tests run: 8, Failures: 0, Errors: 0, Skipped: 0, Time elapsed: 0.013 sec
Running org.apache.shindig.common.util.ImmediateFutureTest
Tests run: 6, Failures: 0, Errors: 0, Skipped: 0, Time elapsed: 0.004 sec
Running org.apache.shindig.common.uri.UriTest
Tests run: 24, Failures: 0, Errors: 0, Skipped: 0, Time elapsed: 0.016 sec
Running org.apache.shindig.common.cache.ehcache.EhCacheCacheProviderTest
Tests run: 1, Failures: 0, Errors: 0, Skipped: 0, Time elapsed: 0.147 sec
Running org.apache.shindig.common.PairTest
Tests run: 1, Failures: 0, Errors: 0, Skipped: 0, Time elapsed: 0.002 sec
Running org.apache.shindig.common.util.DateUtilTest
Tests run: 11, Failures: 0, Errors: 0, Skipped: 0, Time elapsed: 0.017 sec
Running org.apache.shindig.auth.AuthInfoUtilTest
Tests run: 2, Failures: 0, Errors: 0, Skipped: 0, Time elapsed: 0.002 sec
Running org.apache.shindig.common.cache.LruCacheTest
Tests run: 2, Failures: 0, Errors: 0, Skipped: 0, Time elapsed: 0.002 sec

Results :

Tests run: 404, Failures: 0, Errors: 0, Skipped: 3

[TASKS] Skipping maven reporter: there is already a result available.
[HUDSON] Recording test results
[INFO] [jar:jar {execution: default-jar}]
[INFO] Building jar: <https://hudson.apache.org/hudson/job/Shindig/ws/trunk/java/common/target/shindig-common-3.0.0-SNAPSHOT.jar>
[TASKS] Skipping maven reporter: there is already a result available.[INFO] Preparing source:jar
[WARNING] Removing: jar from forked lifecycle, to prevent recursive invocation.

[HUDSON] Archiving <https://hudson.apache.org/hudson/job/Shindig/ws/trunk/java/common/pom.xml> to /home/hudson/hudson/jobs/Shindig/modules/org.apache.shindig$shindig-common/builds/2010-12-16_21-24-02/archive/org.apache.shindig/shindig-common/3.0.0-SNAPSHOT/pom.xml
[HUDSON] Archiving <https://hudson.apache.org/hudson/job/Shindig/ws/trunk/java/common/target/shindig-common-3.0.0-SNAPSHOT.jar> to /home/hudson/hudson/jobs/Shindig/modules/org.apache.shindig$shindig-common/builds/2010-12-16_21-24-02/archive/org.apache.shindig/shindig-common/3.0.0-SNAPSHOT/shindig-common-3.0.0-SNAPSHOT.jar
[INFO] [enforcer:enforce {execution: enforce-java}]
[TASKS] Skipping maven reporter: there is already a result available.
[INFO] [source:jar {execution: attach-sources}]
[INFO] org already added, skipping
[INFO] org/apache already added, skipping
[INFO] org/apache/shindig already added, skipping
[INFO] org/apache/shindig/common already added, skipping
[INFO] org/apache/shindig/common/cache already added, skipping
[INFO] org/apache/shindig/common/cache/ehcache already added, skipping
[INFO] org/apache/shindig/common/logging already added, skipping
[INFO] org/apache/shindig/common/logging/i18n already added, skipping
[INFO] META-INF already added, skipping
[INFO] META-INF/LICENSE already added, skipping
[INFO] META-INF/DEPENDENCIES already added, skipping
[INFO] META-INF/NOTICE already added, skipping
[INFO] Building jar: <https://hudson.apache.org/hudson/job/Shindig/ws/trunk/java/common/target/shindig-common-3.0.0-SNAPSHOT-sources.jar>
[INFO] org already added, skipping
[INFO] org/apache already added, skipping
[INFO] org/apache/shindig already added, skipping
[INFO] org/apache/shindig/common already added, skipping
[INFO] org/apache/shindig/common/cache already added, skipping
[INFO] org/apache/shindig/common/cache/ehcache already added, skipping
[INFO] org/apache/shindig/common/logging already added, skipping
[INFO] org/apache/shindig/common/logging/i18n already added, skipping
[INFO] META-INF already added, skipping
[INFO] META-INF/LICENSE already added, skipping
[INFO] META-INF/DEPENDENCIES already added, skipping
[INFO] META-INF/NOTICE already added, skipping
[TASKS] Skipping maven reporter: there is already a result available.
[INFO] Preparing source:test-jar
[WARNING] Removing: jar from forked lifecycle, to prevent recursive invocation.
[WARNING] Removing: test-jar from forked lifecycle, to prevent recursive invocation.
[HUDSON] Archiving <https://hudson.apache.org/hudson/job/Shindig/ws/trunk/java/common/target/shindig-common-3.0.0-SNAPSHOT-sources.jar> to /home/hudson/hudson/jobs/Shindig/modules/org.apache.shindig$shindig-common/builds/2010-12-16_21-24-02/archive/org.apache.shindig/shindig-common/3.0.0-SNAPSHOT/shindig-common-3.0.0-SNAPSHOT-sources.jar
[INFO] [enforcer:enforce {execution: enforce-java}]
[TASKS] Skipping maven reporter: there is already a result available.
[INFO] [source:test-jar {execution: attach-sources}]
[INFO] META-INF already added, skipping
[INFO] META-INF/LICENSE already added, skipping
[INFO] META-INF/DEPENDENCIES already added, skipping
[INFO] META-INF/NOTICE already added, skipping
[INFO] Building jar: <https://hudson.apache.org/hudson/job/Shindig/ws/trunk/java/common/target/shindig-common-3.0.0-SNAPSHOT-test-sources.jar>
[INFO] META-INF already added, skipping
[INFO] META-INF/LICENSE already added, skipping
[INFO] META-INF/DEPENDENCIES already added, skipping
[INFO] META-INF/NOTICE already added, skipping
[TASKS] Skipping maven reporter: there is already a result available.
[INFO] [jar:test-jar {execution: default}]
[INFO] Building jar: <https://hudson.apache.org/hudson/job/Shindig/ws/trunk/java/common/target/shindig-common-3.0.0-SNAPSHOT-tests.jar>
[TASKS] Skipping maven reporter: there is already a result available.[INFO] [tools:verify-legal-files {execution: verify-legal-files}]
[INFO] Checking legal files in: shindig-common-3.0.0-SNAPSHOT.jar
[INFO] Checking legal files in: shindig-common-3.0.0-SNAPSHOT-sources.jar
[INFO] Checking legal files in: shindig-common-3.0.0-SNAPSHOT-test-sources.jar
[INFO] Checking legal files in: shindig-common-3.0.0-SNAPSHOT-tests.jar

[TASKS] Skipping maven reporter: there is already a result available.[INFO] [install:install {execution: default-install}]
[INFO] Installing <https://hudson.apache.org/hudson/job/Shindig/ws/trunk/java/common/target/shindig-common-3.0.0-SNAPSHOT.jar> to /home/hudson/.m2/repository/org/apache/shindig/shindig-common/3.0.0-SNAPSHOT/shindig-common-3.0.0-SNAPSHOT.jar
[INFO] Installing <https://hudson.apache.org/hudson/job/Shindig/ws/trunk/java/common/target/shindig-common-3.0.0-SNAPSHOT-sources.jar> to /home/hudson/.m2/repository/org/apache/shindig/shindig-common/3.0.0-SNAPSHOT/shindig-common-3.0.0-SNAPSHOT-sources.jar
[INFO] Installing <https://hudson.apache.org/hudson/job/Shindig/ws/trunk/java/common/target/shindig-common-3.0.0-SNAPSHOT-test-sources.jar> to /home/hudson/.m2/repository/org/apache/shindig/shindig-common/3.0.0-SNAPSHOT/shindig-common-3.0.0-SNAPSHOT-test-sources.jar
[INFO] Installing <https://hudson.apache.org/hudson/job/Shindig/ws/trunk/java/common/target/shindig-common-3.0.0-SNAPSHOT-tests.jar> to /home/hudson/.m2/repository/org/apache/shindig/shindig-common/3.0.0-SNAPSHOT/shindig-common-3.0.0-SNAPSHOT-tests.jar

[TASKS] Skipping maven reporter: there is already a result available.
[HUDSON] Archiving <https://hudson.apache.org/hudson/job/Shindig/ws/trunk/java/common/target/shindig-common-3.0.0-SNAPSHOT-test-sources.jar> to /home/hudson/hudson/jobs/Shindig/modules/org.apache.shindig$shindig-common/builds/2010-12-16_21-24-02/archive/org.apache.shindig/shindig-common/3.0.0-SNAPSHOT/shindig-common-3.0.0-SNAPSHOT-test-sources.jar
[HUDSON] Archiving <https://hudson.apache.org/hudson/job/Shindig/ws/trunk/java/common/target/shindig-common-3.0.0-SNAPSHOT-tests.jar> to /home/hudson/hudson/jobs/Shindig/modules/org.apache.shindig$shindig-common/builds/2010-12-16_21-24-02/archive/org.apache.shindig/shindig-common/3.0.0-SNAPSHOT/shindig-common-3.0.0-SNAPSHOT-tests.jar
[INFO] ------------------------------------------------------------------------
[INFO] Building Apache Shindig Gadget Renderer
[INFO]    task-segment: [clean, install]
[INFO] ------------------------------------------------------------------------
[INFO] [clean:clean {execution: default-clean}]
[INFO] Deleting <https://hudson.apache.org/hudson/job/Shindig/ws/trunk/java/gadgets/target>
[TASKS] Scanning folder '<https://hudson.apache.org/hudson/job/Shindig/ws/trunk/java/gadgets/src/main/java'> for tasks ... 
[TASKS] Found 0.
[TASKS] Scanning folder '<https://hudson.apache.org/hudson/job/Shindig/ws/trunk/java/gadgets/src/test/java'> for tasks ... 
[TASKS] Found 0.
[TASKS] Scanning folder '<https://hudson.apache.org/hudson/job/Shindig/ws/trunk/java/gadgets/../../config'> for tasks ... 
[TASKS] Found 0.
[TASKS] Scanning folder '<https://hudson.apache.org/hudson/job/Shindig/ws/trunk/java/gadgets/src/main/resources'> for tasks ... 
[TASKS] Found 0.
[TASKS] Scanning folder '<https://hudson.apache.org/hudson/job/Shindig/ws/trunk/java/gadgets/../../content'> for tasks ... 
[TASKS] Found 0.
[TASKS] Scanning folder '<https://hudson.apache.org/hudson/job/Shindig/ws/trunk/java/gadgets/src/test/resources'> for tasks ... 
[TASKS] Found 0.
[WARNING] While downloading xml-apis:xml-apis:2.0.2
  This artifact has been relocated to xml-apis:xml-apis:1.0.b2.


[INFO] [enforcer:enforce {execution: enforce-java}]
[TASKS] Skipping maven reporter: there is already a result available.
[INFO] [remote-resources:process {execution: default}]
[TASKS] Skipping maven reporter: there is already a result available.[INFO] [resources:resources {execution: default-resources}]
[INFO] Using 'UTF-8' encoding to copy filtered resources.
[INFO] Copying 2 resources to config
[INFO] Copying 0 resource
[INFO] Copying 2 resources to files
[INFO] Copying 3 resources

[TASKS] Skipping maven reporter: there is already a result available.[INFO] [compiler:compile {execution: default-compile}]

[INFO] Compiling 260 source files to <https://hudson.apache.org/hudson/job/Shindig/ws/trunk/java/gadgets/target/classes>
[INFO] -------------------------------------------------------------
[WARNING] COMPILATION WARNING : 
[INFO] -------------------------------------------------------------
[WARNING] <https://hudson.apache.org/hudson/job/Shindig/ws/trunk/java/gadgets/src/main/java/org/apache/shindig/gadgets/parse/caja/VanillaCajaHtmlSerializer.java>:[41,21] [deprecation] render(org.w3c.dom.Node,boolean) in com.google.caja.parser.html.Nodes has been deprecated
[WARNING] <https://hudson.apache.org/hudson/job/Shindig/ws/trunk/java/gadgets/src/main/java/org/apache/shindig/gadgets/parse/caja/CajaHtmlSerializer.java>:[39,16] [deprecation] render(org.w3c.dom.Node,boolean) in com.google.caja.parser.html.Nodes has been deprecated
[INFO] 2 warnings 
[INFO] -------------------------------------------------------------
[INFO] -------------------------------------------------------------
[ERROR] COMPILATION ERROR : 
[INFO] -------------------------------------------------------------
[ERROR] <https://hudson.apache.org/hudson/job/Shindig/ws/trunk/java/gadgets/src/main/java/org/apache/shindig/gadgets/rewrite/image/JpegImageUtils.java>:[171,35] cannot find symbol
symbol  : method copyOf(int[],int)
location: class java.util.Arrays
[INFO] 1 error
[INFO] -------------------------------------------------------------
[TASKS] Skipping maven reporter: there is already a result available.
[HUDSON] Archiving <https://hudson.apache.org/hudson/job/Shindig/ws/trunk/java/gadgets/pom.xml> to /home/hudson/hudson/jobs/Shindig/modules/org.apache.shindig$shindig-gadgets/builds/2010-12-16_21-24-02/archive/org.apache.shindig/shindig-gadgets/3.0.0-SNAPSHOT/pom.xml
[INFO] ------------------------------------------------------------------------
[ERROR] BUILD FAILURE
[INFO] ------------------------------------------------------------------------
[INFO] Compilation failure
<https://hudson.apache.org/hudson/job/Shindig/ws/trunk/java/gadgets/src/main/java/org/apache/shindig/gadgets/rewrite/image/JpegImageUtils.java>:[171,35] cannot find symbol
symbol  : method copyOf(int[],int)
location: class java.util.Arrays

[INFO] ------------------------------------------------------------------------
[INFO] For more information, run Maven with the -e switch
[INFO] ------------------------------------------------------------------------
[INFO] Total time: 2 minutes 18 seconds
[INFO] Finished at: Thu Dec 16 21:26:32 UTC 2010
[INFO] Final Memory: 58M/264M
[INFO] ------------------------------------------------------------------------
Sending e-mails to: dev@shindig.apache.org
channel stopped
[WARNINGS] Skipping publisher since build result is FAILURE


Build failed in Hudson: Shindig #2059

Posted by Apache Hudson Server <hu...@hudson.apache.org>.
See <https://hudson.apache.org/hudson/job/Shindig/2059/changes>

Changes:

[lindner] rebuild swf, fix wpm/flash ref

------------------------------------------
[...truncated 537 lines...]
Tests run: 2, Failures: 0, Errors: 0, Skipped: 0, Time elapsed: 0.023 sec
Running org.apache.shindig.common.JsonSerializerTest
Tests run: 15, Failures: 0, Errors: 0, Skipped: 0, Time elapsed: 0.025 sec
Running org.apache.shindig.common.cache.LruCacheProviderTest
Dec 16, 2010 6:47:24 AM org.apache.shindig.common.cache.LruCacheProvider getCapacity(String name)
WARNING: Invalid LRU capacity configured for foo.
Tests run: 5, Failures: 0, Errors: 0, Skipped: 0, Time elapsed: 0.01 sec
Running org.apache.shindig.common.xml.DomUtilTest
Tests run: 3, Failures: 0, Errors: 0, Skipped: 0, Time elapsed: 0.005 sec
Running org.apache.shindig.config.JsonContainerConfigLoaderTest
Dec 16, 2010 6:47:24 AM org.apache.shindig.config.JsonContainerConfigLoader loadContainers
INFO: Loading files from/tmp/org.apache.shindig.config.JsonContainerConfigLoaderTest6934861092799882793.json
Dec 16, 2010 6:47:24 AM org.apache.shindig.config.JsonContainerConfigLoader loadFiles
INFO: Reading container config: org.apache.shindig.config.JsonContainerConfigLoaderTest6934861092799882793.json.
Dec 16, 2010 6:47:24 AM org.apache.shindig.config.JsonContainerConfigLoader loadContainers
INFO: Loading files from/tmp/org.apache.shindig.config.JsonContainerConfigLoaderTest6110770919950070563.json
Dec 16, 2010 6:47:24 AM org.apache.shindig.config.JsonContainerConfigLoader loadFiles
INFO: Reading container config: org.apache.shindig.config.JsonContainerConfigLoaderTest6110770919950070563.json.
Dec 16, 2010 6:47:24 AM org.apache.shindig.config.JsonContainerConfigLoader loadContainers
INFO: Loading files from/tmp/org.apache.shindig.config.JsonContainerConfigLoaderTest8463244587604078658.json
Dec 16, 2010 6:47:24 AM org.apache.shindig.config.JsonContainerConfigLoader loadFiles
INFO: Reading container config: org.apache.shindig.config.JsonContainerConfigLoaderTest8463244587604078658.json.
Dec 16, 2010 6:47:24 AM org.apache.shindig.config.JsonContainerConfigLoader loadContainers
INFO: Loading files from/tmp/org.apache.shindig.config.JsonContainerConfigLoaderTest2847239076457744410.json
Dec 16, 2010 6:47:24 AM org.apache.shindig.config.JsonContainerConfigLoader loadFiles
INFO: Reading container config: org.apache.shindig.config.JsonContainerConfigLoaderTest2847239076457744410.json.
Dec 16, 2010 6:47:24 AM org.apache.shindig.config.JsonContainerConfigLoader loadContainers
INFO: Loading files from/tmp/org.apache.shindig.config.JsonContainerConfigLoaderTest2762269868002171577.json
Dec 16, 2010 6:47:24 AM org.apache.shindig.config.JsonContainerConfigLoader loadFiles
INFO: Reading container config: org.apache.shindig.config.JsonContainerConfigLoaderTest2762269868002171577.json.
Dec 16, 2010 6:47:24 AM org.apache.shindig.config.JsonContainerConfigLoader loadContainers
INFO: Loading files from/tmp/org.apache.shindig.config.JsonContainerConfigLoaderTest8387526447807183887.json
Dec 16, 2010 6:47:24 AM org.apache.shindig.config.JsonContainerConfigLoader loadFiles
INFO: Reading container config: org.apache.shindig.config.JsonContainerConfigLoaderTest8387526447807183887.json.
Dec 16, 2010 6:47:24 AM org.apache.shindig.config.JsonContainerConfigLoader loadContainers
INFO: Loading files from/tmp/org.apache.shindig.config.JsonContainerConfigLoaderTest6306295505059555620.json
Dec 16, 2010 6:47:24 AM org.apache.shindig.config.JsonContainerConfigLoader loadFiles
INFO: Reading container config: org.apache.shindig.config.JsonContainerConfigLoaderTest6306295505059555620.json.
Dec 16, 2010 6:47:24 AM org.apache.shindig.config.JsonContainerConfigLoader loadContainers
INFO: Loading files from/tmp/org.apache.shindig.config.JsonContainerConfigLoaderTest8408853477151565797.json
Dec 16, 2010 6:47:24 AM org.apache.shindig.config.JsonContainerConfigLoader loadFiles
INFO: Reading container config: org.apache.shindig.config.JsonContainerConfigLoaderTest8408853477151565797.json.
Dec 16, 2010 6:47:24 AM org.apache.shindig.config.JsonContainerConfigLoader loadContainers
INFO: Loading files from/tmp/org.apache.shindig.config.JsonContainerConfigLoaderTest8465364223446264867.json
Dec 16, 2010 6:47:24 AM org.apache.shindig.config.JsonContainerConfigLoader loadFiles
INFO: Reading container config: org.apache.shindig.config.JsonContainerConfigLoaderTest8465364223446264867.json.
Dec 16, 2010 6:47:24 AM org.apache.shindig.config.JsonContainerConfigLoader loadContainers
INFO: Loading files from/tmp/org.apache.shindig.config.JsonContainerConfigLoaderTest6277347066354827456.json
Dec 16, 2010 6:47:24 AM org.apache.shindig.config.JsonContainerConfigLoader loadFiles
INFO: Reading container config: org.apache.shindig.config.JsonContainerConfigLoaderTest6277347066354827456.json.
Dec 16, 2010 6:47:24 AM org.apache.shindig.config.JsonContainerConfigLoader loadContainers
INFO: Loading files from/tmp/org.apache.shindig.config.JsonContainerConfigLoaderTest3197331790676352169.json
Dec 16, 2010 6:47:24 AM org.apache.shindig.config.JsonContainerConfigLoader loadFiles
INFO: Reading container config: org.apache.shindig.config.JsonContainerConfigLoaderTest3197331790676352169.json.
Dec 16, 2010 6:47:24 AM org.apache.shindig.config.JsonContainerConfigLoader loadContainers
INFO: Loading files from/tmp/org.apache.shindig.config.JsonContainerConfigLoaderTest3282690431752961266.json
Dec 16, 2010 6:47:24 AM org.apache.shindig.config.JsonContainerConfigLoader loadFiles
INFO: Reading container config: org.apache.shindig.config.JsonContainerConfigLoaderTest3282690431752961266.json.
Dec 16, 2010 6:47:24 AM org.apache.shindig.config.JsonContainerConfigLoader loadContainers
INFO: Loading files from/tmp/org.apache.shindig.config.JsonContainerConfigLoaderTest143659601334176659.json
Dec 16, 2010 6:47:24 AM org.apache.shindig.config.JsonContainerConfigLoader loadFiles
INFO: Reading container config: org.apache.shindig.config.JsonContainerConfigLoaderTest143659601334176659.json.
Dec 16, 2010 6:47:24 AM org.apache.shindig.config.JsonContainerConfigLoader loadContainers
INFO: Loading files from/tmp/org.apache.shindig.config.JsonContainerConfigLoaderTest6994694039411952655.json
Dec 16, 2010 6:47:24 AM org.apache.shindig.config.JsonContainerConfigLoader loadFiles
INFO: Reading container config: org.apache.shindig.config.JsonContainerConfigLoaderTest6994694039411952655.json.
Dec 16, 2010 6:47:24 AM org.apache.shindig.config.JsonContainerConfigLoader loadContainers
INFO: Loading files from/tmp/org.apache.shindig.config.JsonContainerConfigLoaderTest8763232627763892981.json
Dec 16, 2010 6:47:24 AM org.apache.shindig.config.JsonContainerConfigLoader loadFiles
INFO: Reading container config: org.apache.shindig.config.JsonContainerConfigLoaderTest8763232627763892981.json.
Dec 16, 2010 6:47:24 AM org.apache.shindig.config.JsonContainerConfigLoader loadContainers
INFO: Loading files from/tmp/org.apache.shindig.config.JsonContainerConfigLoaderTest3805724219529922020.json
Dec 16, 2010 6:47:24 AM org.apache.shindig.config.JsonContainerConfigLoader loadFiles
INFO: Reading container config: org.apache.shindig.config.JsonContainerConfigLoaderTest3805724219529922020.json.
Dec 16, 2010 6:47:24 AM org.apache.shindig.config.JsonContainerConfigLoader loadContainers
INFO: Loading files from/tmp/org.apache.shindig.config.JsonContainerConfigLoaderTest5898715886824987776.json
Dec 16, 2010 6:47:24 AM org.apache.shindig.config.JsonContainerConfigLoader loadFiles
INFO: Reading container config: org.apache.shindig.config.JsonContainerConfigLoaderTest5898715886824987776.json.
Tests run: 12, Failures: 0, Errors: 0, Skipped: 0, Time elapsed: 0.022 sec
Running org.apache.shindig.protocol.conversion.BeanJsonConverterTest
Tests run: 7, Failures: 0, Errors: 0, Skipped: 0, Time elapsed: 0.021 sec
Running org.apache.shindig.protocol.ContentTypesTest
Tests run: 8, Failures: 0, Errors: 0, Skipped: 0, Time elapsed: 0.004 sec
Running org.apache.shindig.auth.UrlParameterAuthenticationHandlerTest
Tests run: 6, Failures: 0, Errors: 0, Skipped: 0, Time elapsed: 0.01 sec
Running org.apache.shindig.protocol.conversion.BeanFilterTest
Tests run: 8, Failures: 0, Errors: 0, Skipped: 0, Time elapsed: 0.012 sec
Running org.apache.shindig.common.util.ImmediateFutureTest
Tests run: 6, Failures: 0, Errors: 0, Skipped: 0, Time elapsed: 0.004 sec
Running org.apache.shindig.common.uri.UriTest
Tests run: 24, Failures: 0, Errors: 0, Skipped: 0, Time elapsed: 0.015 sec
Running org.apache.shindig.common.cache.ehcache.EhCacheCacheProviderTest
Tests run: 1, Failures: 0, Errors: 0, Skipped: 0, Time elapsed: 0.126 sec
Running org.apache.shindig.common.PairTest
Tests run: 1, Failures: 0, Errors: 0, Skipped: 0, Time elapsed: 0.002 sec
Running org.apache.shindig.common.util.DateUtilTest
Tests run: 11, Failures: 0, Errors: 0, Skipped: 0, Time elapsed: 0.016 sec
Running org.apache.shindig.auth.AuthInfoUtilTest
Tests run: 2, Failures: 0, Errors: 0, Skipped: 0, Time elapsed: 0.002 sec
Running org.apache.shindig.common.cache.LruCacheTest
Tests run: 2, Failures: 0, Errors: 0, Skipped: 0, Time elapsed: 0.002 sec

Results :

Tests run: 404, Failures: 0, Errors: 0, Skipped: 3

[TASKS] Skipping maven reporter: there is already a result available.
[HUDSON] Recording test results
[INFO] [jar:jar {execution: default-jar}]
[INFO] Building jar: <https://hudson.apache.org/hudson/job/Shindig/ws/trunk/java/common/target/shindig-common-3.0.0-SNAPSHOT.jar>
[TASKS] Skipping maven reporter: there is already a result available.[INFO] Preparing source:jar
[WARNING] Removing: jar from forked lifecycle, to prevent recursive invocation.

[HUDSON] Archiving <https://hudson.apache.org/hudson/job/Shindig/ws/trunk/java/common/pom.xml> to /home/hudson/hudson/jobs/Shindig/modules/org.apache.shindig$shindig-common/builds/2010-12-16_06-45-04/archive/org.apache.shindig/shindig-common/3.0.0-SNAPSHOT/pom.xml
[HUDSON] Archiving <https://hudson.apache.org/hudson/job/Shindig/ws/trunk/java/common/target/shindig-common-3.0.0-SNAPSHOT.jar> to /home/hudson/hudson/jobs/Shindig/modules/org.apache.shindig$shindig-common/builds/2010-12-16_06-45-04/archive/org.apache.shindig/shindig-common/3.0.0-SNAPSHOT/shindig-common-3.0.0-SNAPSHOT.jar
[INFO] [enforcer:enforce {execution: enforce-java}]
[TASKS] Skipping maven reporter: there is already a result available.
[INFO] [source:jar {execution: attach-sources}]
[INFO] org already added, skipping
[INFO] org/apache already added, skipping
[INFO] org/apache/shindig already added, skipping
[INFO] org/apache/shindig/common already added, skipping
[INFO] org/apache/shindig/common/cache already added, skipping
[INFO] org/apache/shindig/common/cache/ehcache already added, skipping
[INFO] org/apache/shindig/common/logging already added, skipping
[INFO] org/apache/shindig/common/logging/i18n already added, skipping
[INFO] META-INF already added, skipping
[INFO] META-INF/LICENSE already added, skipping
[INFO] META-INF/DEPENDENCIES already added, skipping
[INFO] META-INF/NOTICE already added, skipping
[INFO] Building jar: <https://hudson.apache.org/hudson/job/Shindig/ws/trunk/java/common/target/shindig-common-3.0.0-SNAPSHOT-sources.jar>
[INFO] org already added, skipping
[INFO] org/apache already added, skipping
[INFO] org/apache/shindig already added, skipping
[INFO] org/apache/shindig/common already added, skipping
[INFO] org/apache/shindig/common/cache already added, skipping
[INFO] org/apache/shindig/common/cache/ehcache already added, skipping
[INFO] org/apache/shindig/common/logging already added, skipping
[INFO] org/apache/shindig/common/logging/i18n already added, skipping
[INFO] META-INF already added, skipping
[INFO] META-INF/LICENSE already added, skipping
[INFO] META-INF/DEPENDENCIES already added, skipping
[INFO] META-INF/NOTICE already added, skipping
[TASKS] Skipping maven reporter: there is already a result available.
[INFO] Preparing source:test-jar
[WARNING] Removing: jar from forked lifecycle, to prevent recursive invocation.
[WARNING] Removing: test-jar from forked lifecycle, to prevent recursive invocation.
[HUDSON] Archiving <https://hudson.apache.org/hudson/job/Shindig/ws/trunk/java/common/target/shindig-common-3.0.0-SNAPSHOT-sources.jar> to /home/hudson/hudson/jobs/Shindig/modules/org.apache.shindig$shindig-common/builds/2010-12-16_06-45-04/archive/org.apache.shindig/shindig-common/3.0.0-SNAPSHOT/shindig-common-3.0.0-SNAPSHOT-sources.jar
[INFO] [enforcer:enforce {execution: enforce-java}]
[TASKS] Skipping maven reporter: there is already a result available.
[INFO] [source:test-jar {execution: attach-sources}]
[INFO] META-INF already added, skipping
[INFO] META-INF/LICENSE already added, skipping
[INFO] META-INF/DEPENDENCIES already added, skipping
[INFO] META-INF/NOTICE already added, skipping
[INFO] Building jar: <https://hudson.apache.org/hudson/job/Shindig/ws/trunk/java/common/target/shindig-common-3.0.0-SNAPSHOT-test-sources.jar>
[INFO] META-INF already added, skipping
[INFO] META-INF/LICENSE already added, skipping
[INFO] META-INF/DEPENDENCIES already added, skipping
[INFO] META-INF/NOTICE already added, skipping
[TASKS] Skipping maven reporter: there is already a result available.
[INFO] [jar:test-jar {execution: default}]
[INFO] Building jar: <https://hudson.apache.org/hudson/job/Shindig/ws/trunk/java/common/target/shindig-common-3.0.0-SNAPSHOT-tests.jar>
[TASKS] Skipping maven reporter: there is already a result available.[INFO] [tools:verify-legal-files {execution: verify-legal-files}]
[INFO] Checking legal files in: shindig-common-3.0.0-SNAPSHOT.jar
[INFO] Checking legal files in: shindig-common-3.0.0-SNAPSHOT-sources.jar
[INFO] Checking legal files in: shindig-common-3.0.0-SNAPSHOT-test-sources.jar
[INFO] Checking legal files in: shindig-common-3.0.0-SNAPSHOT-tests.jar

[TASKS] Skipping maven reporter: there is already a result available.[INFO] [install:install {execution: default-install}]
[INFO] Installing <https://hudson.apache.org/hudson/job/Shindig/ws/trunk/java/common/target/shindig-common-3.0.0-SNAPSHOT.jar> to /home/hudson/.m2/repository/org/apache/shindig/shindig-common/3.0.0-SNAPSHOT/shindig-common-3.0.0-SNAPSHOT.jar
[INFO] Installing <https://hudson.apache.org/hudson/job/Shindig/ws/trunk/java/common/target/shindig-common-3.0.0-SNAPSHOT-sources.jar> to /home/hudson/.m2/repository/org/apache/shindig/shindig-common/3.0.0-SNAPSHOT/shindig-common-3.0.0-SNAPSHOT-sources.jar
[INFO] Installing <https://hudson.apache.org/hudson/job/Shindig/ws/trunk/java/common/target/shindig-common-3.0.0-SNAPSHOT-test-sources.jar> to /home/hudson/.m2/repository/org/apache/shindig/shindig-common/3.0.0-SNAPSHOT/shindig-common-3.0.0-SNAPSHOT-test-sources.jar
[INFO] Installing <https://hudson.apache.org/hudson/job/Shindig/ws/trunk/java/common/target/shindig-common-3.0.0-SNAPSHOT-tests.jar> to /home/hudson/.m2/repository/org/apache/shindig/shindig-common/3.0.0-SNAPSHOT/shindig-common-3.0.0-SNAPSHOT-tests.jar

[TASKS] Skipping maven reporter: there is already a result available.
[HUDSON] Archiving <https://hudson.apache.org/hudson/job/Shindig/ws/trunk/java/common/target/shindig-common-3.0.0-SNAPSHOT-test-sources.jar> to /home/hudson/hudson/jobs/Shindig/modules/org.apache.shindig$shindig-common/builds/2010-12-16_06-45-04/archive/org.apache.shindig/shindig-common/3.0.0-SNAPSHOT/shindig-common-3.0.0-SNAPSHOT-test-sources.jar
[HUDSON] Archiving <https://hudson.apache.org/hudson/job/Shindig/ws/trunk/java/common/target/shindig-common-3.0.0-SNAPSHOT-tests.jar> to /home/hudson/hudson/jobs/Shindig/modules/org.apache.shindig$shindig-common/builds/2010-12-16_06-45-04/archive/org.apache.shindig/shindig-common/3.0.0-SNAPSHOT/shindig-common-3.0.0-SNAPSHOT-tests.jar
[INFO] ------------------------------------------------------------------------
[INFO] Building Apache Shindig Gadget Renderer
[INFO]    task-segment: [clean, install]
[INFO] ------------------------------------------------------------------------
[INFO] [clean:clean {execution: default-clean}]
[INFO] Deleting <https://hudson.apache.org/hudson/job/Shindig/ws/trunk/java/gadgets/target>
[TASKS] Scanning folder '<https://hudson.apache.org/hudson/job/Shindig/ws/trunk/java/gadgets/src/main/java'> for tasks ... 
[TASKS] Found 0.
[TASKS] Scanning folder '<https://hudson.apache.org/hudson/job/Shindig/ws/trunk/java/gadgets/src/test/java'> for tasks ... 
[TASKS] Found 0.
[TASKS] Scanning folder '<https://hudson.apache.org/hudson/job/Shindig/ws/trunk/java/gadgets/../../config'> for tasks ... 
[TASKS] Found 0.
[TASKS] Scanning folder '<https://hudson.apache.org/hudson/job/Shindig/ws/trunk/java/gadgets/src/main/resources'> for tasks ... 
[TASKS] Found 0.
[TASKS] Scanning folder '<https://hudson.apache.org/hudson/job/Shindig/ws/trunk/java/gadgets/../../content'> for tasks ... 
[TASKS] Found 0.
[TASKS] Scanning folder '<https://hudson.apache.org/hudson/job/Shindig/ws/trunk/java/gadgets/src/test/resources'> for tasks ... 
[TASKS] Found 0.
[WARNING] While downloading xml-apis:xml-apis:2.0.2
  This artifact has been relocated to xml-apis:xml-apis:1.0.b2.


[INFO] [enforcer:enforce {execution: enforce-java}]
[TASKS] Skipping maven reporter: there is already a result available.
[INFO] [remote-resources:process {execution: default}]
[TASKS] Skipping maven reporter: there is already a result available.[INFO] [resources:resources {execution: default-resources}]
[INFO] Using 'UTF-8' encoding to copy filtered resources.
[INFO] Copying 2 resources to config
[INFO] Copying 0 resource
[INFO] Copying 2 resources to files
[INFO] Copying 3 resources

[TASKS] Skipping maven reporter: there is already a result available.[INFO] [compiler:compile {execution: default-compile}]

[INFO] Compiling 260 source files to <https://hudson.apache.org/hudson/job/Shindig/ws/trunk/java/gadgets/target/classes>
[INFO] -------------------------------------------------------------
[WARNING] COMPILATION WARNING : 
[INFO] -------------------------------------------------------------
[WARNING] <https://hudson.apache.org/hudson/job/Shindig/ws/trunk/java/gadgets/src/main/java/org/apache/shindig/gadgets/parse/caja/VanillaCajaHtmlSerializer.java>:[41,21] [deprecation] render(org.w3c.dom.Node,boolean) in com.google.caja.parser.html.Nodes has been deprecated
[WARNING] <https://hudson.apache.org/hudson/job/Shindig/ws/trunk/java/gadgets/src/main/java/org/apache/shindig/gadgets/parse/caja/CajaHtmlSerializer.java>:[39,16] [deprecation] render(org.w3c.dom.Node,boolean) in com.google.caja.parser.html.Nodes has been deprecated
[INFO] 2 warnings 
[INFO] -------------------------------------------------------------
[INFO] -------------------------------------------------------------
[ERROR] COMPILATION ERROR : 
[INFO] -------------------------------------------------------------
[ERROR] <https://hudson.apache.org/hudson/job/Shindig/ws/trunk/java/gadgets/src/main/java/org/apache/shindig/gadgets/rewrite/image/JpegImageUtils.java>:[171,35] cannot find symbol
symbol  : method copyOf(int[],int)
location: class java.util.Arrays
[INFO] 1 error
[INFO] -------------------------------------------------------------
[TASKS] Skipping maven reporter: there is already a result available.
[HUDSON] Archiving <https://hudson.apache.org/hudson/job/Shindig/ws/trunk/java/gadgets/pom.xml> to /home/hudson/hudson/jobs/Shindig/modules/org.apache.shindig$shindig-gadgets/builds/2010-12-16_06-45-04/archive/org.apache.shindig/shindig-gadgets/3.0.0-SNAPSHOT/pom.xml
[INFO] ------------------------------------------------------------------------
[ERROR] BUILD FAILURE
[INFO] ------------------------------------------------------------------------
[INFO] Compilation failure
<https://hudson.apache.org/hudson/job/Shindig/ws/trunk/java/gadgets/src/main/java/org/apache/shindig/gadgets/rewrite/image/JpegImageUtils.java>:[171,35] cannot find symbol
symbol  : method copyOf(int[],int)
location: class java.util.Arrays

[INFO] ------------------------------------------------------------------------
[INFO] For more information, run Maven with the -e switch
[INFO] ------------------------------------------------------------------------
[INFO] Total time: 2 minutes 53 seconds
[INFO] Finished at: Thu Dec 16 06:48:11 UTC 2010
[INFO] Final Memory: 59M/264M
[INFO] ------------------------------------------------------------------------
Waiting for Hudson to finish collecting data
Sending e-mails to: dev@shindig.apache.org
channel stopped
[WARNINGS] Skipping publisher since build result is FAILURE


Build failed in Hudson: Shindig #2058

Posted by Apache Hudson Server <hu...@hudson.apache.org>.
See <https://hudson.apache.org/hudson/job/Shindig/2058/changes>

Changes:

[johnh] Rename callback methods for relay SWF. TODO: build this and commit.

[johnh] Beginning of transport for Flash-type transport. Not integrated w/ rpc.js at all, and code builds, so committing early for comment and iteration.

------------------------------------------
[...truncated 537 lines...]
Tests run: 2, Failures: 0, Errors: 0, Skipped: 0, Time elapsed: 0.025 sec
Running org.apache.shindig.common.JsonSerializerTest
Tests run: 15, Failures: 0, Errors: 0, Skipped: 0, Time elapsed: 0.025 sec
Running org.apache.shindig.common.cache.LruCacheProviderTest
Dec 16, 2010 4:00:26 AM org.apache.shindig.common.cache.LruCacheProvider getCapacity(String name)
WARNING: Invalid LRU capacity configured for foo.
Tests run: 5, Failures: 0, Errors: 0, Skipped: 0, Time elapsed: 0.01 sec
Running org.apache.shindig.common.xml.DomUtilTest
Tests run: 3, Failures: 0, Errors: 0, Skipped: 0, Time elapsed: 0.004 sec
Running org.apache.shindig.config.JsonContainerConfigLoaderTest
Dec 16, 2010 4:00:26 AM org.apache.shindig.config.JsonContainerConfigLoader loadContainers
INFO: Loading files from/tmp/org.apache.shindig.config.JsonContainerConfigLoaderTest3908265347732744061.json
Dec 16, 2010 4:00:26 AM org.apache.shindig.config.JsonContainerConfigLoader loadFiles
INFO: Reading container config: org.apache.shindig.config.JsonContainerConfigLoaderTest3908265347732744061.json.
Dec 16, 2010 4:00:26 AM org.apache.shindig.config.JsonContainerConfigLoader loadContainers
INFO: Loading files from/tmp/org.apache.shindig.config.JsonContainerConfigLoaderTest3912404101619131050.json
Dec 16, 2010 4:00:26 AM org.apache.shindig.config.JsonContainerConfigLoader loadFiles
INFO: Reading container config: org.apache.shindig.config.JsonContainerConfigLoaderTest3912404101619131050.json.
Dec 16, 2010 4:00:26 AM org.apache.shindig.config.JsonContainerConfigLoader loadContainers
INFO: Loading files from/tmp/org.apache.shindig.config.JsonContainerConfigLoaderTest1132668541368390210.json
Dec 16, 2010 4:00:26 AM org.apache.shindig.config.JsonContainerConfigLoader loadFiles
INFO: Reading container config: org.apache.shindig.config.JsonContainerConfigLoaderTest1132668541368390210.json.
Dec 16, 2010 4:00:26 AM org.apache.shindig.config.JsonContainerConfigLoader loadContainers
INFO: Loading files from/tmp/org.apache.shindig.config.JsonContainerConfigLoaderTest5489111842308984107.json
Dec 16, 2010 4:00:26 AM org.apache.shindig.config.JsonContainerConfigLoader loadFiles
INFO: Reading container config: org.apache.shindig.config.JsonContainerConfigLoaderTest5489111842308984107.json.
Dec 16, 2010 4:00:26 AM org.apache.shindig.config.JsonContainerConfigLoader loadContainers
INFO: Loading files from/tmp/org.apache.shindig.config.JsonContainerConfigLoaderTest6717508004615993941.json
Dec 16, 2010 4:00:26 AM org.apache.shindig.config.JsonContainerConfigLoader loadFiles
INFO: Reading container config: org.apache.shindig.config.JsonContainerConfigLoaderTest6717508004615993941.json.
Dec 16, 2010 4:00:26 AM org.apache.shindig.config.JsonContainerConfigLoader loadContainers
INFO: Loading files from/tmp/org.apache.shindig.config.JsonContainerConfigLoaderTest6335201837289270513.json
Dec 16, 2010 4:00:26 AM org.apache.shindig.config.JsonContainerConfigLoader loadFiles
INFO: Reading container config: org.apache.shindig.config.JsonContainerConfigLoaderTest6335201837289270513.json.
Dec 16, 2010 4:00:26 AM org.apache.shindig.config.JsonContainerConfigLoader loadContainers
INFO: Loading files from/tmp/org.apache.shindig.config.JsonContainerConfigLoaderTest4702340047621092495.json
Dec 16, 2010 4:00:26 AM org.apache.shindig.config.JsonContainerConfigLoader loadFiles
INFO: Reading container config: org.apache.shindig.config.JsonContainerConfigLoaderTest4702340047621092495.json.
Dec 16, 2010 4:00:26 AM org.apache.shindig.config.JsonContainerConfigLoader loadContainers
INFO: Loading files from/tmp/org.apache.shindig.config.JsonContainerConfigLoaderTest6746052322575326014.json
Dec 16, 2010 4:00:26 AM org.apache.shindig.config.JsonContainerConfigLoader loadFiles
INFO: Reading container config: org.apache.shindig.config.JsonContainerConfigLoaderTest6746052322575326014.json.
Dec 16, 2010 4:00:26 AM org.apache.shindig.config.JsonContainerConfigLoader loadContainers
INFO: Loading files from/tmp/org.apache.shindig.config.JsonContainerConfigLoaderTest666557492058835811.json
Dec 16, 2010 4:00:26 AM org.apache.shindig.config.JsonContainerConfigLoader loadFiles
INFO: Reading container config: org.apache.shindig.config.JsonContainerConfigLoaderTest666557492058835811.json.
Dec 16, 2010 4:00:26 AM org.apache.shindig.config.JsonContainerConfigLoader loadContainers
INFO: Loading files from/tmp/org.apache.shindig.config.JsonContainerConfigLoaderTest1381987780197119029.json
Dec 16, 2010 4:00:26 AM org.apache.shindig.config.JsonContainerConfigLoader loadFiles
INFO: Reading container config: org.apache.shindig.config.JsonContainerConfigLoaderTest1381987780197119029.json.
Dec 16, 2010 4:00:26 AM org.apache.shindig.config.JsonContainerConfigLoader loadContainers
INFO: Loading files from/tmp/org.apache.shindig.config.JsonContainerConfigLoaderTest8699823745192976250.json
Dec 16, 2010 4:00:26 AM org.apache.shindig.config.JsonContainerConfigLoader loadFiles
INFO: Reading container config: org.apache.shindig.config.JsonContainerConfigLoaderTest8699823745192976250.json.
Dec 16, 2010 4:00:26 AM org.apache.shindig.config.JsonContainerConfigLoader loadContainers
INFO: Loading files from/tmp/org.apache.shindig.config.JsonContainerConfigLoaderTest7223678947992938439.json
Dec 16, 2010 4:00:26 AM org.apache.shindig.config.JsonContainerConfigLoader loadFiles
INFO: Reading container config: org.apache.shindig.config.JsonContainerConfigLoaderTest7223678947992938439.json.
Dec 16, 2010 4:00:26 AM org.apache.shindig.config.JsonContainerConfigLoader loadContainers
INFO: Loading files from/tmp/org.apache.shindig.config.JsonContainerConfigLoaderTest6798043547654238454.json
Dec 16, 2010 4:00:26 AM org.apache.shindig.config.JsonContainerConfigLoader loadFiles
INFO: Reading container config: org.apache.shindig.config.JsonContainerConfigLoaderTest6798043547654238454.json.
Dec 16, 2010 4:00:26 AM org.apache.shindig.config.JsonContainerConfigLoader loadContainers
INFO: Loading files from/tmp/org.apache.shindig.config.JsonContainerConfigLoaderTest2252402645173983916.json
Dec 16, 2010 4:00:26 AM org.apache.shindig.config.JsonContainerConfigLoader loadFiles
INFO: Reading container config: org.apache.shindig.config.JsonContainerConfigLoaderTest2252402645173983916.json.
Dec 16, 2010 4:00:26 AM org.apache.shindig.config.JsonContainerConfigLoader loadContainers
INFO: Loading files from/tmp/org.apache.shindig.config.JsonContainerConfigLoaderTest2459702809988808026.json
Dec 16, 2010 4:00:26 AM org.apache.shindig.config.JsonContainerConfigLoader loadFiles
INFO: Reading container config: org.apache.shindig.config.JsonContainerConfigLoaderTest2459702809988808026.json.
Dec 16, 2010 4:00:26 AM org.apache.shindig.config.JsonContainerConfigLoader loadContainers
INFO: Loading files from/tmp/org.apache.shindig.config.JsonContainerConfigLoaderTest2471615916411160925.json
Dec 16, 2010 4:00:26 AM org.apache.shindig.config.JsonContainerConfigLoader loadFiles
INFO: Reading container config: org.apache.shindig.config.JsonContainerConfigLoaderTest2471615916411160925.json.
Dec 16, 2010 4:00:26 AM org.apache.shindig.config.JsonContainerConfigLoader loadContainers
INFO: Loading files from/tmp/org.apache.shindig.config.JsonContainerConfigLoaderTest9030808173670368483.json
Dec 16, 2010 4:00:26 AM org.apache.shindig.config.JsonContainerConfigLoader loadFiles
INFO: Reading container config: org.apache.shindig.config.JsonContainerConfigLoaderTest9030808173670368483.json.
Tests run: 12, Failures: 0, Errors: 0, Skipped: 0, Time elapsed: 0.022 sec
Running org.apache.shindig.protocol.conversion.BeanJsonConverterTest
Tests run: 7, Failures: 0, Errors: 0, Skipped: 0, Time elapsed: 0.022 sec
Running org.apache.shindig.protocol.ContentTypesTest
Tests run: 8, Failures: 0, Errors: 0, Skipped: 0, Time elapsed: 0.005 sec
Running org.apache.shindig.auth.UrlParameterAuthenticationHandlerTest
Tests run: 6, Failures: 0, Errors: 0, Skipped: 0, Time elapsed: 0.01 sec
Running org.apache.shindig.protocol.conversion.BeanFilterTest
Tests run: 8, Failures: 0, Errors: 0, Skipped: 0, Time elapsed: 0.012 sec
Running org.apache.shindig.common.util.ImmediateFutureTest
Tests run: 6, Failures: 0, Errors: 0, Skipped: 0, Time elapsed: 0.005 sec
Running org.apache.shindig.common.uri.UriTest
Tests run: 24, Failures: 0, Errors: 0, Skipped: 0, Time elapsed: 0.026 sec
Running org.apache.shindig.common.cache.ehcache.EhCacheCacheProviderTest
Tests run: 1, Failures: 0, Errors: 0, Skipped: 0, Time elapsed: 0.17 sec
Running org.apache.shindig.common.PairTest
Tests run: 1, Failures: 0, Errors: 0, Skipped: 0, Time elapsed: 0.002 sec
Running org.apache.shindig.common.util.DateUtilTest
Tests run: 11, Failures: 0, Errors: 0, Skipped: 0, Time elapsed: 0.017 sec
Running org.apache.shindig.auth.AuthInfoUtilTest
Tests run: 2, Failures: 0, Errors: 0, Skipped: 0, Time elapsed: 0.002 sec
Running org.apache.shindig.common.cache.LruCacheTest
Tests run: 2, Failures: 0, Errors: 0, Skipped: 0, Time elapsed: 0.003 sec

Results :

Tests run: 404, Failures: 0, Errors: 0, Skipped: 3

[TASKS] Skipping maven reporter: there is already a result available.
[HUDSON] Recording test results
[INFO] [jar:jar {execution: default-jar}]
[INFO] Building jar: <https://hudson.apache.org/hudson/job/Shindig/ws/trunk/java/common/target/shindig-common-3.0.0-SNAPSHOT.jar>
[TASKS] Skipping maven reporter: there is already a result available.[INFO] Preparing source:jar
[WARNING] Removing: jar from forked lifecycle, to prevent recursive invocation.

[HUDSON] Archiving <https://hudson.apache.org/hudson/job/Shindig/ws/trunk/java/common/pom.xml> to /home/hudson/hudson/jobs/Shindig/modules/org.apache.shindig$shindig-common/builds/2010-12-16_03-58-53/archive/org.apache.shindig/shindig-common/3.0.0-SNAPSHOT/pom.xml
[HUDSON] Archiving <https://hudson.apache.org/hudson/job/Shindig/ws/trunk/java/common/target/shindig-common-3.0.0-SNAPSHOT.jar> to /home/hudson/hudson/jobs/Shindig/modules/org.apache.shindig$shindig-common/builds/2010-12-16_03-58-53/archive/org.apache.shindig/shindig-common/3.0.0-SNAPSHOT/shindig-common-3.0.0-SNAPSHOT.jar
[INFO] [enforcer:enforce {execution: enforce-java}]
[TASKS] Skipping maven reporter: there is already a result available.
[INFO] [source:jar {execution: attach-sources}]
[INFO] org already added, skipping
[INFO] org/apache already added, skipping
[INFO] org/apache/shindig already added, skipping
[INFO] org/apache/shindig/common already added, skipping
[INFO] org/apache/shindig/common/cache already added, skipping
[INFO] org/apache/shindig/common/cache/ehcache already added, skipping
[INFO] org/apache/shindig/common/logging already added, skipping
[INFO] org/apache/shindig/common/logging/i18n already added, skipping
[INFO] META-INF already added, skipping
[INFO] META-INF/LICENSE already added, skipping
[INFO] META-INF/DEPENDENCIES already added, skipping
[INFO] META-INF/NOTICE already added, skipping
[INFO] Building jar: <https://hudson.apache.org/hudson/job/Shindig/ws/trunk/java/common/target/shindig-common-3.0.0-SNAPSHOT-sources.jar>
[INFO] org already added, skipping
[INFO] org/apache already added, skipping
[INFO] org/apache/shindig already added, skipping
[INFO] org/apache/shindig/common already added, skipping
[INFO] org/apache/shindig/common/cache already added, skipping
[INFO] org/apache/shindig/common/cache/ehcache already added, skipping
[INFO] org/apache/shindig/common/logging already added, skipping
[INFO] org/apache/shindig/common/logging/i18n already added, skipping
[INFO] META-INF already added, skipping
[INFO] META-INF/LICENSE already added, skipping
[INFO] META-INF/DEPENDENCIES already added, skipping
[INFO] META-INF/NOTICE already added, skipping
[TASKS] Skipping maven reporter: there is already a result available.
[INFO] Preparing source:test-jar
[WARNING] Removing: jar from forked lifecycle, to prevent recursive invocation.
[WARNING] Removing: test-jar from forked lifecycle, to prevent recursive invocation.
[HUDSON] Archiving <https://hudson.apache.org/hudson/job/Shindig/ws/trunk/java/common/target/shindig-common-3.0.0-SNAPSHOT-sources.jar> to /home/hudson/hudson/jobs/Shindig/modules/org.apache.shindig$shindig-common/builds/2010-12-16_03-58-53/archive/org.apache.shindig/shindig-common/3.0.0-SNAPSHOT/shindig-common-3.0.0-SNAPSHOT-sources.jar
[INFO] [enforcer:enforce {execution: enforce-java}]
[TASKS] Skipping maven reporter: there is already a result available.
[INFO] [source:test-jar {execution: attach-sources}]
[INFO] META-INF already added, skipping
[INFO] META-INF/LICENSE already added, skipping
[INFO] META-INF/DEPENDENCIES already added, skipping
[INFO] META-INF/NOTICE already added, skipping
[INFO] Building jar: <https://hudson.apache.org/hudson/job/Shindig/ws/trunk/java/common/target/shindig-common-3.0.0-SNAPSHOT-test-sources.jar>
[INFO] META-INF already added, skipping
[INFO] META-INF/LICENSE already added, skipping
[INFO] META-INF/DEPENDENCIES already added, skipping
[INFO] META-INF/NOTICE already added, skipping
[TASKS] Skipping maven reporter: there is already a result available.
[INFO] [jar:test-jar {execution: default}]
[INFO] Building jar: <https://hudson.apache.org/hudson/job/Shindig/ws/trunk/java/common/target/shindig-common-3.0.0-SNAPSHOT-tests.jar>
[TASKS] Skipping maven reporter: there is already a result available.[INFO] [tools:verify-legal-files {execution: verify-legal-files}]
[INFO] Checking legal files in: shindig-common-3.0.0-SNAPSHOT.jar
[INFO] Checking legal files in: shindig-common-3.0.0-SNAPSHOT-sources.jar
[INFO] Checking legal files in: shindig-common-3.0.0-SNAPSHOT-test-sources.jar
[INFO] Checking legal files in: shindig-common-3.0.0-SNAPSHOT-tests.jar

[TASKS] Skipping maven reporter: there is already a result available.[INFO] [install:install {execution: default-install}]
[INFO] Installing <https://hudson.apache.org/hudson/job/Shindig/ws/trunk/java/common/target/shindig-common-3.0.0-SNAPSHOT.jar> to /home/hudson/.m2/repository/org/apache/shindig/shindig-common/3.0.0-SNAPSHOT/shindig-common-3.0.0-SNAPSHOT.jar
[INFO] Installing <https://hudson.apache.org/hudson/job/Shindig/ws/trunk/java/common/target/shindig-common-3.0.0-SNAPSHOT-sources.jar> to /home/hudson/.m2/repository/org/apache/shindig/shindig-common/3.0.0-SNAPSHOT/shindig-common-3.0.0-SNAPSHOT-sources.jar
[INFO] Installing <https://hudson.apache.org/hudson/job/Shindig/ws/trunk/java/common/target/shindig-common-3.0.0-SNAPSHOT-test-sources.jar> to /home/hudson/.m2/repository/org/apache/shindig/shindig-common/3.0.0-SNAPSHOT/shindig-common-3.0.0-SNAPSHOT-test-sources.jar
[INFO] Installing <https://hudson.apache.org/hudson/job/Shindig/ws/trunk/java/common/target/shindig-common-3.0.0-SNAPSHOT-tests.jar> to /home/hudson/.m2/repository/org/apache/shindig/shindig-common/3.0.0-SNAPSHOT/shindig-common-3.0.0-SNAPSHOT-tests.jar

[TASKS] Skipping maven reporter: there is already a result available.
[HUDSON] Archiving <https://hudson.apache.org/hudson/job/Shindig/ws/trunk/java/common/target/shindig-common-3.0.0-SNAPSHOT-test-sources.jar> to /home/hudson/hudson/jobs/Shindig/modules/org.apache.shindig$shindig-common/builds/2010-12-16_03-58-53/archive/org.apache.shindig/shindig-common/3.0.0-SNAPSHOT/shindig-common-3.0.0-SNAPSHOT-test-sources.jar
[HUDSON] Archiving <https://hudson.apache.org/hudson/job/Shindig/ws/trunk/java/common/target/shindig-common-3.0.0-SNAPSHOT-tests.jar> to /home/hudson/hudson/jobs/Shindig/modules/org.apache.shindig$shindig-common/builds/2010-12-16_03-58-53/archive/org.apache.shindig/shindig-common/3.0.0-SNAPSHOT/shindig-common-3.0.0-SNAPSHOT-tests.jar
[INFO] ------------------------------------------------------------------------
[INFO] Building Apache Shindig Gadget Renderer
[INFO]    task-segment: [clean, install]
[INFO] ------------------------------------------------------------------------
[INFO] [clean:clean {execution: default-clean}]
[INFO] Deleting <https://hudson.apache.org/hudson/job/Shindig/ws/trunk/java/gadgets/target>
[TASKS] Scanning folder '<https://hudson.apache.org/hudson/job/Shindig/ws/trunk/java/gadgets/src/main/java'> for tasks ... 
[TASKS] Found 0.
[TASKS] Scanning folder '<https://hudson.apache.org/hudson/job/Shindig/ws/trunk/java/gadgets/src/test/java'> for tasks ... 
[TASKS] Found 0.
[TASKS] Scanning folder '<https://hudson.apache.org/hudson/job/Shindig/ws/trunk/java/gadgets/../../config'> for tasks ... 
[TASKS] Found 0.
[TASKS] Scanning folder '<https://hudson.apache.org/hudson/job/Shindig/ws/trunk/java/gadgets/src/main/resources'> for tasks ... 
[TASKS] Found 0.
[TASKS] Scanning folder '<https://hudson.apache.org/hudson/job/Shindig/ws/trunk/java/gadgets/../../content'> for tasks ... 
[TASKS] Found 0.
[TASKS] Scanning folder '<https://hudson.apache.org/hudson/job/Shindig/ws/trunk/java/gadgets/src/test/resources'> for tasks ... 
[TASKS] Found 0.
[WARNING] While downloading xml-apis:xml-apis:2.0.2
  This artifact has been relocated to xml-apis:xml-apis:1.0.b2.


[INFO] [enforcer:enforce {execution: enforce-java}]
[TASKS] Skipping maven reporter: there is already a result available.
[INFO] [remote-resources:process {execution: default}]
[TASKS] Skipping maven reporter: there is already a result available.[INFO] [resources:resources {execution: default-resources}]
[INFO] Using 'UTF-8' encoding to copy filtered resources.
[INFO] Copying 2 resources to config
[INFO] Copying 0 resource
[INFO] Copying 2 resources to files
[INFO] Copying 3 resources

[TASKS] Skipping maven reporter: there is already a result available.[INFO] [compiler:compile {execution: default-compile}]

[INFO] Compiling 260 source files to <https://hudson.apache.org/hudson/job/Shindig/ws/trunk/java/gadgets/target/classes>
[INFO] -------------------------------------------------------------
[WARNING] COMPILATION WARNING : 
[INFO] -------------------------------------------------------------
[WARNING] <https://hudson.apache.org/hudson/job/Shindig/ws/trunk/java/gadgets/src/main/java/org/apache/shindig/gadgets/parse/caja/VanillaCajaHtmlSerializer.java>:[41,21] [deprecation] render(org.w3c.dom.Node,boolean) in com.google.caja.parser.html.Nodes has been deprecated
[WARNING] <https://hudson.apache.org/hudson/job/Shindig/ws/trunk/java/gadgets/src/main/java/org/apache/shindig/gadgets/parse/caja/CajaHtmlSerializer.java>:[39,16] [deprecation] render(org.w3c.dom.Node,boolean) in com.google.caja.parser.html.Nodes has been deprecated
[INFO] 2 warnings 
[INFO] -------------------------------------------------------------
[INFO] -------------------------------------------------------------
[ERROR] COMPILATION ERROR : 
[INFO] -------------------------------------------------------------
[ERROR] <https://hudson.apache.org/hudson/job/Shindig/ws/trunk/java/gadgets/src/main/java/org/apache/shindig/gadgets/rewrite/image/JpegImageUtils.java>:[171,35] cannot find symbol
symbol  : method copyOf(int[],int)
location: class java.util.Arrays
[INFO] 1 error
[INFO] -------------------------------------------------------------
[TASKS] Skipping maven reporter: there is already a result available.
[HUDSON] Archiving <https://hudson.apache.org/hudson/job/Shindig/ws/trunk/java/gadgets/pom.xml> to /home/hudson/hudson/jobs/Shindig/modules/org.apache.shindig$shindig-gadgets/builds/2010-12-16_03-58-53/archive/org.apache.shindig/shindig-gadgets/3.0.0-SNAPSHOT/pom.xml
[INFO] ------------------------------------------------------------------------
[ERROR] BUILD FAILURE
[INFO] ------------------------------------------------------------------------
[INFO] Compilation failure
<https://hudson.apache.org/hudson/job/Shindig/ws/trunk/java/gadgets/src/main/java/org/apache/shindig/gadgets/rewrite/image/JpegImageUtils.java>:[171,35] cannot find symbol
symbol  : method copyOf(int[],int)
location: class java.util.Arrays

[INFO] ------------------------------------------------------------------------
[INFO] For more information, run Maven with the -e switch
[INFO] ------------------------------------------------------------------------
[INFO] Total time: 1 minute 48 seconds
[INFO] Finished at: Thu Dec 16 04:00:53 UTC 2010
[INFO] Final Memory: 58M/264M
[INFO] ------------------------------------------------------------------------
Waiting for Hudson to finish collecting data
Sending e-mails to: dev@shindig.apache.org
channel stopped
[WARNINGS] Skipping publisher since build result is FAILURE


Build failed in Hudson: Shindig #2057

Posted by Apache Hudson Server <hu...@hudson.apache.org>.
See <https://hudson.apache.org/hudson/job/Shindig/2057/changes>

Changes:

[lindner] start of the rpc flash bridge

------------------------------------------
[...truncated 540 lines...]
Running org.apache.shindig.common.cache.SoftExpiringCacheTest
Tests run: 2, Failures: 0, Errors: 0, Skipped: 0, Time elapsed: 0.026 sec
Running org.apache.shindig.common.JsonSerializerTest
Tests run: 15, Failures: 0, Errors: 0, Skipped: 0, Time elapsed: 0.028 sec
Running org.apache.shindig.common.cache.LruCacheProviderTest
Dec 16, 2010 2:13:03 AM org.apache.shindig.common.cache.LruCacheProvider getCapacity(String name)
WARNING: Invalid LRU capacity configured for foo.
Tests run: 5, Failures: 0, Errors: 0, Skipped: 0, Time elapsed: 0.012 sec
Running org.apache.shindig.common.xml.DomUtilTest
Tests run: 3, Failures: 0, Errors: 0, Skipped: 0, Time elapsed: 0.006 sec
Running org.apache.shindig.config.JsonContainerConfigLoaderTest
Dec 16, 2010 2:13:03 AM org.apache.shindig.config.JsonContainerConfigLoader loadContainers
INFO: Loading files from/tmp/org.apache.shindig.config.JsonContainerConfigLoaderTest745686060130824509.json
Dec 16, 2010 2:13:03 AM org.apache.shindig.config.JsonContainerConfigLoader loadFiles
INFO: Reading container config: org.apache.shindig.config.JsonContainerConfigLoaderTest745686060130824509.json.
Dec 16, 2010 2:13:03 AM org.apache.shindig.config.JsonContainerConfigLoader loadContainers
INFO: Loading files from/tmp/org.apache.shindig.config.JsonContainerConfigLoaderTest1279512869864383588.json
Dec 16, 2010 2:13:03 AM org.apache.shindig.config.JsonContainerConfigLoader loadFiles
INFO: Reading container config: org.apache.shindig.config.JsonContainerConfigLoaderTest1279512869864383588.json.
Dec 16, 2010 2:13:03 AM org.apache.shindig.config.JsonContainerConfigLoader loadContainers
INFO: Loading files from/tmp/org.apache.shindig.config.JsonContainerConfigLoaderTest3337337775009720451.json
Dec 16, 2010 2:13:03 AM org.apache.shindig.config.JsonContainerConfigLoader loadFiles
INFO: Reading container config: org.apache.shindig.config.JsonContainerConfigLoaderTest3337337775009720451.json.
Dec 16, 2010 2:13:03 AM org.apache.shindig.config.JsonContainerConfigLoader loadContainers
INFO: Loading files from/tmp/org.apache.shindig.config.JsonContainerConfigLoaderTest4892690511420697921.json
Dec 16, 2010 2:13:03 AM org.apache.shindig.config.JsonContainerConfigLoader loadFiles
INFO: Reading container config: org.apache.shindig.config.JsonContainerConfigLoaderTest4892690511420697921.json.
Dec 16, 2010 2:13:03 AM org.apache.shindig.config.JsonContainerConfigLoader loadContainers
INFO: Loading files from/tmp/org.apache.shindig.config.JsonContainerConfigLoaderTest149296236947587110.json
Dec 16, 2010 2:13:03 AM org.apache.shindig.config.JsonContainerConfigLoader loadFiles
INFO: Reading container config: org.apache.shindig.config.JsonContainerConfigLoaderTest149296236947587110.json.
Dec 16, 2010 2:13:03 AM org.apache.shindig.config.JsonContainerConfigLoader loadContainers
INFO: Loading files from/tmp/org.apache.shindig.config.JsonContainerConfigLoaderTest1700436369602988840.json
Dec 16, 2010 2:13:03 AM org.apache.shindig.config.JsonContainerConfigLoader loadFiles
INFO: Reading container config: org.apache.shindig.config.JsonContainerConfigLoaderTest1700436369602988840.json.
Dec 16, 2010 2:13:03 AM org.apache.shindig.config.JsonContainerConfigLoader loadContainers
INFO: Loading files from/tmp/org.apache.shindig.config.JsonContainerConfigLoaderTest5970625308769793206.json
Dec 16, 2010 2:13:03 AM org.apache.shindig.config.JsonContainerConfigLoader loadFiles
INFO: Reading container config: org.apache.shindig.config.JsonContainerConfigLoaderTest5970625308769793206.json.
Dec 16, 2010 2:13:03 AM org.apache.shindig.config.JsonContainerConfigLoader loadContainers
INFO: Loading files from/tmp/org.apache.shindig.config.JsonContainerConfigLoaderTest4987646323410298468.json
Dec 16, 2010 2:13:03 AM org.apache.shindig.config.JsonContainerConfigLoader loadFiles
INFO: Reading container config: org.apache.shindig.config.JsonContainerConfigLoaderTest4987646323410298468.json.
Dec 16, 2010 2:13:03 AM org.apache.shindig.config.JsonContainerConfigLoader loadContainers
INFO: Loading files from/tmp/org.apache.shindig.config.JsonContainerConfigLoaderTest4941875460487132965.json
Dec 16, 2010 2:13:03 AM org.apache.shindig.config.JsonContainerConfigLoader loadFiles
INFO: Reading container config: org.apache.shindig.config.JsonContainerConfigLoaderTest4941875460487132965.json.
Dec 16, 2010 2:13:03 AM org.apache.shindig.config.JsonContainerConfigLoader loadContainers
INFO: Loading files from/tmp/org.apache.shindig.config.JsonContainerConfigLoaderTest3811725133897068080.json
Dec 16, 2010 2:13:03 AM org.apache.shindig.config.JsonContainerConfigLoader loadFiles
INFO: Reading container config: org.apache.shindig.config.JsonContainerConfigLoaderTest3811725133897068080.json.
Dec 16, 2010 2:13:03 AM org.apache.shindig.config.JsonContainerConfigLoader loadContainers
INFO: Loading files from/tmp/org.apache.shindig.config.JsonContainerConfigLoaderTest1851045633734066118.json
Dec 16, 2010 2:13:03 AM org.apache.shindig.config.JsonContainerConfigLoader loadFiles
INFO: Reading container config: org.apache.shindig.config.JsonContainerConfigLoaderTest1851045633734066118.json.
Dec 16, 2010 2:13:03 AM org.apache.shindig.config.JsonContainerConfigLoader loadContainers
INFO: Loading files from/tmp/org.apache.shindig.config.JsonContainerConfigLoaderTest3427122701692792544.json
Dec 16, 2010 2:13:03 AM org.apache.shindig.config.JsonContainerConfigLoader loadFiles
INFO: Reading container config: org.apache.shindig.config.JsonContainerConfigLoaderTest3427122701692792544.json.
Dec 16, 2010 2:13:03 AM org.apache.shindig.config.JsonContainerConfigLoader loadContainers
INFO: Loading files from/tmp/org.apache.shindig.config.JsonContainerConfigLoaderTest70719760559875274.json
Dec 16, 2010 2:13:03 AM org.apache.shindig.config.JsonContainerConfigLoader loadFiles
INFO: Reading container config: org.apache.shindig.config.JsonContainerConfigLoaderTest70719760559875274.json.
Dec 16, 2010 2:13:03 AM org.apache.shindig.config.JsonContainerConfigLoader loadContainers
INFO: Loading files from/tmp/org.apache.shindig.config.JsonContainerConfigLoaderTest6623517744377260428.json
Dec 16, 2010 2:13:03 AM org.apache.shindig.config.JsonContainerConfigLoader loadFiles
INFO: Reading container config: org.apache.shindig.config.JsonContainerConfigLoaderTest6623517744377260428.json.
Dec 16, 2010 2:13:03 AM org.apache.shindig.config.JsonContainerConfigLoader loadContainers
INFO: Loading files from/tmp/org.apache.shindig.config.JsonContainerConfigLoaderTest8369192503529973058.json
Dec 16, 2010 2:13:03 AM org.apache.shindig.config.JsonContainerConfigLoader loadFiles
INFO: Reading container config: org.apache.shindig.config.JsonContainerConfigLoaderTest8369192503529973058.json.
Dec 16, 2010 2:13:03 AM org.apache.shindig.config.JsonContainerConfigLoader loadContainers
INFO: Loading files from/tmp/org.apache.shindig.config.JsonContainerConfigLoaderTest4351670558762498553.json
Dec 16, 2010 2:13:03 AM org.apache.shindig.config.JsonContainerConfigLoader loadFiles
INFO: Reading container config: org.apache.shindig.config.JsonContainerConfigLoaderTest4351670558762498553.json.
Dec 16, 2010 2:13:03 AM org.apache.shindig.config.JsonContainerConfigLoader loadContainers
INFO: Loading files from/tmp/org.apache.shindig.config.JsonContainerConfigLoaderTest5846659299597985374.json
Dec 16, 2010 2:13:03 AM org.apache.shindig.config.JsonContainerConfigLoader loadFiles
INFO: Reading container config: org.apache.shindig.config.JsonContainerConfigLoaderTest5846659299597985374.json.
Tests run: 12, Failures: 0, Errors: 0, Skipped: 0, Time elapsed: 0.024 sec
Running org.apache.shindig.protocol.conversion.BeanJsonConverterTest
Tests run: 7, Failures: 0, Errors: 0, Skipped: 0, Time elapsed: 0.024 sec
Running org.apache.shindig.protocol.ContentTypesTest
Tests run: 8, Failures: 0, Errors: 0, Skipped: 0, Time elapsed: 0.006 sec
Running org.apache.shindig.auth.UrlParameterAuthenticationHandlerTest
Tests run: 6, Failures: 0, Errors: 0, Skipped: 0, Time elapsed: 0.011 sec
Running org.apache.shindig.protocol.conversion.BeanFilterTest
Tests run: 8, Failures: 0, Errors: 0, Skipped: 0, Time elapsed: 0.014 sec
Running org.apache.shindig.common.util.ImmediateFutureTest
Tests run: 6, Failures: 0, Errors: 0, Skipped: 0, Time elapsed: 0.006 sec
Running org.apache.shindig.common.uri.UriTest
Tests run: 24, Failures: 0, Errors: 0, Skipped: 0, Time elapsed: 0.018 sec
Running org.apache.shindig.common.cache.ehcache.EhCacheCacheProviderTest
Tests run: 1, Failures: 0, Errors: 0, Skipped: 0, Time elapsed: 0.196 sec
Running org.apache.shindig.common.PairTest
Tests run: 1, Failures: 0, Errors: 0, Skipped: 0, Time elapsed: 0.002 sec
Running org.apache.shindig.common.util.DateUtilTest
Tests run: 11, Failures: 0, Errors: 0, Skipped: 0, Time elapsed: 0.02 sec
Running org.apache.shindig.auth.AuthInfoUtilTest
Tests run: 2, Failures: 0, Errors: 0, Skipped: 0, Time elapsed: 0.003 sec
Running org.apache.shindig.common.cache.LruCacheTest
Tests run: 2, Failures: 0, Errors: 0, Skipped: 0, Time elapsed: 0.003 sec

Results :

Tests run: 404, Failures: 0, Errors: 0, Skipped: 3

[TASKS] Skipping maven reporter: there is already a result available.
[HUDSON] Recording test results
[INFO] [jar:jar {execution: default-jar}]
[INFO] Building jar: <https://hudson.apache.org/hudson/job/Shindig/ws/trunk/java/common/target/shindig-common-3.0.0-SNAPSHOT.jar>
[TASKS] Skipping maven reporter: there is already a result available.
[INFO] Preparing source:jar
[WARNING] Removing: jar from forked lifecycle, to prevent recursive invocation.
[HUDSON] Archiving <https://hudson.apache.org/hudson/job/Shindig/ws/trunk/java/common/pom.xml> to /home/hudson/hudson/jobs/Shindig/modules/org.apache.shindig$shindig-common/builds/2010-12-16_02-11-04/archive/org.apache.shindig/shindig-common/3.0.0-SNAPSHOT/pom.xml
[HUDSON] Archiving <https://hudson.apache.org/hudson/job/Shindig/ws/trunk/java/common/target/shindig-common-3.0.0-SNAPSHOT.jar> to /home/hudson/hudson/jobs/Shindig/modules/org.apache.shindig$shindig-common/builds/2010-12-16_02-11-04/archive/org.apache.shindig/shindig-common/3.0.0-SNAPSHOT/shindig-common-3.0.0-SNAPSHOT.jar
[INFO] [enforcer:enforce {execution: enforce-java}]
[TASKS] Skipping maven reporter: there is already a result available.
[INFO] [source:jar {execution: attach-sources}]
[INFO] org already added, skipping
[INFO] org/apache already added, skipping
[INFO] org/apache/shindig already added, skipping
[INFO] org/apache/shindig/common already added, skipping
[INFO] org/apache/shindig/common/cache already added, skipping
[INFO] org/apache/shindig/common/cache/ehcache already added, skipping
[INFO] org/apache/shindig/common/logging already added, skipping
[INFO] org/apache/shindig/common/logging/i18n already added, skipping
[INFO] META-INF already added, skipping
[INFO] META-INF/LICENSE already added, skipping
[INFO] META-INF/DEPENDENCIES already added, skipping
[INFO] META-INF/NOTICE already added, skipping
[INFO] Building jar: <https://hudson.apache.org/hudson/job/Shindig/ws/trunk/java/common/target/shindig-common-3.0.0-SNAPSHOT-sources.jar>
[INFO] org already added, skipping
[INFO] org/apache already added, skipping
[INFO] org/apache/shindig already added, skipping
[INFO] org/apache/shindig/common already added, skipping
[INFO] org/apache/shindig/common/cache already added, skipping
[INFO] org/apache/shindig/common/cache/ehcache already added, skipping
[INFO] org/apache/shindig/common/logging already added, skipping
[INFO] org/apache/shindig/common/logging/i18n already added, skipping
[INFO] META-INF already added, skipping
[INFO] META-INF/LICENSE already added, skipping
[INFO] META-INF/DEPENDENCIES already added, skipping
[INFO] META-INF/NOTICE already added, skipping
[TASKS] Skipping maven reporter: there is already a result available.
[INFO] Preparing source:test-jar
[WARNING] Removing: jar from forked lifecycle, to prevent recursive invocation.
[WARNING] Removing: test-jar from forked lifecycle, to prevent recursive invocation.
[HUDSON] Archiving <https://hudson.apache.org/hudson/job/Shindig/ws/trunk/java/common/target/shindig-common-3.0.0-SNAPSHOT-sources.jar> to /home/hudson/hudson/jobs/Shindig/modules/org.apache.shindig$shindig-common/builds/2010-12-16_02-11-04/archive/org.apache.shindig/shindig-common/3.0.0-SNAPSHOT/shindig-common-3.0.0-SNAPSHOT-sources.jar
[INFO] [enforcer:enforce {execution: enforce-java}]
[TASKS] Skipping maven reporter: there is already a result available.
[INFO] [source:test-jar {execution: attach-sources}]
[INFO] META-INF already added, skipping
[INFO] META-INF/LICENSE already added, skipping
[INFO] META-INF/DEPENDENCIES already added, skipping
[INFO] META-INF/NOTICE already added, skipping
[INFO] Building jar: <https://hudson.apache.org/hudson/job/Shindig/ws/trunk/java/common/target/shindig-common-3.0.0-SNAPSHOT-test-sources.jar>
[INFO] META-INF already added, skipping
[INFO] META-INF/LICENSE already added, skipping
[INFO] META-INF/DEPENDENCIES already added, skipping
[INFO] META-INF/NOTICE already added, skipping
[TASKS] Skipping maven reporter: there is already a result available.
[INFO] [jar:test-jar {execution: default}]
[INFO] Building jar: <https://hudson.apache.org/hudson/job/Shindig/ws/trunk/java/common/target/shindig-common-3.0.0-SNAPSHOT-tests.jar>
[TASKS] Skipping maven reporter: there is already a result available.[INFO] [tools:verify-legal-files {execution: verify-legal-files}]
[INFO] Checking legal files in: shindig-common-3.0.0-SNAPSHOT.jar
[INFO] Checking legal files in: shindig-common-3.0.0-SNAPSHOT-sources.jar
[INFO] Checking legal files in: shindig-common-3.0.0-SNAPSHOT-test-sources.jar
[INFO] Checking legal files in: shindig-common-3.0.0-SNAPSHOT-tests.jar

[TASKS] Skipping maven reporter: there is already a result available.[INFO] [install:install {execution: default-install}]
[INFO] Installing <https://hudson.apache.org/hudson/job/Shindig/ws/trunk/java/common/target/shindig-common-3.0.0-SNAPSHOT.jar> to /home/hudson/.m2/repository/org/apache/shindig/shindig-common/3.0.0-SNAPSHOT/shindig-common-3.0.0-SNAPSHOT.jar
[INFO] Installing <https://hudson.apache.org/hudson/job/Shindig/ws/trunk/java/common/target/shindig-common-3.0.0-SNAPSHOT-sources.jar> to /home/hudson/.m2/repository/org/apache/shindig/shindig-common/3.0.0-SNAPSHOT/shindig-common-3.0.0-SNAPSHOT-sources.jar
[INFO] Installing <https://hudson.apache.org/hudson/job/Shindig/ws/trunk/java/common/target/shindig-common-3.0.0-SNAPSHOT-test-sources.jar> to /home/hudson/.m2/repository/org/apache/shindig/shindig-common/3.0.0-SNAPSHOT/shindig-common-3.0.0-SNAPSHOT-test-sources.jar
[INFO] Installing <https://hudson.apache.org/hudson/job/Shindig/ws/trunk/java/common/target/shindig-common-3.0.0-SNAPSHOT-tests.jar> to /home/hudson/.m2/repository/org/apache/shindig/shindig-common/3.0.0-SNAPSHOT/shindig-common-3.0.0-SNAPSHOT-tests.jar

[TASKS] Skipping maven reporter: there is already a result available.
[HUDSON] Archiving <https://hudson.apache.org/hudson/job/Shindig/ws/trunk/java/common/target/shindig-common-3.0.0-SNAPSHOT-test-sources.jar> to /home/hudson/hudson/jobs/Shindig/modules/org.apache.shindig$shindig-common/builds/2010-12-16_02-11-04/archive/org.apache.shindig/shindig-common/3.0.0-SNAPSHOT/shindig-common-3.0.0-SNAPSHOT-test-sources.jar
[HUDSON] Archiving <https://hudson.apache.org/hudson/job/Shindig/ws/trunk/java/common/target/shindig-common-3.0.0-SNAPSHOT-tests.jar> to /home/hudson/hudson/jobs/Shindig/modules/org.apache.shindig$shindig-common/builds/2010-12-16_02-11-04/archive/org.apache.shindig/shindig-common/3.0.0-SNAPSHOT/shindig-common-3.0.0-SNAPSHOT-tests.jar
[INFO] ------------------------------------------------------------------------
[INFO] Building Apache Shindig Gadget Renderer
[INFO]    task-segment: [clean, install]
[INFO] ------------------------------------------------------------------------
[INFO] [clean:clean {execution: default-clean}]
[INFO] Deleting <https://hudson.apache.org/hudson/job/Shindig/ws/trunk/java/gadgets/target>
[TASKS] Scanning folder '<https://hudson.apache.org/hudson/job/Shindig/ws/trunk/java/gadgets/src/main/java'> for tasks ... 
[TASKS] Found 0.
[TASKS] Scanning folder '<https://hudson.apache.org/hudson/job/Shindig/ws/trunk/java/gadgets/src/test/java'> for tasks ... 
[TASKS] Found 0.
[TASKS] Scanning folder '<https://hudson.apache.org/hudson/job/Shindig/ws/trunk/java/gadgets/../../config'> for tasks ... 
[TASKS] Found 0.
[TASKS] Scanning folder '<https://hudson.apache.org/hudson/job/Shindig/ws/trunk/java/gadgets/src/main/resources'> for tasks ... 
[TASKS] Found 0.
[TASKS] Scanning folder '<https://hudson.apache.org/hudson/job/Shindig/ws/trunk/java/gadgets/../../content'> for tasks ... 
[TASKS] Found 0.
[TASKS] Scanning folder '<https://hudson.apache.org/hudson/job/Shindig/ws/trunk/java/gadgets/src/test/resources'> for tasks ... 
[TASKS] Found 0.
[WARNING] While downloading xml-apis:xml-apis:2.0.2
  This artifact has been relocated to xml-apis:xml-apis:1.0.b2.


[INFO] [enforcer:enforce {execution: enforce-java}]
[TASKS] Skipping maven reporter: there is already a result available.
[INFO] [remote-resources:process {execution: default}]
[TASKS] Skipping maven reporter: there is already a result available.[INFO] [resources:resources {execution: default-resources}]
[INFO] Using 'UTF-8' encoding to copy filtered resources.
[INFO] Copying 2 resources to config
[INFO] Copying 0 resource
[INFO] Copying 2 resources to files
[INFO] Copying 3 resources

[TASKS] Skipping maven reporter: there is already a result available.[INFO] [compiler:compile {execution: default-compile}]

[INFO] Compiling 260 source files to <https://hudson.apache.org/hudson/job/Shindig/ws/trunk/java/gadgets/target/classes>
[INFO] -------------------------------------------------------------
[WARNING] COMPILATION WARNING : 
[INFO] -------------------------------------------------------------
[WARNING] <https://hudson.apache.org/hudson/job/Shindig/ws/trunk/java/gadgets/src/main/java/org/apache/shindig/gadgets/parse/caja/VanillaCajaHtmlSerializer.java>:[41,21] [deprecation] render(org.w3c.dom.Node,boolean) in com.google.caja.parser.html.Nodes has been deprecated
[WARNING] <https://hudson.apache.org/hudson/job/Shindig/ws/trunk/java/gadgets/src/main/java/org/apache/shindig/gadgets/parse/caja/CajaHtmlSerializer.java>:[39,16] [deprecation] render(org.w3c.dom.Node,boolean) in com.google.caja.parser.html.Nodes has been deprecated
[INFO] 2 warnings 
[INFO] -------------------------------------------------------------
[INFO] -------------------------------------------------------------
[ERROR] COMPILATION ERROR : 
[INFO] -------------------------------------------------------------
[ERROR] <https://hudson.apache.org/hudson/job/Shindig/ws/trunk/java/gadgets/src/main/java/org/apache/shindig/gadgets/rewrite/image/JpegImageUtils.java>:[171,35] cannot find symbol
symbol  : method copyOf(int[],int)
location: class java.util.Arrays
[INFO] 1 error
[INFO] -------------------------------------------------------------
[TASKS] Skipping maven reporter: there is already a result available.
[HUDSON] Archiving <https://hudson.apache.org/hudson/job/Shindig/ws/trunk/java/gadgets/pom.xml> to /home/hudson/hudson/jobs/Shindig/modules/org.apache.shindig$shindig-gadgets/builds/2010-12-16_02-11-04/archive/org.apache.shindig/shindig-gadgets/3.0.0-SNAPSHOT/pom.xml
[INFO] ------------------------------------------------------------------------
[ERROR] BUILD FAILURE
[INFO] ------------------------------------------------------------------------
[INFO] Compilation failure
<https://hudson.apache.org/hudson/job/Shindig/ws/trunk/java/gadgets/src/main/java/org/apache/shindig/gadgets/rewrite/image/JpegImageUtils.java>:[171,35] cannot find symbol
symbol  : method copyOf(int[],int)
location: class java.util.Arrays

[INFO] ------------------------------------------------------------------------
[INFO] For more information, run Maven with the -e switch
[INFO] ------------------------------------------------------------------------
[INFO] Total time: 2 minutes 21 seconds
[INFO] Finished at: Thu Dec 16 02:13:38 UTC 2010
[INFO] Final Memory: 58M/263M
[INFO] ------------------------------------------------------------------------
Sending e-mails to: dev@shindig.apache.org
channel stopped
[WARNINGS] Skipping publisher since build result is FAILURE