You are viewing a plain text version of this content. The canonical link for it is here.
Posted to dev@lucene.apache.org by Policeman Jenkins Server <je...@thetaphi.de> on 2017/07/14 08:04:01 UTC
[JENKINS-EA] Lucene-Solr-7.x-Windows (64bit/jdk-9-ea+173) - Build #
39 - Still Unstable!
Build: https://jenkins.thetaphi.de/job/Lucene-Solr-7.x-Windows/39/
Java: 64bit/jdk-9-ea+173 -XX:+UseCompressedOops -XX:+UseG1GC
1 tests failed.
FAILED: org.apache.solr.TestDistributedSearch.test
Error Message:
Expected to find shardAddress in the up shard info: {error=org.apache.solr.client.solrj.SolrServerException: Time allowed to handle this request exceeded,trace=org.apache.solr.client.solrj.SolrServerException: Time allowed to handle this request exceeded at org.apache.solr.client.solrj.impl.LBHttpSolrClient.request(LBHttpSolrClient.java:460) at org.apache.solr.handler.component.HttpShardHandlerFactory.makeLoadBalancedRequest(HttpShardHandlerFactory.java:273) at org.apache.solr.handler.component.HttpShardHandler.lambda$submit$0(HttpShardHandler.java:175) at java.base/java.util.concurrent.FutureTask.run(FutureTask.java:264) at java.base/java.util.concurrent.Executors$RunnableAdapter.call(Executors.java:514) at java.base/java.util.concurrent.FutureTask.run(FutureTask.java:264) at com.codahale.metrics.InstrumentedExecutorService$InstrumentedRunnable.run(InstrumentedExecutorService.java:176) at org.apache.solr.common.util.ExecutorUtil$MDCAwareThreadPoolExecutor.lambda$execute$0(ExecutorUtil.java:188) at java.base/java.util.concurrent.ThreadPoolExecutor.runWorker(ThreadPoolExecutor.java:1161) at java.base/java.util.concurrent.ThreadPoolExecutor$Worker.run(ThreadPoolExecutor.java:635) at java.base/java.lang.Thread.run(Thread.java:844) ,time=2}
Stack Trace:
java.lang.AssertionError: Expected to find shardAddress in the up shard info: {error=org.apache.solr.client.solrj.SolrServerException: Time allowed to handle this request exceeded,trace=org.apache.solr.client.solrj.SolrServerException: Time allowed to handle this request exceeded
at org.apache.solr.client.solrj.impl.LBHttpSolrClient.request(LBHttpSolrClient.java:460)
at org.apache.solr.handler.component.HttpShardHandlerFactory.makeLoadBalancedRequest(HttpShardHandlerFactory.java:273)
at org.apache.solr.handler.component.HttpShardHandler.lambda$submit$0(HttpShardHandler.java:175)
at java.base/java.util.concurrent.FutureTask.run(FutureTask.java:264)
at java.base/java.util.concurrent.Executors$RunnableAdapter.call(Executors.java:514)
at java.base/java.util.concurrent.FutureTask.run(FutureTask.java:264)
at com.codahale.metrics.InstrumentedExecutorService$InstrumentedRunnable.run(InstrumentedExecutorService.java:176)
at org.apache.solr.common.util.ExecutorUtil$MDCAwareThreadPoolExecutor.lambda$execute$0(ExecutorUtil.java:188)
at java.base/java.util.concurrent.ThreadPoolExecutor.runWorker(ThreadPoolExecutor.java:1161)
at java.base/java.util.concurrent.ThreadPoolExecutor$Worker.run(ThreadPoolExecutor.java:635)
at java.base/java.lang.Thread.run(Thread.java:844)
,time=2}
at __randomizedtesting.SeedInfo.seed([79D9B9D16F81043A:F18D860BC17D69C2]:0)
at org.junit.Assert.fail(Assert.java:93)
at org.junit.Assert.assertTrue(Assert.java:43)
at org.apache.solr.TestDistributedSearch.comparePartialResponses(TestDistributedSearch.java:1191)
at org.apache.solr.TestDistributedSearch.queryPartialResults(TestDistributedSearch.java:1132)
at org.apache.solr.TestDistributedSearch.test(TestDistributedSearch.java:992)
at java.base/jdk.internal.reflect.NativeMethodAccessorImpl.invoke0(Native Method)
at java.base/jdk.internal.reflect.NativeMethodAccessorImpl.invoke(NativeMethodAccessorImpl.java:62)
at java.base/jdk.internal.reflect.DelegatingMethodAccessorImpl.invoke(DelegatingMethodAccessorImpl.java:43)
at java.base/java.lang.reflect.Method.invoke(Method.java:564)
at com.carrotsearch.randomizedtesting.RandomizedRunner.invoke(RandomizedRunner.java:1713)
at com.carrotsearch.randomizedtesting.RandomizedRunner$8.evaluate(RandomizedRunner.java:907)
at com.carrotsearch.randomizedtesting.RandomizedRunner$9.evaluate(RandomizedRunner.java:943)
at com.carrotsearch.randomizedtesting.RandomizedRunner$10.evaluate(RandomizedRunner.java:957)
at org.apache.solr.BaseDistributedSearchTestCase$ShardsRepeatRule$ShardsRepeatStatement.callStatement(BaseDistributedSearchTestCase.java:1011)
at org.apache.solr.BaseDistributedSearchTestCase$ShardsRepeatRule$ShardsStatement.evaluate(BaseDistributedSearchTestCase.java:960)
at com.carrotsearch.randomizedtesting.rules.SystemPropertiesRestoreRule$1.evaluate(SystemPropertiesRestoreRule.java:57)
at org.apache.lucene.util.TestRuleSetupTeardownChained$1.evaluate(TestRuleSetupTeardownChained.java:49)
at org.apache.lucene.util.AbstractBeforeAfterRule$1.evaluate(AbstractBeforeAfterRule.java:45)
at org.apache.lucene.util.TestRuleThreadAndTestName$1.evaluate(TestRuleThreadAndTestName.java:48)
at org.apache.lucene.util.TestRuleIgnoreAfterMaxFailures$1.evaluate(TestRuleIgnoreAfterMaxFailures.java:64)
at org.apache.lucene.util.TestRuleMarkFailure$1.evaluate(TestRuleMarkFailure.java:47)
at com.carrotsearch.randomizedtesting.rules.StatementAdapter.evaluate(StatementAdapter.java:36)
at com.carrotsearch.randomizedtesting.ThreadLeakControl$StatementRunner.run(ThreadLeakControl.java:368)
at com.carrotsearch.randomizedtesting.ThreadLeakControl.forkTimeoutingTask(ThreadLeakControl.java:817)
at com.carrotsearch.randomizedtesting.ThreadLeakControl$3.evaluate(ThreadLeakControl.java:468)
at com.carrotsearch.randomizedtesting.RandomizedRunner.runSingleTest(RandomizedRunner.java:916)
at com.carrotsearch.randomizedtesting.RandomizedRunner$5.evaluate(RandomizedRunner.java:802)
at com.carrotsearch.randomizedtesting.RandomizedRunner$6.evaluate(RandomizedRunner.java:852)
at com.carrotsearch.randomizedtesting.RandomizedRunner$7.evaluate(RandomizedRunner.java:863)
at com.carrotsearch.randomizedtesting.rules.StatementAdapter.evaluate(StatementAdapter.java:36)
at com.carrotsearch.randomizedtesting.rules.SystemPropertiesRestoreRule$1.evaluate(SystemPropertiesRestoreRule.java:57)
at org.apache.lucene.util.AbstractBeforeAfterRule$1.evaluate(AbstractBeforeAfterRule.java:45)
at com.carrotsearch.randomizedtesting.rules.StatementAdapter.evaluate(StatementAdapter.java:36)
at org.apache.lucene.util.TestRuleStoreClassName$1.evaluate(TestRuleStoreClassName.java:41)
at com.carrotsearch.randomizedtesting.rules.NoShadowingOrOverridesOnMethodsRule$1.evaluate(NoShadowingOrOverridesOnMethodsRule.java:40)
at com.carrotsearch.randomizedtesting.rules.NoShadowingOrOverridesOnMethodsRule$1.evaluate(NoShadowingOrOverridesOnMethodsRule.java:40)
at com.carrotsearch.randomizedtesting.rules.StatementAdapter.evaluate(StatementAdapter.java:36)
at com.carrotsearch.randomizedtesting.rules.StatementAdapter.evaluate(StatementAdapter.java:36)
at org.apache.lucene.util.TestRuleAssertionsRequired$1.evaluate(TestRuleAssertionsRequired.java:53)
at org.apache.lucene.util.TestRuleMarkFailure$1.evaluate(TestRuleMarkFailure.java:47)
at org.apache.lucene.util.TestRuleIgnoreAfterMaxFailures$1.evaluate(TestRuleIgnoreAfterMaxFailures.java:64)
at org.apache.lucene.util.TestRuleIgnoreTestSuites$1.evaluate(TestRuleIgnoreTestSuites.java:54)
at com.carrotsearch.randomizedtesting.rules.StatementAdapter.evaluate(StatementAdapter.java:36)
at com.carrotsearch.randomizedtesting.ThreadLeakControl$StatementRunner.run(ThreadLeakControl.java:368)
at java.base/java.lang.Thread.run(Thread.java:844)
Build Log:
[...truncated 11710 lines...]
[junit4] Suite: org.apache.solr.TestDistributedSearch
[junit4] 2> Creating dataDir: C:\Users\jenkins\workspace\Lucene-Solr-7.x-Windows\solr\build\solr-core\test\J0\temp\solr.TestDistributedSearch_79D9B9D16F81043A-001\init-core-data-001
[junit4] 2> 912414 WARN (SUITE-TestDistributedSearch-seed#[79D9B9D16F81043A]-worker) [ ] o.a.s.SolrTestCaseJ4 startTrackingSearchers: numOpens=7 numCloses=7
[junit4] 2> 912414 INFO (SUITE-TestDistributedSearch-seed#[79D9B9D16F81043A]-worker) [ ] o.a.s.SolrTestCaseJ4 Using PointFields (NUMERIC_POINTS_SYSPROP=true) w/NUMERIC_DOCVALUES_SYSPROP=true
[junit4] 2> 912416 INFO (SUITE-TestDistributedSearch-seed#[79D9B9D16F81043A]-worker) [ ] o.a.s.SolrTestCaseJ4 Randomized ssl (false) and clientAuth (false) via: @org.apache.solr.SolrTestCaseJ4$SuppressSSL(bugUrl="https://issues.apache.org/jira/browse/SOLR-9061")
[junit4] 2> 912416 INFO (SUITE-TestDistributedSearch-seed#[79D9B9D16F81043A]-worker) [ ] o.a.s.BaseDistributedSearchTestCase Setting hostContext system property: /
[junit4] 2> 912763 INFO (TEST-TestDistributedSearch.test-seed#[79D9B9D16F81043A]) [ ] o.a.s.SolrTestCaseJ4 Writing core.properties file to C:\Users\jenkins\workspace\Lucene-Solr-7.x-Windows\solr\build\solr-core\test\J0\temp\solr.TestDistributedSearch_79D9B9D16F81043A-001\tempDir-001\control\cores\collection1
[junit4] 2> 912764 INFO (TEST-TestDistributedSearch.test-seed#[79D9B9D16F81043A]) [ ] o.e.j.s.Server jetty-9.3.14.v20161028
[junit4] 2> 912765 INFO (TEST-TestDistributedSearch.test-seed#[79D9B9D16F81043A]) [ ] o.e.j.s.h.ContextHandler Started o.e.j.s.ServletContextHandler@69c0909b{/,null,AVAILABLE}
[junit4] 2> 912767 INFO (TEST-TestDistributedSearch.test-seed#[79D9B9D16F81043A]) [ ] o.e.j.s.AbstractConnector Started ServerConnector@22836378{HTTP/1.1,[http/1.1]}{127.0.0.1:64544}
[junit4] 2> 912767 INFO (TEST-TestDistributedSearch.test-seed#[79D9B9D16F81043A]) [ ] o.e.j.s.Server Started @914621ms
[junit4] 2> 912767 INFO (TEST-TestDistributedSearch.test-seed#[79D9B9D16F81043A]) [ ] o.a.s.c.s.e.JettySolrRunner Jetty properties: {hostContext=/, hostPort=64544, coreRootDirectory=C:\Users\jenkins\workspace\Lucene-Solr-7.x-Windows\solr\build\solr-core\test\J0\temp\solr.TestDistributedSearch_79D9B9D16F81043A-001\tempDir-001\control\cores}
[junit4] 2> 912768 ERROR (TEST-TestDistributedSearch.test-seed#[79D9B9D16F81043A]) [ ] o.a.s.s.StartupLoggingUtils Missing Java Option solr.log.dir. Logging may be missing or incomplete.
[junit4] 2> 912768 INFO (TEST-TestDistributedSearch.test-seed#[79D9B9D16F81043A]) [ ] o.a.s.s.SolrDispatchFilter ___ _ Welcome to Apache Solr? version 7.1.0
[junit4] 2> 912768 INFO (TEST-TestDistributedSearch.test-seed#[79D9B9D16F81043A]) [ ] o.a.s.s.SolrDispatchFilter / __| ___| |_ _ Starting in standalone mode on port null
[junit4] 2> 912768 INFO (TEST-TestDistributedSearch.test-seed#[79D9B9D16F81043A]) [ ] o.a.s.s.SolrDispatchFilter \__ \/ _ \ | '_| Install dir: null, Default config dir: null
[junit4] 2> 912768 INFO (TEST-TestDistributedSearch.test-seed#[79D9B9D16F81043A]) [ ] o.a.s.s.SolrDispatchFilter |___/\___/_|_| Start time: 2017-07-14T07:14:18.073033100Z
[junit4] 2> 912768 INFO (TEST-TestDistributedSearch.test-seed#[79D9B9D16F81043A]) [ ] o.a.s.c.SolrXmlConfig Loading container configuration from C:\Users\jenkins\workspace\Lucene-Solr-7.x-Windows\solr\build\solr-core\test\J0\temp\solr.TestDistributedSearch_79D9B9D16F81043A-001\tempDir-001\control\solr.xml
[junit4] 2> 912771 INFO (TEST-TestDistributedSearch.test-seed#[79D9B9D16F81043A]) [ ] o.a.s.c.SolrXmlConfig MBean server found: com.sun.jmx.mbeanserver.JmxMBeanServer@3722b3fc, but no JMX reporters were configured - adding default JMX reporter.
[junit4] 2> 912805 INFO (TEST-TestDistributedSearch.test-seed#[79D9B9D16F81043A]) [ ] o.a.s.m.r.SolrJmxReporter JMX monitoring for 'solr.node' (registry 'solr.node') enabled at server: com.sun.jmx.mbeanserver.JmxMBeanServer@3722b3fc
[junit4] 2> 912808 INFO (TEST-TestDistributedSearch.test-seed#[79D9B9D16F81043A]) [ ] o.a.s.m.r.SolrJmxReporter JMX monitoring for 'solr.jvm' (registry 'solr.jvm') enabled at server: com.sun.jmx.mbeanserver.JmxMBeanServer@3722b3fc
[junit4] 2> 912808 INFO (TEST-TestDistributedSearch.test-seed#[79D9B9D16F81043A]) [ ] o.a.s.m.r.SolrJmxReporter JMX monitoring for 'solr.jetty' (registry 'solr.jetty') enabled at server: com.sun.jmx.mbeanserver.JmxMBeanServer@3722b3fc
[junit4] 2> 912808 INFO (TEST-TestDistributedSearch.test-seed#[79D9B9D16F81043A]) [ ] o.a.s.c.CorePropertiesLocator Found 1 core definitions underneath C:\Users\jenkins\workspace\Lucene-Solr-7.x-Windows\solr\build\solr-core\test\J0\temp\solr.TestDistributedSearch_79D9B9D16F81043A-001\tempDir-001\control\cores
[junit4] 2> 912808 INFO (TEST-TestDistributedSearch.test-seed#[79D9B9D16F81043A]) [ ] o.a.s.c.CorePropertiesLocator Cores are: [collection1]
[junit4] 2> 912812 INFO (coreLoadExecutor-3841-thread-1) [ ] o.a.s.c.SolrResourceLoader [null] Added 2 libs to classloader, from paths: [/C:/Users/jenkins/workspace/Lucene-Solr-7.x-Windows/solr/core/src/test-files/solr/collection1/lib, /C:/Users/jenkins/workspace/Lucene-Solr-7.x-Windows/solr/core/src/test-files/solr/collection1/lib/classes]
[junit4] 2> 912848 INFO (coreLoadExecutor-3841-thread-1) [ ] o.a.s.c.SolrConfig Using Lucene MatchVersion: 7.1.0
[junit4] 2> 912863 INFO (coreLoadExecutor-3841-thread-1) [ ] o.a.s.s.IndexSchema [collection1] Schema name=test
[junit4] 2> 912954 INFO (coreLoadExecutor-3841-thread-1) [ ] o.a.s.s.IndexSchema Loaded schema test/1.0 with uniqueid field id
[junit4] 2> 912965 INFO (coreLoadExecutor-3841-thread-1) [ ] o.a.s.c.CoreContainer Creating SolrCore 'collection1' using configuration from configset C:\Users\jenkins\workspace\Lucene-Solr-7.x-Windows\solr\core\src\test-files\solr\collection1, trusted=true
[junit4] 2> 912965 INFO (coreLoadExecutor-3841-thread-1) [ ] o.a.s.m.r.SolrJmxReporter JMX monitoring for 'solr.core.collection1' (registry 'solr.core.collection1') enabled at server: com.sun.jmx.mbeanserver.JmxMBeanServer@3722b3fc
[junit4] 2> 912965 INFO (coreLoadExecutor-3841-thread-1) [ ] o.a.s.c.SolrCore solr.RecoveryStrategy.Builder
[junit4] 2> 912965 INFO (coreLoadExecutor-3841-thread-1) [ ] o.a.s.c.SolrCore [[collection1] ] Opening new SolrCore at [C:\Users\jenkins\workspace\Lucene-Solr-7.x-Windows\solr\core\src\test-files\solr\collection1], dataDir=[C:\Users\jenkins\workspace\Lucene-Solr-7.x-Windows\solr\build\solr-core\test\J0\temp\solr.TestDistributedSearch_79D9B9D16F81043A-001\tempDir-001\control\cores\collection1\data\]
[junit4] 2> 912966 INFO (coreLoadExecutor-3841-thread-1) [ ] o.a.s.u.RandomMergePolicy RandomMergePolicy wrapping class org.apache.lucene.index.TieredMergePolicy: [TieredMergePolicy: maxMergeAtOnce=42, maxMergeAtOnceExplicit=46, maxMergedSegmentMB=93.48828125, floorSegmentMB=1.603515625, forceMergeDeletesPctAllowed=12.716133565599566, segmentsPerTier=22.0, maxCFSSegmentSizeMB=8.796093022207999E12, noCFSRatio=1.0
[junit4] 2> 913027 INFO (coreLoadExecutor-3841-thread-1) [ ] o.a.s.u.UpdateHandler Using UpdateLog implementation: org.apache.solr.update.UpdateLog
[junit4] 2> 913027 INFO (coreLoadExecutor-3841-thread-1) [ ] o.a.s.u.UpdateLog Initializing UpdateLog: dataDir= defaultSyncLevel=FLUSH numRecordsToKeep=100 maxNumLogsToKeep=10 numVersionBuckets=65536
[junit4] 2> 913028 INFO (coreLoadExecutor-3841-thread-1) [ ] o.a.s.u.CommitTracker Hard AutoCommit: disabled
[junit4] 2> 913028 INFO (coreLoadExecutor-3841-thread-1) [ ] o.a.s.u.CommitTracker Soft AutoCommit: disabled
[junit4] 2> 913029 INFO (coreLoadExecutor-3841-thread-1) [ ] o.a.s.u.RandomMergePolicy RandomMergePolicy wrapping class org.apache.lucene.index.TieredMergePolicy: [TieredMergePolicy: maxMergeAtOnce=41, maxMergeAtOnceExplicit=39, maxMergedSegmentMB=46.4453125, floorSegmentMB=0.5, forceMergeDeletesPctAllowed=13.66951529348704, segmentsPerTier=20.0, maxCFSSegmentSizeMB=8.796093022207999E12, noCFSRatio=0.6551355324596286
[junit4] 2> 913029 INFO (coreLoadExecutor-3841-thread-1) [ ] o.a.s.s.SolrIndexSearcher Opening [Searcher@6fb2051[collection1] main]
[junit4] 2> 913031 INFO (coreLoadExecutor-3841-thread-1) [ ] o.a.s.h.c.SpellCheckComponent Initializing spell checkers
[junit4] 2> 913039 INFO (coreLoadExecutor-3841-thread-1) [ ] o.a.s.s.DirectSolrSpellChecker init: {name=direct,classname=DirectSolrSpellChecker,field=lowerfilt,minQueryLength=3}
[junit4] 2> 913068 INFO (coreLoadExecutor-3841-thread-1) [ ] o.a.s.h.ReplicationHandler Commits will be reserved for 10000
[junit4] 2> 913068 INFO (searcherExecutor-3842-thread-1) [ ] o.a.s.h.c.SpellCheckComponent Loading spell index for spellchecker: default
[junit4] 2> 913068 INFO (coreLoadExecutor-3841-thread-1) [ ] o.a.s.u.UpdateLog Could not find max version in index or recent updates, using new clock 1572881257854926848
[junit4] 2> 913069 INFO (searcherExecutor-3842-thread-1) [ ] o.a.s.h.c.SpellCheckComponent Loading spell index for spellchecker: direct
[junit4] 2> 913069 INFO (searcherExecutor-3842-thread-1) [ ] o.a.s.h.c.SpellCheckComponent Loading spell index for spellchecker: wordbreak
[junit4] 2> 913069 INFO (searcherExecutor-3842-thread-1) [ ] o.a.s.h.c.SpellCheckComponent Loading spell index for spellchecker: multipleFields
[junit4] 2> 913069 INFO (searcherExecutor-3842-thread-1) [ ] o.a.s.h.c.SpellCheckComponent Loading spell index for spellchecker: jarowinkler
[junit4] 2> 913070 INFO (searcherExecutor-3842-thread-1) [ ] o.a.s.h.c.SpellCheckComponent Loading spell index for spellchecker: external
[junit4] 2> 913070 INFO (searcherExecutor-3842-thread-1) [ ] o.a.s.h.c.SpellCheckComponent Loading spell index for spellchecker: freq
[junit4] 2> 913070 INFO (searcherExecutor-3842-thread-1) [ ] o.a.s.h.c.SpellCheckComponent Loading spell index for spellchecker: fqcn
[junit4] 2> 913072 INFO (searcherExecutor-3842-thread-1) [ ] o.a.s.h.c.SpellCheckComponent Loading spell index for spellchecker: perDict
[junit4] 2> 913072 INFO (searcherExecutor-3842-thread-1) [ ] o.a.s.c.SolrCore [collection1] Registered new searcher Searcher@6fb2051[collection1] main{ExitableDirectoryReader(UninvertingDirectoryReader())}
[junit4] 2> 913831 INFO (TEST-TestDistributedSearch.test-seed#[79D9B9D16F81043A]) [ ] o.a.s.SolrTestCaseJ4 Writing core.properties file to C:\Users\jenkins\workspace\Lucene-Solr-7.x-Windows\solr\build\solr-core\test\J0\temp\solr.TestDistributedSearch_79D9B9D16F81043A-001\tempDir-001\shard0\cores\collection1
[junit4] 2> 913832 INFO (TEST-TestDistributedSearch.test-seed#[79D9B9D16F81043A]) [ ] o.e.j.s.Server jetty-9.3.14.v20161028
[junit4] 2> 913832 INFO (TEST-TestDistributedSearch.test-seed#[79D9B9D16F81043A]) [ ] o.e.j.s.h.ContextHandler Started o.e.j.s.ServletContextHandler@46597e2d{/,null,AVAILABLE}
[junit4] 2> 913834 INFO (TEST-TestDistributedSearch.test-seed#[79D9B9D16F81043A]) [ ] o.e.j.s.AbstractConnector Started ServerConnector@3eecde7c{HTTP/1.1,[http/1.1]}{127.0.0.1:64547}
[junit4] 2> 913834 INFO (TEST-TestDistributedSearch.test-seed#[79D9B9D16F81043A]) [ ] o.e.j.s.Server Started @915689ms
[junit4] 2> 913834 INFO (TEST-TestDistributedSearch.test-seed#[79D9B9D16F81043A]) [ ] o.a.s.c.s.e.JettySolrRunner Jetty properties: {hostContext=/, hostPort=64547, coreRootDirectory=C:\Users\jenkins\workspace\Lucene-Solr-7.x-Windows\solr\build\solr-core\test\J0\temp\solr.TestDistributedSearch_79D9B9D16F81043A-001\tempDir-001\shard0\cores}
[junit4] 2> 913834 ERROR (TEST-TestDistributedSearch.test-seed#[79D9B9D16F81043A]) [ ] o.a.s.s.StartupLoggingUtils Missing Java Option solr.log.dir. Logging may be missing or incomplete.
[junit4] 2> 913834 INFO (TEST-TestDistributedSearch.test-seed#[79D9B9D16F81043A]) [ ] o.a.s.s.SolrDispatchFilter ___ _ Welcome to Apache Solr? version 7.1.0
[junit4] 2> 913834 INFO (TEST-TestDistributedSearch.test-seed#[79D9B9D16F81043A]) [ ] o.a.s.s.SolrDispatchFilter / __| ___| |_ _ Starting in standalone mode on port null
[junit4] 2> 913834 INFO (TEST-TestDistributedSearch.test-seed#[79D9B9D16F81043A]) [ ] o.a.s.s.SolrDispatchFilter \__ \/ _ \ | '_| Install dir: null, Default config dir: null
[junit4] 2> 913834 INFO (TEST-TestDistributedSearch.test-seed#[79D9B9D16F81043A]) [ ] o.a.s.s.SolrDispatchFilter |___/\___/_|_| Start time: 2017-07-14T07:14:19.139292800Z
[junit4] 2> 913835 INFO (TEST-TestDistributedSearch.test-seed#[79D9B9D16F81043A]) [ ] o.a.s.c.SolrXmlConfig Loading container configuration from C:\Users\jenkins\workspace\Lucene-Solr-7.x-Windows\solr\build\solr-core\test\J0\temp\solr.TestDistributedSearch_79D9B9D16F81043A-001\tempDir-001\shard0\solr.xml
[junit4] 2> 913837 INFO (TEST-TestDistributedSearch.test-seed#[79D9B9D16F81043A]) [ ] o.a.s.c.SolrXmlConfig MBean server found: com.sun.jmx.mbeanserver.JmxMBeanServer@3722b3fc, but no JMX reporters were configured - adding default JMX reporter.
[junit4] 2> 913868 INFO (TEST-TestDistributedSearch.test-seed#[79D9B9D16F81043A]) [ ] o.a.s.m.r.SolrJmxReporter JMX monitoring for 'solr.node' (registry 'solr.node') enabled at server: com.sun.jmx.mbeanserver.JmxMBeanServer@3722b3fc
[junit4] 2> 913873 INFO (TEST-TestDistributedSearch.test-seed#[79D9B9D16F81043A]) [ ] o.a.s.m.r.SolrJmxReporter JMX monitoring for 'solr.jvm' (registry 'solr.jvm') enabled at server: com.sun.jmx.mbeanserver.JmxMBeanServer@3722b3fc
[junit4] 2> 913873 INFO (TEST-TestDistributedSearch.test-seed#[79D9B9D16F81043A]) [ ] o.a.s.m.r.SolrJmxReporter JMX monitoring for 'solr.jetty' (registry 'solr.jetty') enabled at server: com.sun.jmx.mbeanserver.JmxMBeanServer@3722b3fc
[junit4] 2> 913874 INFO (TEST-TestDistributedSearch.test-seed#[79D9B9D16F81043A]) [ ] o.a.s.c.CorePropertiesLocator Found 1 core definitions underneath C:\Users\jenkins\workspace\Lucene-Solr-7.x-Windows\solr\build\solr-core\test\J0\temp\solr.TestDistributedSearch_79D9B9D16F81043A-001\tempDir-001\shard0\cores
[junit4] 2> 913874 INFO (TEST-TestDistributedSearch.test-seed#[79D9B9D16F81043A]) [ ] o.a.s.c.CorePropertiesLocator Cores are: [collection1]
[junit4] 2> 913875 INFO (coreLoadExecutor-3852-thread-1) [ ] o.a.s.c.SolrResourceLoader [null] Added 2 libs to classloader, from paths: [/C:/Users/jenkins/workspace/Lucene-Solr-7.x-Windows/solr/core/src/test-files/solr/collection1/lib, /C:/Users/jenkins/workspace/Lucene-Solr-7.x-Windows/solr/core/src/test-files/solr/collection1/lib/classes]
[junit4] 2> 913899 INFO (coreLoadExecutor-3852-thread-1) [ ] o.a.s.c.SolrConfig Using Lucene MatchVersion: 7.1.0
[junit4] 2> 913912 INFO (coreLoadExecutor-3852-thread-1) [ ] o.a.s.s.IndexSchema [collection1] Schema name=test
[junit4] 2> 913960 INFO (coreLoadExecutor-3852-thread-1) [ ] o.a.s.s.IndexSchema Loaded schema test/1.0 with uniqueid field id
[junit4] 2> 913970 INFO (coreLoadExecutor-3852-thread-1) [ ] o.a.s.c.CoreContainer Creating SolrCore 'collection1' using configuration from configset C:\Users\jenkins\workspace\Lucene-Solr-7.x-Windows\solr\core\src\test-files\solr\collection1, trusted=true
[junit4] 2> 913970 INFO (coreLoadExecutor-3852-thread-1) [ ] o.a.s.m.r.SolrJmxReporter JMX monitoring for 'solr.core.collection1' (registry 'solr.core.collection1') enabled at server: com.sun.jmx.mbeanserver.JmxMBeanServer@3722b3fc
[junit4] 2> 913970 INFO (coreLoadExecutor-3852-thread-1) [ ] o.a.s.c.SolrCore solr.RecoveryStrategy.Builder
[junit4] 2> 913970 INFO (coreLoadExecutor-3852-thread-1) [ ] o.a.s.c.SolrCore [[collection1] ] Opening new SolrCore at [C:\Users\jenkins\workspace\Lucene-Solr-7.x-Windows\solr\core\src\test-files\solr\collection1], dataDir=[C:\Users\jenkins\workspace\Lucene-Solr-7.x-Windows\solr\build\solr-core\test\J0\temp\solr.TestDistributedSearch_79D9B9D16F81043A-001\tempDir-001\shard0\cores\collection1\data\]
[junit4] 2> 913972 INFO (coreLoadExecutor-3852-thread-1) [ ] o.a.s.u.RandomMergePolicy RandomMergePolicy wrapping class org.apache.lucene.index.TieredMergePolicy: [TieredMergePolicy: maxMergeAtOnce=42, maxMergeAtOnceExplicit=46, maxMergedSegmentMB=93.48828125, floorSegmentMB=1.603515625, forceMergeDeletesPctAllowed=12.716133565599566, segmentsPerTier=22.0, maxCFSSegmentSizeMB=8.796093022207999E12, noCFSRatio=1.0
[junit4] 2> 914046 INFO (coreLoadExecutor-3852-thread-1) [ ] o.a.s.u.UpdateHandler Using UpdateLog implementation: org.apache.solr.update.UpdateLog
[junit4] 2> 914046 INFO (coreLoadExecutor-3852-thread-1) [ ] o.a.s.u.UpdateLog Initializing UpdateLog: dataDir= defaultSyncLevel=FLUSH numRecordsToKeep=100 maxNumLogsToKeep=10 numVersionBuckets=65536
[junit4] 2> 914048 INFO (coreLoadExecutor-3852-thread-1) [ ] o.a.s.u.CommitTracker Hard AutoCommit: disabled
[junit4] 2> 914048 INFO (coreLoadExecutor-3852-thread-1) [ ] o.a.s.u.CommitTracker Soft AutoCommit: disabled
[junit4] 2> 914049 INFO (coreLoadExecutor-3852-thread-1) [ ] o.a.s.u.RandomMergePolicy RandomMergePolicy wrapping class org.apache.lucene.index.TieredMergePolicy: [TieredMergePolicy: maxMergeAtOnce=41, maxMergeAtOnceExplicit=39, maxMergedSegmentMB=46.4453125, floorSegmentMB=0.5, forceMergeDeletesPctAllowed=13.66951529348704, segmentsPerTier=20.0, maxCFSSegmentSizeMB=8.796093022207999E12, noCFSRatio=0.6551355324596286
[junit4] 2> 914049 INFO (coreLoadExecutor-3852-thread-1) [ ] o.a.s.s.SolrIndexSearcher Opening [Searcher@315bb0c1[collection1] main]
[junit4] 2> 914050 INFO (coreLoadExecutor-3852-thread-1) [ ] o.a.s.h.c.SpellCheckComponent Initializing spell checkers
[junit4] 2> 914058 INFO (coreLoadExecutor-3852-thread-1) [ ] o.a.s.s.DirectSolrSpellChecker init: {name=direct,classname=DirectSolrSpellChecker,field=lowerfilt,minQueryLength=3}
[junit4] 2> 914099 INFO (coreLoadExecutor-3852-thread-1) [ ] o.a.s.h.ReplicationHandler Commits will be reserved for 10000
[junit4] 2> 914099 INFO (searcherExecutor-3853-thread-1) [ ] o.a.s.h.c.SpellCheckComponent Loading spell index for spellchecker: default
[junit4] 2> 914099 INFO (coreLoadExecutor-3852-thread-1) [ ] o.a.s.u.UpdateLog Could not find max version in index or recent updates, using new clock 1572881258936008704
[junit4] 2> 914099 INFO (searcherExecutor-3853-thread-1) [ ] o.a.s.h.c.SpellCheckComponent Loading spell index for spellchecker: direct
[junit4] 2> 914100 INFO (searcherExecutor-3853-thread-1) [ ] o.a.s.h.c.SpellCheckComponent Loading spell index for spellchecker: wordbreak
[junit4] 2> 914100 INFO (searcherExecutor-3853-thread-1) [ ] o.a.s.h.c.SpellCheckComponent Loading spell index for spellchecker: multipleFields
[junit4] 2> 914100 INFO (searcherExecutor-3853-thread-1) [ ] o.a.s.h.c.SpellCheckComponent Loading spell index for spellchecker: jarowinkler
[junit4] 2> 914101 INFO (searcherExecutor-3853-thread-1) [ ] o.a.s.h.c.SpellCheckComponent Loading spell index for spellchecker: external
[junit4] 2> 914101 INFO (searcherExecutor-3853-thread-1) [ ] o.a.s.h.c.SpellCheckComponent Loading spell index for spellchecker: freq
[junit4] 2> 914102 INFO (searcherExecutor-3853-thread-1) [ ] o.a.s.h.c.SpellCheckComponent Loading spell index for spellchecker: fqcn
[junit4] 2> 914103 INFO (searcherExecutor-3853-thread-1) [ ] o.a.s.h.c.SpellCheckComponent Loading spell index for spellchecker: perDict
[junit4] 2> 914104 INFO (searcherExecutor-3853-thread-1) [ ] o.a.s.c.SolrCore [collection1] Registered new searcher Searcher@315bb0c1[collection1] main{ExitableDirectoryReader(UninvertingDirectoryReader())}
[junit4] 2> 914390 INFO (TEST-TestDistributedSearch.test-seed#[79D9B9D16F81043A]) [ ] o.a.s.SolrTestCaseJ4 ###Starting test
[junit4] 2> 914395 INFO (qtp55933908-8320) [ ] o.a.s.u.p.LogUpdateProcessorFactory [collection1] webapp= path=/update params={wt=javabin&version=2}{deleteByQuery=*:* (-1572881259244290048)} 0 2
[junit4] 2> 914399 INFO (qtp659353522-8337) [ ] o.a.s.u.p.LogUpdateProcessorFactory [collection1] webapp= path=/update params={wt=javabin&version=2}{deleteByQuery=*:* (-1572881259248484352)} 0 1
[junit4] 2> 914401 INFO (qtp55933908-8321) [ ] o.a.s.u.p.LogUpdateProcessorFactory [collection1] webapp= path=/update params={wt=javabin&version=2}{add=[1 (1572881259251630080)]} 0 1
[junit4] 2> 914403 INFO (qtp659353522-8338) [ ] o.a.s.u.p.LogUpdateProcessorFactory [collection1] webapp= path=/update params={wt=javabin&version=2}{add=[1 (1572881259253727232)]} 0 1
[junit4] 2> 914404 INFO (qtp55933908-8322) [ ] o.a.s.u.p.LogUpdateProcessorFactory [collection1] webapp= path=/update params={wt=javabin&version=2}{add=[2 (1572881259255824384)]} 0 0
[junit4] 2> 914405 INFO (qtp659353522-8339) [ ] o.a.s.u.p.LogUpdateProcessorFactory [collection1] webapp= path=/update params={wt=javabin&version=2}{add=[2 (1572881259256872960)]} 0 0
[junit4] 2> 914407 INFO (qtp55933908-8323) [ ] o.a.s.u.p.LogUpdateProcessorFactory [collection1] webapp= path=/update params={wt=javabin&version=2}{add=[3 (1572881259257921536)]} 0 0
[junit4] 2> 914407 INFO (qtp659353522-8340) [ ] o.a.s.u.p.LogUpdateProcessorFactory [collection1] webapp= path=/update params={wt=javabin&version=2}{add=[3 (1572881259258970112)]} 0 0
[junit4] 2> 914408 INFO (qtp55933908-8324) [ ] o.a.s.u.p.LogUpdateProcessorFactory [collection1] webapp= path=/update params={wt=javabin&version=2}{add=[4 (1572881259260018688)]} 0 0
[junit4] 2> 914408 INFO (qtp659353522-8341) [ ] o.a.s.u.p.LogUpdateProcessorFactory [collection1] webapp= path=/update params={wt=javabin&version=2}{add=[4 (1572881259260018688)]} 0 0
[junit4] 2> 914409 INFO (qtp55933908-8325) [ ] o.a.s.u.p.LogUpdateProcessorFactory [collection1] webapp= path=/update params={wt=javabin&version=2}{add=[5 (1572881259261067264)]} 0 0
[junit4] 2> 914410 INFO (qtp659353522-8342) [ ] o.a.s.u.p.LogUpdateProcessorFactory [collection1] webapp= path=/update params={wt=javabin&version=2}{add=[5 (1572881259261067264)]} 0 0
[junit4] 2> 914410 INFO (qtp55933908-8318) [ ] o.a.s.u.p.LogUpdateProcessorFactory [collection1] webapp= path=/update params={wt=javabin&version=2}{add=[6 (1572881259262115840)]} 0 0
[junit4] 2> 914411 INFO (qtp659353522-8335) [ ] o.a.s.u.p.LogUpdateProcessorFactory [collection1] webapp= path=/update params={wt=javabin&version=2}{add=[6 (1572881259263164416)]} 0 0
[junit4] 2> 914412 INFO (qtp55933908-8320) [ ] o.a.s.u.p.LogUpdateProcessorFactory [collection1] webapp= path=/update params={wt=javabin&version=2}{add=[7 (1572881259263164416)]} 0 0
[junit4] 2> 914412 INFO (qtp659353522-8337) [ ] o.a.s.u.p.LogUpdateProcessorFactory [collection1] webapp= path=/update params={wt=javabin&version=2}{add=[7 (1572881259264212992)]} 0 0
[junit4] 2> 914413 INFO (qtp55933908-8321) [ ] o.a.s.u.p.LogUpdateProcessorFactory [collection1] webapp= path=/update params={wt=javabin&version=2}{add=[8 (1572881259264212992)]} 0 0
[junit4] 2> 914413 INFO (qtp659353522-8337) [ ] o.a.s.u.p.LogUpdateProcessorFactory [collection1] webapp= path=/update params={wt=javabin&version=2}{add=[8 (1572881259265261568)]} 0 0
[junit4] 2> 914414 INFO (qtp55933908-8322) [ ] o.a.s.u.p.LogUpdateProcessorFactory [collection1] webapp= path=/update params={wt=javabin&version=2}{add=[9 (1572881259266310144)]} 0 0
[junit4] 2> 914414 INFO (qtp659353522-8337) [ ] o.a.s.u.p.LogUpdateProcessorFactory [collection1] webapp= path=/update params={wt=javabin&version=2}{add=[9 (1572881259266310144)]} 0 0
[junit4] 2> 914415 INFO (qtp55933908-8323) [ ] o.a.s.u.DirectUpdateHandler2 start commit{_version_=1572881259267358720,optimize=false,openSearcher=true,waitSearcher=true,expungeDeletes=false,softCommit=false,prepareCommit=false}
[junit4] 2> 914415 INFO (qtp55933908-8323) [ ] o.a.s.u.SolrIndexWriter Calling setCommitData with IW:org.apache.solr.update.SolrIndexWriter@3e17b8a7 commitCommandVersion:1572881259267358720
[junit4] 2> 914453 INFO (qtp55933908-8323) [ ] o.a.s.s.SolrIndexSearcher Opening [Searcher@10964c5c[collection1] main]
[junit4] 2> 914453 INFO (qtp55933908-8323) [ ] o.a.s.u.DirectUpdateHandler2 end_commit_flush
[junit4] 2> 914454 INFO (searcherExecutor-3842-thread-1) [ ] o.a.s.c.SolrCore [collection1] Registered new searcher Searcher@10964c5c[collection1] main{ExitableDirectoryReader(UninvertingDirectoryReader(Uninverting(_0(7.1.0):c9)))}
[junit4] 2> 914454 INFO (qtp55933908-8323) [ ] o.a.s.u.p.LogUpdateProcessorFactory [collection1] webapp= path=/update params={waitSearcher=true&commit=true&softCommit=false&wt=javabin&version=2}{commit=} 0 39
[junit4] 2> 914455 INFO (qtp659353522-8337) [ ] o.a.s.u.DirectUpdateHandler2 start commit{_version_=1572881259309301760,optimize=false,openSearcher=true,waitSearcher=true,expungeDeletes=false,softCommit=false,prepareCommit=false}
[junit4] 2> 914455 INFO (qtp659353522-8337) [ ] o.a.s.u.SolrIndexWriter Calling setCommitData with IW:org.apache.solr.update.SolrIndexWriter@271d85f6 commitCommandVersion:1572881259309301760
[junit4] 2> 914468 INFO (qtp659353522-8337) [ ] o.a.s.s.SolrIndexSearcher Opening [Searcher@343c27c[collection1] main]
[junit4] 2> 914468 INFO (qtp659353522-8337) [ ] o.a.s.u.DirectUpdateHandler2 end_commit_flush
[junit4] 2> 914469 INFO (searcherExecutor-3853-thread-1) [ ] o.a.s.c.SolrCore [collection1] Registered new searcher Searcher@343c27c[collection1] main{ExitableDirectoryReader(UninvertingDirectoryReader(Uninverting(_0(7.1.0):c9)))}
[junit4] 2> 914469 INFO (qtp659353522-8337) [ ] o.a.s.u.p.LogUpdateProcessorFactory [collection1] webapp= path=/update params={waitSearcher=true&commit=true&softCommit=false&wt=javabin&version=2}{commit=} 0 14
[junit4] 2> 914472 INFO (qtp55933908-8324) [ ] o.a.s.u.p.LogUpdateProcessorFactory [collection1] webapp= path=/update params={wt=javabin&version=2}{add=[10 (1572881259325030400)]} 0 2
[junit4] 2> 914475 INFO (qtp659353522-8341) [ ] o.a.s.u.p.LogUpdateProcessorFactory [collection1] webapp= path=/update params={wt=javabin&version=2}{add=[10 (1572881259327127552)]} 0 1
[junit4] 2> 914476 INFO (qtp55933908-8325) [ ] o.a.s.u.p.LogUpdateProcessorFactory [collection1] webapp= path=/update params={wt=javabin&version=2}{add=[11 (1572881259330273280)]} 0 0
[junit4] 2> 914477 INFO (qtp659353522-8342) [ ] o.a.s.u.p.LogUpdateProcessorFactory [collection1] webapp= path=/update params={wt=javabin&version=2}{add=[11 (1572881259331321856)]} 0 0
[junit4] 2> 914478 INFO (qtp55933908-8318) [ ] o.a.s.u.p.LogUpdateProcessorFactory [collection1] webapp= path=/update params={wt=javabin&version=2}{add=[12 (1572881259332370432)]} 0 0
[junit4] 2> 914479 INFO (qtp659353522-8335) [ ] o.a.s.u.p.LogUpdateProcessorFactory [collection1] webapp= path=/update params={wt=javabin&version=2}{add=[12 (1572881259333419008)]} 0 0
[junit4] 2> 914479 INFO (qtp55933908-8320) [ ] o.a.s.u.p.LogUpdateProcessorFactory [collection1] webapp= path=/update params={wt=javabin&version=2}{add=[13 (1572881259334467584)]} 0 0
[junit4] 2> 914480 INFO (qtp659353522-8338) [ ] o.a.s.u.p.LogUpdateProcessorFactory [collection1] webapp= path=/update params={wt=javabin&version=2}{add=[13 (1572881259335516160)]} 0 0
[junit4] 2> 914481 INFO (qtp55933908-8321) [ ] o.a.s.u.p.LogUpdateProcessorFactory [collection1] webapp= path=/update params={wt=javabin&version=2}{add=[1001 (1572881259335516160)]} 0 0
[junit4] 2> 914482 INFO (qtp659353522-8339) [ ] o.a.s.u.p.LogUpdateProcessorFactory [collection1] webapp= path=/update params={wt=javabin&version=2}{add=[1001 (1572881259336564736)]} 0 0
[junit4] 2> 914483 INFO (qtp55933908-8322) [ ] o.a.s.u.p.LogUpdateProcessorFactory [collection1] webapp= path=/update params={wt=javabin&version=2}{add=[14 (1572881259337613312)]} 0 0
[junit4] 2> 914484 INFO (qtp659353522-8340) [ ] o.a.s.u.p.LogUpdateProcessorFactory [collection1] webapp= path=/update params={wt=javabin&version=2}{add=[14 (1572881259338661888)]} 0 0
[junit4] 2> 914484 INFO (qtp55933908-8323) [ ] o.a.s.u.p.LogUpdateProcessorFactory [collection1] webapp= path=/update params={wt=javabin&version=2}{add=[15 (1572881259339710464)]} 0 0
[junit4] 2> 914485 INFO (qtp659353522-8337) [ ] o.a.s.u.p.LogUpdateProcessorFactory [collection1] webapp= path=/update params={wt=javabin&version=2}{add=[15 (1572881259340759040)]} 0 0
[junit4] 2> 914485 INFO (qtp55933908-8324) [ ] o.a.s.u.p.LogUpdateProcessorFactory [collection1] webapp= path=/update params={wt=javabin&version=2}{add=[16 (1572881259340759040)]} 0 0
[junit4] 2> 914486 INFO (qtp659353522-8341) [ ] o.a.s.u.p.LogUpdateProcessorFactory [collection1] webapp= path=/update params={wt=javabin&version=2}{add=[16 (1572881259341807616)]} 0 0
[junit4] 2> 914487 INFO (qtp55933908-8325) [ ] o.a.s.u.p.LogUpdateProcessorFactory [collection1] webapp= path=/update params={wt=javabin&version=2}{add=[17 (1572881259341807616)]} 0 0
[junit4] 2> 914487 INFO (qtp659353522-8342) [ ] o.a.s.u.p.LogUpdateProcessorFactory [collection1] webapp= path=/update params={wt=javabin&version=2}{add=[17 (1572881259342856192)]} 0 0
[junit4] 2> 914488 INFO (qtp55933908-8318) [ ] o.a.s.u.p.LogUpdateProcessorFactory [collection1] webapp= path=/update params={wt=javabin&version=2}{add=[100 (1572881259342856192)]} 0 0
[junit4] 2> 914488 INFO (qtp659353522-8335) [ ] o.a.s.u.p.LogUpdateProcessorFactory [collection1] webapp= path=/update params={wt=javabin&version=2}{add=[100 (1572881259343904768)]} 0 0
[junit4] 2> 914489 INFO (qtp55933908-8320) [ ] o.a.s.u.p.LogUpdateProcessorFactory [collection1] webapp= path=/update params={wt=javabin&version=2}{add=[101 (1572881259343904768)]} 0 0
[junit4] 2> 914489 INFO (qtp659353522-8338) [ ] o.a.s.u.p.LogUpdateProcessorFactory [collection1] webapp= path=/update params={wt=javabin&version=2}{add=[101 (1572881259344953344)]} 0 0
[junit4] 2> 914490 INFO (qtp55933908-8320) [ ] o.a.s.u.p.LogUpdateProcessorFactory [collection1] webapp= path=/update params={wt=javabin&version=2}{add=[102 (1572881259346001920)]} 0 0
[junit4] 2> 914490 INFO (qtp659353522-8339) [ ] o.a.s.u.p.LogUpdateProcessorFactory [collection1] webapp= path=/update params={wt=javabin&version=2}{add=[102 (1572881259346001920)]} 0 0
[junit4] 2> 914491 INFO (qtp55933908-8322) [ ] o.a.s.u.p.LogUpdateProcessorFactory [collection1] webapp= path=/update params={wt=javabin&version=2}{add=[103 (1572881259347050496)]} 0 0
[junit4] 2> 914491 INFO (qtp659353522-8340) [ ] o.a.s.u.p.LogUpdateProcessorFactory [collection1] webapp= path=/update params={wt=javabin&version=2}{add=[103 (1572881259347050496)]} 0 0
[junit4] 2> 914492 INFO (qtp55933908-8323) [ ] o.a.s.u.p.LogUpdateProcessorFactory [collection1] webapp= path=/update params={wt=javabin&version=2}{add=[104 (1572881259348099072)]} 0 0
[junit4] 2> 914493 INFO (qtp659353522-8337) [ ] o.a.s.u.p.LogUpdateProcessorFactory [collection1] webapp= path=/update params={wt=javabin&version=2}{add=[104 (1572881259348099072)]} 0 0
[junit4] 2> 914493 INFO (qtp55933908-8324) [ ] o.a.s.u.p.LogUpdateProcessorFactory [collection1] webapp= path=/update params={wt=javabin&version=2}{add=[105 (1572881259349147648)]} 0 0
[junit4] 2> 914493 INFO (qtp659353522-8341) [ ] o.a.s.u.p.LogUpdateProcessorFactory [collection1] webapp= path=/update params={wt=javabin&version=2}{add=[105 (1572881259349147648)]} 0 0
[junit4] 2> 914494 INFO (qtp55933908-8325) [ ] o.a.s.u.p.LogUpdateProcessorFactory [collection1] webapp= path=/update params={wt=javabin&version=2}{add=[106 (1572881259350196224)]} 0 0
[junit4] 2> 914494 INFO (qtp659353522-8342) [ ] o.a.s.u.p.LogUpdateProcessorFactory [collection1] webapp= path=/update params={wt=javabin&version=2}{add=[106 (1572881259350196224)]} 0 0
[junit4] 2> 914495 INFO (qtp55933908-8318) [ ] o.a.s.u.p.LogUpdateProcessorFactory [collection1] webapp= path=/update params={wt=javabin&version=2}{add=[107 (1572881259351244800)]} 0 0
[junit4] 2> 914496 INFO (qtp659353522-8335) [ ] o.a.s.u.p.LogUpdateProcessorFactory [collection1] webapp= path=/update params={wt=javabin&version=2}{add=[107 (1572881259351244800)]} 0 0
[junit4] 2> 914496 INFO (qtp55933908-8321) [ ] o.a.s.u.p.LogUpdateProcessorFactory [collection1] webapp= path=/update params={wt=javabin&version=2}{add=[108 (1572881259352293376)]} 0 0
[junit4] 2> 914497 INFO (qtp659353522-8338) [ ] o.a.s.u.p.LogUpdateProcessorFactory [collection1] webapp= path=/update params={wt=javabin&version=2}{add=[108 (1572881259353341952)]} 0 0
[junit4] 2> 914497 INFO (qtp55933908-8320) [ ] o.a.s.u.p.LogUpdateProcessorFactory [collection1] webapp= path=/update params={wt=javabin&version=2}{add=[109 (1572881259353341952)]} 0 0
[junit4] 2> 914498 INFO (qtp659353522-8339) [ ] o.a.s.u.p.LogUpdateProcessorFactory [collection1] webapp= path=/update params={wt=javabin&version=2}{add=[109 (1572881259354390528)]} 0 0
[junit4] 2> 914499 INFO (qtp55933908-8322) [ ] o.a.s.u.p.LogUpdateProcessorFactory [collection1] webapp= path=/update params={wt=javabin&version=2}{add=[110 (1572881259354390528)]} 0 0
[junit4] 2> 914499 INFO (qtp659353522-8340) [ ] o.a.s.u.p.LogUpdateProcessorFactory [collection1] webapp= path=/update params={wt=javabin&version=2}{add=[110 (1572881259355439104)]} 0 0
[junit4] 2> 914500 INFO (qtp55933908-8323) [ ] o.a.s.u.p.LogUpdateProcessorFactory [collection1] webapp= path=/update params={wt=javabin&version=2}{add=[111 (1572881259355439104)]} 0 0
[junit4] 2> 914500 INFO (qtp659353522-8337) [ ] o.a.s.u.p.LogUpdateProcessorFactory [collection1] webapp= path=/update params={wt=javabin&version=2}{add=[111 (1572881259356487680)]} 0 0
[junit4] 2> 914501 INFO (qtp55933908-8324) [ ] o.a.s.u.p.LogUpdateProcessorFactory [collection1] webapp= path=/update params={wt=javabin&version=2}{add=[112 (1572881259356487680)]} 0 0
[junit4] 2> 914501 INFO (qtp659353522-8341) [ ] o.a.s.u.p.LogUpdateProcessorFactory [collection1] webapp= path=/update params={wt=javabin&version=2}{add=[112 (1572881259357536256)]} 0 0
[junit4] 2> 914502 INFO (qtp55933908-8325) [ ] o.a.s.u.p.LogUpdateProcessorFactory [collection1] webapp= path=/update params={wt=javabin&version=2}{add=[113 (1572881259357536256)]} 0 0
[junit4] 2> 914502 INFO (qtp659353522-8342) [ ] o.a.s.u.p.LogUpdateProcessorFactory [collection1] webapp= path=/update params={wt=javabin&version=2}{add=[113 (1572881259358584832)]} 0 0
[junit4] 2> 914503 INFO (qtp55933908-8318) [ ] o.a.s.u.p.LogUpdateProcessorFactory [collection1] webapp= path=/update params={wt=javabin&version=2}{add=[114 (1572881259358584832)]} 0 0
[junit4] 2> 914503 INFO (qtp659353522-8335) [ ] o.a.s.u.p.LogUpdateProcessorFactory [collection1] webapp= path=/update params={wt=javabin&version=2}{add=[114 (1572881259359633408)]} 0 0
[junit4] 2> 914504 INFO (qtp55933908-8321) [ ] o.a.s.u.p.LogUpdateProcessorFactory [collection1] webapp= path=/update params={wt=javabin&version=2}{add=[115 (1572881259360681984)]} 0 0
[junit4] 2> 914504 INFO (qtp659353522-8338) [ ] o.a.s.u.p.LogUpdateProcessorFactory [collection1] webapp= path=/update params={wt=javabin&version=2}{add=[115 (1572881259360681984)]} 0 0
[junit4] 2> 914505 INFO (qtp55933908-8320) [ ] o.a.s.u.p.LogUpdateProcessorFactory [collection1] webapp= path=/update params={wt=javabin&version=2}{add=[116 (1572881259360681985)]} 0 0
[junit4] 2> 914505 INFO (qtp659353522-8339) [ ] o.a.s.u.p.LogUpdateProcessorFactory [collection1] webapp= path=/update params={wt=javabin&version=2}{add=[116 (1572881259361730560)]} 0 0
[junit4] 2> 914505 INFO (qtp55933908-8322) [ ] o.a.s.u.p.LogUpdateProcessorFactory [collection1] webapp= path=/update params={wt=javabin&version=2}{add=[117 (1572881259361730560)]} 0 0
[junit4] 2> 914505 INFO (qtp659353522-8340) [ ] o.a.s.u.p.LogUpdateProcessorFactory [collection1] webapp= path=/update params={wt=javabin&version=2}{add=[117 (1572881259361730561)]} 0 0
[junit4] 2> 914507 INFO (qtp55933908-8323) [ ] o.a.s.u.p.LogUpdateProcessorFactory [collection1] webapp= path=/update params={wt=javabin&version=2}{add=[118 (1572881259363827712)]} 0 0
[junit4] 2> 914507 INFO (qtp659353522-8337) [ ] o.a.s.u.p.LogUpdateProcessorFactory [collection1] webapp= path=/update params={wt=javabin&version=2}{add=[118 (1572881259363827712)]} 0 0
[junit4] 2> 914508 INFO (qtp55933908-8324) [ ] o.a.s.u.p.LogUpdateProcessorFactory [collection1] webapp= path=/update params={wt=javabin&version=2}{add=[119 (1572881259364876288)]} 0 0
[junit4] 2> 914509 INFO (qtp659353522-8341) [ ] o.a.s.u.p.LogUpdateProcessorFactory [collection1] webapp= path=/update params={wt=javabin&version=2}{add=[119 (1572881259364876288)]} 0 0
[junit4] 2> 914509 INFO (qtp55933908-8325) [ ] o.a.s.u.p.LogUpdateProcessorFactory [collection1] webapp= path=/update params={wt=javabin&version=2}{add=[120 (1572881259365924864)]} 0 0
[junit4] 2> 914510 INFO (qtp659353522-8342) [ ] o.a.s.u.p.LogUpdateProcessorFactory [collection1] webapp= path=/update params={wt=javabin&version=2}{add=[120 (1572881259365924864)]} 0 0
[junit4] 2> 914510 INFO (qtp55933908-8318) [ ] o.a.s.u.p.LogUpdateProcessorFactory [collection1] webapp= path=/update params={wt=javabin&version=2}{add=[121 (1572881259366973440)]} 0 0
[junit4] 2> 914511 INFO (qtp659353522-8335) [ ] o.a.s.u.p.LogUpdateProcessorFactory [collection1] webapp= path=/update params={wt=javabin&version=2}{add=[121 (1572881259368022016)]} 0 0
[junit4] 2> 914512 INFO (qtp55933908-8321) [ ] o.a.s.u.p.LogUpdateProcessorFactory [collection1] webapp= path=/update params={wt=javabin&version=2}{add=[122 (1572881259368022016)]} 0 0
[junit4] 2> 914512 INFO (qtp659353522-8338) [ ] o.a.s.u.p.LogUpdateProcessorFactory [collection1] webapp= path=/update params={wt=javabin&version=2}{add=[122 (1572881259369070592)]} 0 0
[junit4] 2> 914513 INFO (qtp55933908-8320) [ ] o.a.s.u.p.LogUpdateProcessorFactory [collection1] webapp= path=/update params={wt=javabin&version=2}{add=[123 (1572881259370119168)]} 0 0
[junit4] 2> 914513 INFO (qtp659353522-8339) [ ] o.a.s.u.p.LogUpdateProcessorFactory [collection1] webapp= path=/update params={wt=javabin&version=2}{add=[123 (1572881259370119168)]} 0 0
[junit4] 2> 914514 INFO (qtp55933908-8322) [ ] o.a.s.u.p.LogUpdateProcessorFactory [collection1] webapp= path=/update params={wt=javabin&version=2}{add=[124 (1572881259371167744)]} 0 0
[junit4] 2> 914515 INFO (qtp659353522-8340) [ ] o.a.s.u.p.LogUpdateProcessorFactory [collection1] webapp= path=/update params={wt=javabin&version=2}{add=[124 (1572881259371167744)]} 0 0
[junit4] 2> 914515 INFO (qtp55933908-8323) [ ] o.a.s.u.p.LogUpdateProcessorFactory [collection1] webapp= path=/update params={wt=javabin&version=2}{add=[125 (1572881259372216320)]} 0 0
[junit4] 2> 914516 INFO (qtp659353522-8337) [ ] o.a.s.u.p.LogUpdateProcessorFactory [collection1] webapp= path=/update params={wt=javabin&version=2}{add=[125 (1572881259372216320)]} 0 0
[junit4] 2> 914516 INFO (qtp55933908-8324) [ ] o.a.s.u.p.LogUpdateProcessorFactory [collection1] webapp= path=/update params={wt=javabin&version=2}{add=[126 (1572881259373264896)]} 0 0
[junit4] 2> 914516 INFO (qtp659353522-8341) [ ] o.a.s.u.p.LogUpdateProcessorFactory [collection1] webapp= path=/update params={wt=javabin&version=2}{add=[126 (1572881259373264896)]} 0 0
[junit4] 2> 914516 INFO (qtp55933908-8325) [ ] o.a.s.u.p.LogUpdateProcessorFactory [collection1] webapp= path=/update params={wt=javabin&version=2}{add=[127 (1572881259373264897)]} 0 0
[junit4] 2> 914517 INFO (qtp659353522-8342) [ ] o.a.s.u.p.LogUpdateProcessorFactory [collection1] webapp= path=/update params={wt=javabin&version=2}{add=[127 (1572881259374313472)]} 0 0
[junit4] 2> 914518 INFO (qtp55933908-8318) [ ] o.a.s.u.p.LogUpdateProcessorFactory [collection1] webapp= path=/update params={wt=javabin&version=2}{add=[128 (1572881259374313472)]} 0 0
[junit4] 2> 914518 INFO (qtp659353522-8335) [ ] o.a.s.u.p.LogUpdateProcessorFactory [collection1] webapp= path=/update params={wt=javabin&version=2}{add=[128 (1572881259375362048)]} 0 0
[junit4] 2> 914519 INFO (qtp55933908-8321) [ ] o.a.s.u.p.LogUpdateProcessorFactory [collection1] webapp= path=/update params={wt=javabin&version=2}{add=[129 (1572881259376410624)]} 0 0
[junit4] 2> 914520 INFO (qtp659353522-8338) [ ] o.a.s.u.p.LogUpdateProcessorFactory [collection1] webapp= path=/update params={wt=javabin&version=2}{add=[129 (1572881259377459200)]} 0 0
[junit4] 2> 914520 INFO (qtp55933908-8320) [ ] o.a.s.u.p.LogUpdateProcessorFactory [collection1] webapp= path=/update params={wt=javabin&version=2}{add=[130 (1572881259377459200)]} 0 0
[junit4] 2> 914521 INFO (qtp659353522-8339) [ ] o.a.s.u.p.LogUpdateProcessorFactory [collection1] webapp= path=/update params={wt=javabin&version=2}{add=[130 (1572881259378507776)]} 0 0
[junit4] 2> 914521 INFO (qtp55933908-8322) [ ] o.a.s.u.p.LogUpdateProcessorFactory [collection1] webapp= path=/update params={wt=javabin&version=2}{add=[131 (1572881259378507776)]} 0 0
[junit4] 2> 914522 INFO (qtp659353522-8340) [ ] o.a.s.u.p.LogUpdateProcessorFactory [collection1] webapp= path=/update params={wt=javabin&version=2}{add=[131 (1572881259379556352)]} 0 0
[junit4] 2> 914522 INFO (qtp55933908-8323) [ ] o.a.s.u.p.LogUpdateProcessorFactory [collection1] webapp= path=/update params={wt=javabin&version=2}{add=[132 (1572881259379556352)]} 0 0
[junit4] 2> 914523 INFO (qtp659353522-8337) [ ] o.a.s.u.p.LogUpdateProcessorFactory [collection1] webapp= path=/update params={wt=javabin&version=2}{add=[132 (1572881259380604928)]} 0 0
[junit4] 2> 914524 INFO (qtp55933908-8324) [ ] o.a.s.u.p.LogUpdateProcessorFactory [collection1] webapp= path=/update params={wt=javabin&version=2}{add=[133 (1572881259380604928)]} 0 0
[junit4] 2> 914524 INFO (qtp659353522-8337) [ ] o.a.s.u.p.LogUpdateProcessorFactory [collection1] webapp= path=/update params={wt=javabin&version=2}{add=[133 (1572881259381653504)]} 0 0
[junit4] 2> 914525 INFO (qtp55933908-8325) [ ] o.a.s.u.p.LogUpdateProcessorFactory [collection1] webapp= path=/update params={wt=javabin&version=2}{add=[134 (1572881259382702080)]} 0 0
[junit4] 2> 914525 INFO (qtp659353522-8342) [ ] o.a.s.u.p.LogUpdateProcessorFactory [collection1] webapp= path=/update params={wt=javabin&version=2}{add=[134 (1572881259382702080)]} 0 0
[junit4] 2> 914526 INFO (qtp55933908-8318) [ ] o.a.s.u.p.LogUpdateProcessorFactory [collection1] webapp= path=/update params={wt=javabin&version=2}{add=[135 (1572881259383750656)]} 0 0
[junit4] 2> 914527 INFO (qtp659353522-8335) [ ] o.a.s.u.p.LogUpdateProcessorFactory [collection1] webapp= path=/update params={wt=javabin&version=2}{add=[135 (1572881259384799232)]} 0 0
[junit4] 2> 914527 INFO (qtp55933908-8321) [ ] o.a.s.u.p.LogUpdateProcessorFactory [collection1] webapp= path=/update params={wt=javabin&version=2}{add=[136 (1572881259384799232)]} 0 0
[junit4] 2> 914528 INFO (qtp659353522-8338) [ ] o.a.s.u.p.LogUpdateProcessorFactory [collection1] webapp= path=/update params={wt=javabin&version=2}{add=[136 (1572881259385847808)]} 0 0
[junit4] 2> 914529 INFO (qtp55933908-8320) [ ] o.a.s.u.p.LogUpdateProcessorFactory [collection1] webapp= path=/update params={wt=javabin&version=2}{add=[137 (1572881259385847808)]} 0 0
[junit4] 2> 914529 INFO (qtp659353522-8339) [ ] o.a.s.u.p.LogUpdateProcessorFactory [collection1] webapp= path=/update params={wt=javabin&version=2}{add=[137 (1572881259386896384)]} 0 0
[junit4] 2> 914530 INFO (qtp55933908-8322) [ ] o.a.s.u.p.LogUpdateProcessorFactory [collection1] webapp= path=/update params={wt=javabin&version=2}{add=[138 (1572881259386896384)]} 0 0
[junit4] 2> 914530 INFO (qtp659353522-8340) [ ] o.a.s.u.p.LogUpdateProcessorFactory [collection1] webapp= path=/update params={wt=javabin&version=2}{add=[138 (1572881259387944960)]} 0 0
[junit4] 2> 914531 INFO (qtp55933908-8323) [ ] o.a.s.u.p.LogUpdateProcessorFactory [collection1] webapp= path=/update params={wt=javabin&version=2}{add=[139 (1572881259387944960)]} 0 0
[junit4] 2> 914531 INFO (qtp659353522-8341) [ ] o.a.s.u.p.LogUpdateProcessorFactory [collection1] webapp= path=/update params={wt=javabin&version=2}{add=[139 (1572881259388993536)]} 0 0
[junit4] 2> 914532 INFO (qtp55933908-8324) [ ] o.a.s.u.p.LogUpdateProcessorFactory [collection1] webapp= path=/update params={wt=javabin&version=2}{add=[140 (1572881259388993536)]} 0 0
[junit4] 2> 914532 INFO (qtp659353522-8337) [ ] o.a.s.u.p.LogUpdateProcessorFactory [collection1] webapp= path=/update params={wt=javabin&version=2}{add=[140 (1572881259390042112)]} 0 0
[junit4] 2> 914533 INFO (qtp55933908-8325) [ ] o.a.s.u.p.LogUpdateProcessorFactory [collection1] webapp= path=/update params={wt=javabin&version=2}{add=[141 (1572881259390042112)]} 0 0
[junit4] 2> 914533 INFO (qtp659353522-8342) [ ] o.a.s.u.p.LogUpdateProcessorFactory [collection1] webapp= path=/update params={wt=javabin&version=2}{add=[141 (1572881259391090688)]} 0 0
[junit4] 2> 914534 INFO (qtp55933908-8325) [ ] o.a.s.u.p.LogUpdateProcessorFactory [collection1] webapp= path=/update params={wt=javabin&version=2}{add=[142 (1572881259392139264)]} 0 0
[junit4] 2> 914534 INFO (qtp659353522-8335) [ ] o.a.s.u.p.LogUpdateProcessorFactory [collection1] webapp= path=/update params={wt=javabin&version=2}{add=[142 (1572881259392139264)]} 0 0
[junit4] 2> 914535 INFO (qtp55933908-8321) [ ] o.a.s.u.p.LogUpdateProcessorFactory [collection1] webapp= path=/update params={wt=javabin&version=2}{add=[143 (1572881259393187840)]} 0 0
[junit4] 2> 914536 INFO (qtp659353522-8338) [ ] o.a.s.u.p.LogUpdateProcessorFactory [collection1] webapp= path=/update params={wt=javabin&version=2}{add=[143 (1572881259393187840)]} 0 0
[junit4] 2> 914536 INFO (qtp55933908-8320) [ ] o.a.s.u.p.LogUpdateProcessorFactory [collection1] webapp= path=/update params={wt=javabin&version=2}{add=[144 (1572881259394236416)]} 0 0
[junit4] 2> 914537 INFO (qtp659353522-8339) [ ] o.a.s.u.p.LogUpdateProcessorFactory [collection1] webapp= path=/update params={wt=javabin&version=2}{add=[144 (1572881259394236416)]} 0 0
[junit4] 2> 914537 INFO (qtp55933908-8322) [ ] o.a.s.u.p.LogUpdateProcessorFactory [collection1] webapp= path=/update params={wt=javabin&version=2}{add=[145 (1572881259395284992)]} 0 0
[junit4] 2> 914538 INFO (qtp659353522-8340) [ ] o.a.s.u.p.LogUpdateProcessorFactory [collection1] webapp= path=/update params={wt=javabin&version=2}{add=[145 (1572881259396333568)]} 0 0
[junit4] 2> 914538 INFO (qtp55933908-8323) [ ] o.a.s.u.p.LogUpdateProcessorFactory [collection1] webapp= path=/update params={wt=javabin&version=2}{add=[146 (1572881259396333568)]} 0 0
[junit4] 2> 914539 INFO (qtp659353522-8341) [ ] o.a.s.u.p.LogUpdateProcessorFactory [collection1] webapp= path=/update params={wt=javabin&version=2}{add=[146 (1572881259397382144)]} 0 0
[junit4] 2> 914539 INFO (qtp55933908-8324) [ ] o.a.s.u.p.LogUpdateProcessorFactory [collection1] webapp= path=/update params={wt=javabin&version=2}{add=[147 (1572881259397382144)]} 0 0
[junit4] 2> 914540 INFO (qtp659353522-8337) [ ] o.a.s.u.p.LogUpdateProcessorFactory [collection1] webapp= path=/update params={wt=javabin&version=2}{add=[147 (1572881259398430720)]} 0 0
[junit4] 2> 914540 INFO (qtp55933908-8318) [ ] o.a.s.u.p.LogUpdateProcessorFactory [collection1] webapp= path=/update params={wt=javabin&version=2}{add=[148 (1572881259398430720)]} 0 0
[junit4] 2> 914541 INFO (qtp659353522-8342) [ ] o.a.s.u.p.LogUpdateProcessorFactory [collection1] webapp= path=/update params={wt=javabin&version=2}{add=[148 (1572881259399479296)]} 0 0
[junit4] 2> 914541 INFO (qtp55933908-8325) [ ] o.a.s.u.p.LogUpdateProcessorFactory [collection1] webapp= path=/update params={wt=javabin&version=2}{add=[149 (1572881259399479296)]} 0 0
[junit4] 2> 914542 INFO (qtp659353522-8335) [ ] o.a.s.u.p.LogUpdateProcessorFactory [collection1] webapp= path=/update params={wt=javabin&version=2}{add=[149 (1572881259400527872)]} 0 0
[junit4] 2> 914542 INFO (qtp55933908-8321) [ ] o.a.s.u.DirectUpdateHandler2 start commit{_version_=1572881259400527872,optimize=false,openSearcher=true,waitSearcher=true,expungeDeletes=false,softCommit=false,prepareCommit=false}
[junit4] 2> 914542 INFO (qtp55933908-8321) [ ] o.a.s.u.SolrIndexWriter Calling setCommitData with IW:org.apache.solr.update.SolrIndexWriter@3e17b8a7 commitCommandVersion:1572881259400527872
[junit4] 2> 914553 INFO (qtp55933908-8321) [ ] o.a.s.s.SolrIndexSearcher Opening [Searcher@35fb1c68[collection1] main]
[junit4] 2> 914554 INFO (qtp55933908-8321) [ ] o.a.s.u.DirectUpdateHandler2 end_commit_flush
[junit4] 2> 914555 INFO (searcherExecutor-3842-thread-1) [ ] o.a.s.c.SolrCore [collection1] Registered new searcher Searcher@35fb1c68[collection1] main{ExitableDirectoryReader(UninvertingDirectoryReader(Uninverting(_0(7.1.0):c9) Uninverting(_1(7.1.0):c59)))}
[junit4] 2> 914555 INFO (qtp55933908-8321) [ ] o.a.s.u.p.LogUpdateProcessorFactory [collection1] webapp= path=/update params={waitSearcher=true&commit=true&softCommit=false&wt=javabin&version=2}{commit=} 0 12
[junit4] 2> 914556 INFO (qtp659353522-8338) [ ] o.a.s.u.DirectUpdateHandler2 start commit{_version_=1572881259415207936,optimize=false,openSearcher=true,waitSearcher=true,expungeDeletes=false,softCommit=false,prepareCommit=false}
[junit4] 2> 914556 INFO (qtp659353522-8338) [ ] o.a.s.u.SolrIndexWriter Calling setCommitData with IW:org.apache.solr.update.SolrIndexWriter@271d85f6 commitCommandVersion:1572881259415207936
[junit4] 2> 914563 INFO (qtp659353522-8338) [ ] o.a.s.s.SolrIndexSearcher Opening [Searcher@2b91b191[collection1] main]
[junit4] 2> 914563 INFO (qtp659353522-8338) [ ] o.a.s.u.DirectUpdateHandler2 end_commit_flush
[junit4] 2> 914565 INFO (searcherExecutor-3853-thread-1) [ ] o.a.s.c.SolrCore [collection1] Registered new searcher Searcher@2b91b191[collection1] main{ExitableDirectoryReader(UninvertingDirectoryReader(Uninverting(_0(7.1.0):c9) Uninverting(_1(7.1.0):c59)))}
[junit4] 2> 914565 INFO (qtp659353522-8338) [ ] o.a.s.u.p.LogUpdateProcessorFactory [collection1] webapp= path=/update params={waitSearcher=true&commit=true&softCommit=false&wt=javabin&version=2}{commit=} 0 9
[junit4] 2> 914566 INFO (qtp55933908-8320) [ ] o.a.s.h.RequestHandlerBase Ignoring exception matching parameter cannot be negative
[junit4] 2> 914566 INFO (qtp55933908-8320) [ ] o.a.s.c.S.Request [collection1] webapp= path=/select params={q=*&distrib=false&start=-1&wt=javabin&version=2} status=400 QTime=0
[junit4] 2> 914566 INFO (qtp55933908-8322) [ ] o.a.s.h.RequestHandlerBase Ignoring exception matching parameter cannot be negative
[junit4] 2> 914567 INFO (qtp55933908-8322) [ ] o.a.s.c.S.Request [collection1] webapp= path=/select params={q=*&distrib=false&start=0&rows=-1&wt=javabin&version=2} status=400 QTime=0
[junit4] 2> 914567 INFO (qtp55933908-8323) [ ] o.a.s.c.S.Request [collection1] webapp= path=/select params={q=*:*&distrib=false&sort=n_ti1+desc&wt=javabin&version=2} hits=68 status=0 QTime=0
[junit4] 2> 914571 INFO (qtp659353522-8341) [ ] o.a.s.c.S.Request [collection1] webapp= path=/select params={df=text&distrib=false&fl=id&shards.purpose=4&start=0&fsv=true&sort=n_ti1+desc&shard.url=http://127.0.0.1:64547//collection1&rows=10&version=2&q=*:*&NOW=1500016459874&isShard=true&wt=javabin} hits=68 status=0 QTime=0
[junit4] 2> 914572 INFO (qtp659353522-8337) [ ] o.a.s.c.S.Request [collection1] webapp= path=/select params={q=*:*&df=text&distrib=false&shards.purpose=64&NOW=1500016459874&ids=100,122,145,149,6,7,128,107,118,140&isShard=true&shard.url=http://127.0.0.1:64547//collection1&wt=javabin&version=2} status=0 QTime=0
[junit4] 2> 914573 INFO (qtp659353522-8339) [ ] o.a.s.c.S.Request [collection1] webapp= path=/select params={q=*:*&shards=http://127.0.0.1:64547//collection1&sort=n_ti1+desc&wt=javabin&version=2} hits=68 status=0 QTime=4
[junit4] 2> 914576 INFO (qtp55933908-8324) [ ] o.a.s.c.S.Request [collection1] webapp= path=/select params={q=*:*&distrib=false&sort=n_ti1+asc&wt=javabin&version=2} hits=68 status=0 QTime=0
[junit4] 2> 914591 INFO (qtp659353522-8335) [ ] o.a.s.c.S.Request [collection1] webapp= path=/select params={df=text&distrib=false&fl=id&shards.purpose=4&start=0&fsv=true&sort=n_ti1+asc&shard.url=[ff01::114]:33332/|http://127.0.0.1:64547//collection1&rows=10&version=2&q=*:*&NOW=1500016459883&isShard=true&wt=javabin} hits=68 status=0 QTime=0
[junit4] 2> 914591 INFO (qtp659353522-8338) [ ] o.a.s.c.S.Request [collection1] webapp= path=/select params={q=*:*&df=text&distrib=false&shards.purpose=64&NOW=1500016459883&ids=11,123,101,114,147,137,104,1001,10,120&isShard=true&shard.url=[ff01::114]:33332/|http://127.0.0.1:64547//collection1&wt=javabin&version=2} status=0 QTime=0
[junit4] 2> 914593 INFO (qtp659353522-8342) [ ] o.a.s.c.S.Request [collection1] webapp= path=/select params={q=*:*&shards=[ff01::114]:33332/|http://127.0.0.1:64547//collection1&sort=n_ti1+asc&wt=javabin&version=2} hits=68 status=0 QTime=15
[junit4] 2> 914594 INFO (qtp55933908-8318) [ ] o.a.s.c.S.Request [collection1] webapp= path=/select params={q=*:*&distrib=false&sort=n_f1+desc&wt=javabin&version=2} hits=68 status=0 QTime=0
[junit4] 2> 914607 INFO (qtp659353522-8341) [ ] o.a.s.c.S.Request [collection1] webapp= path=/select params={df=text&distrib=false&fl=id&shards.purpose=4&start=0&fsv=true&sort=n_f1+desc&shard.url=[ff01::213]:33332/|http://127.0.0.1:64547//collection1|[ff01::083]:33332/&rows=10&version=2&q=*:*&NOW=1500016459900&isShard=true&wt=javabin} hits=68 status=0 QTime=0
[junit4] 2> 914609 INFO (qtp659353522-8337) [ ] o.a.s.c.S.Request [collection1] webapp= path=/select params={q=*:*&df=text&distrib=false&shards.purpose=64&NOW=1500016459900&ids=121,110,132,146,114,5,139,129,118,140&isShard=true&shard.url=[ff01::213]:33332/|http://127.0.0.1:64547//collection1|[ff01::083]:33332/&wt=javabin&version=2} status=0 QTime=0
[junit4] 2> 914610 INFO (qtp659353522-8340) [ ] o.a.s.c.S.Request [collection1] webapp= path=/select params={q=*:*&shards=[ff01::213]:33332/|http://127.0.0.1:64547//collection1|[ff01::083]:33332/&sort=n_f1+desc&wt=javabin&version=2} hits=68 status=0 QTime=14
[junit4] 2> 914611 INFO (qtp55933908-8325) [ ] o.a.s.c.S.Request [collection1] webapp= path=/select params={q=*:*&distrib=false&sort=n_f1+asc&wt=javabin&version=2} hits=68 status=0 QTime=0
[junit4] 2> 914622 INFO (qtp659353522-8335) [ ] o.a.s.c.S.Request [collection1] webapp= path=/select params={df=text&distrib=false&fl=id&shards.purpose=4&start=0&fsv=true&sort=n_f1+asc&shard.url=[ff01::114]:33332/|[ff01::213]:33332/|[ff01::083]:33332/|http://127.0.0.1:64547//collection1&rows=10&version=2&q=*:*&NOW=1500016459917&isShard=true&wt=javabin} hits=68 status=0 QTime=0
[junit4] 2> 914624 INFO (qtp659353522-8338) [ ] o.a.s.c.S.Request [collection1] webapp= path=/select params={q=*:*&df=text&distrib=false&shards.purpose=64&NOW=1500016459917&ids=122,144,145,3,147,104,6,149,128,130&isShard=true&shard.url=[ff01::114]:33332/|[ff01::213]:33332/|[ff01::083]:33332/|http://127.0.0.1:64547//collection1&wt=javabin&version=2} status=0 QTime=0
[junit4] 2> 914625 INFO (qtp659353522-8339) [ ] o.a.s.c.S.Request [collection1] webapp= path=/select params={q=*:*&shards=[ff01::114]:33332/|[ff01::213]:33332/|[ff01::083]:33332/|http://127.0.0.1:64547//collection1&sort=n_f1+asc&wt=javabin&version=2} hits=68 status=0 QTime=13
[junit4] 2> 914626 INFO (qtp55933908-8321) [ ] o.a.s.c.S.Request [collection1] webapp= path=/select params={q=*:*&distrib=false&sort=n_tf1+desc&wt=javabin&version=2} hits=68 status=0 QTime=0
[junit4] 2> 914628 INFO (qtp659353522-8341) [ ] o.a.s.c.S.Request [collection1] webapp= path=/select params={df=text&distrib=false&fl=id&shards.purpose=4&start=0&fsv=true&sort=n_tf1+desc&shard.url=http://127.0.0.1:64547//collection1|[ff01::083]:33332/|[ff01::213]:33332/&rows=10&version=2&q=*:*&NOW=1500016459932&isShard=true&wt=javabin} hits=68 status=0 QTime=0
[junit4] 2> 914629 INFO (qtp659353522-8337) [ ] o.a.s.c.S.Request [collection1] webapp= path=/select params={q=*:*&df=text&distrib=false&shards.purpose=64&NOW=1500016459932&ids=100,134,15,16,106,117,8,119,10,142&isShard=true&shard.url=http://127.0.0.1:64547//collection1|[ff01::083]:33332/|[ff01::213]:33332/&wt=javabin&version=2} status=0 QTime=0
[junit4] 2> 914630 INFO (qtp659353522-8342) [ ] o.a.s.c.S.Request [collection1] webapp= path=/select params={q=*:*&shards=http://127.0.0.1:64547//collection1|[ff01::083]:33332/|[ff01::213]:33332/&sort=n_tf1+desc&wt=javabin&version=2} hits=68 status=0 QTime=2
[junit4] 2> 914632 INFO (qtp55933908-8320) [ ] o.a.s.c.S.Request [collection1] webapp= path=/select params={q=*:*&distrib=false&sort=n_tf1+asc&wt=javabin&version=2} hits=68 status=0 QTime=0
[junit4] 2> 914634 INFO (qtp659353522-8335) [ ] o.a.s.c.S.Request [collection1] webapp= path=/select params={df=text&distrib=false&fl=id&shards.purpose=4&start=0&fsv=true&sort=n_tf1+asc&shard.url=[ff01::083]:33332/|http://127.0.0.1:64547//collection1|[ff01::213]:33332/|[ff01::114]:33332/&rows=10&version=2&q=*:*&NOW=1500016459938&isShard=true&wt=javabin} hits=68 status=0 QTime=0
[junit4] 2> 914635 INFO (qtp659353522-8338) [ ] o.a.s.c.S.Request [collection1] webapp= path=/select params={q=*:*&df=text&distrib=false&shards.purpose=64&NOW=1500016459938&ids=132,135,103,125,137,17,138,1001,107,130&isShard=true&shard.url=[ff01::083]:33332/|http://127.0.0.1:64547//collection1|[ff01::213]:33332/|[ff01::114]:33332/&wt=javabin&version=2} status=0 QTime=0
[junit4] 2> 914636 INFO (qtp659353522-8340) [ ] o.a.s.c.S.Request [collection1] webapp= path=/select params={q=*:*&shards=[ff01::083]:33332/|http://127.0.0.1:64547//collection1|[ff01::213]:33332/|[ff01::114]:33332/&sort=n_tf1+asc&wt=javabin&version=2} hits=68 status=0 QTime=3
[junit4] 2> 914637 INFO (qtp55933908-8322) [ ] o.a.s.c.S.Request [collection1] webapp= path=/select params={q=*:*&distrib=false&sort=n_d1+desc&wt=javabin&version=2} hits=68 status=0 QTime=0
[junit4] 2> 914639 INFO (qtp659353522-8341) [ ] o.a.s.c.S.Request [collection1] webapp= path=/select params={df=text&distrib=false&fl=id&shards.purpose=4&start=0&fsv=true&sort=n_d1+desc&shard.url=http://127.0.0.1:64547//collection1|[ff01::213]:33332/|[ff01::114]:33332/&rows=10&version=2&q=*:*&NOW=1500016459943&isShard=true&wt=javabin} hits=68 status=0 QTime=0
[junit4] 2> 914640 INFO (qtp659353522-8337) [ ] o.a.s.c.S.Request [collection1] webapp= path=/select params={q=*:*&df=text&distrib=false&shards.purpose=64&NOW=1500016459943&ids=121,11,122,102,146,104,137,149,1001,118&isShard=true&shard.url=http://127.0.0.1:64547//collection1|[ff01::213]:33332/|[ff01::114]:33332/&wt=javabin&version=2} status=0 QTime=0
[junit4] 2> 914641 INFO (qtp659353522-8339) [ ] o.a.s.c.S.Request [collection1] webapp= path=/select params={q=*:*&shards=http://127.0.0.1:64547//collection1|[ff01::213]:33332/|[ff01::114]:33332/&sort=n_d1+desc&wt=javabin&version=2} hits=68 status=0 QTime=2
[junit4] 2> 914642 INFO (qtp55933908-8323) [ ] o.a.s.c.S.Request [collection1] webapp= path=/select params={q=*:*&distrib=false&sort=n_d1+asc&wt=javabin&version=2} hits=68 status=0 QTime=0
[junit4] 2> 914643 INFO (qtp659353522-8335) [ ] o.a.s.c.S.Request [collection1] webapp= path=/select params={df=text&distrib=false&fl=id&shards.purpose=4&start=0&fsv=true&sort=n_d1+asc&shard.url=[ff01::083]:33332/|[ff01::114]:33332/|http://127.0.0.1:64547//collection1&rows=10&version=2&q=*:*&NOW=1500016459948&isShard=true&wt=javabin} hits=68 status=0 QTime=0
[junit4] 2> 914644 INFO (qtp659353522-8338) [ ] o.a.s.c.S.Request [collection1] webapp= path=/select params={q=*:*&df=text&distrib=false&shards.purpose=64&NOW=1500016459948&ids=143,100,12,5,16,138,17,127,142,120&isShard=true&shard.url=[ff01::083]:33332/|[ff01::114]:33332/|http://127.0.0.1:64547//collection1&wt=javabin&version=2} status=0 QTime=0
[junit4] 2> 914645 INFO (qtp659353522-8342) [ ] o.a.s.c.S.Request [collection1] webapp= path=/select params={q=*:*&shards=[ff01::083]:33332/|[ff01::114]:33332/|http://127.0.0.1:64547//collection1&sort=n_d1+asc&wt=javabin&version=2} hits=68 status=0 QTime=2
[junit4] 2> 914647 INFO (qtp55933908-8323) [ ] o.a.s.c.S.Request [collection1] webapp= path=/select params={q=*:*&distrib=false&sort=n_td1+desc&wt=javabin&version=2} hits=68 status=0 QTime=0
[junit4] 2> 914648 INFO (qtp659353522-8341) [ ] o.a.s.c.S.Request [collection1] webapp= path=/select params={df=text&distrib=false&fl=id&shards.purpose=4&start=0&fsv=true&sort=n_td1+desc&shard.url=http://127.0.0.1:64547//collection1|[ff01::213]:33332/|[ff01::083]:33332/&rows=10&version=2&q=*:*&NOW=1500016459953&isShard=true&wt=javabin} hits=68 status=0 QTime=0
[junit4] 2> 914649 INFO (qtp659353522-8337) [ ] o.a.s.c.S.Request [collection1] webapp= path=/select params={q=*:*&df=text&distrib=false&shards.purpose=64&NOW=1500016459953&ids=132,145,113,146,125,4,114,5,117,109&isShard=true&shard.url=http://127.0.0.1:64547//collection1|[ff01::213]:33332/|[ff01::083]:33332/&wt=javabin&version=2} status=0 QTime=0
[junit4] 2> 914650 INFO (qtp659353522-8340) [ ] o.a.s.c.S.Request [collection1] webapp= path=/select params={q=*:*&shards=http://127.0.0.1:64547//collection1|[ff01::213]:33332/|[ff01::083]:33332/&sort=n_td1+desc&wt=javabin&version=2} hits=68 status=0 QTime=2
[junit4] 2> 914651 INFO (qtp55933908-8318) [ ] o.a.s.c.S.Request [collection1] webapp= path=/select params={q=*:*&distrib=false&sort=n_td1+asc&wt=javabin&version=2} hits=68 status=0 QTime=0
[junit4] 2> 914653 INFO (qtp659353522-8335) [ ] o.a.s.c.S.Request [collection1] webapp= path=/select params={df=text&distrib=false&fl=id&shards.purpose=4&start=0&fsv=true&sort=n_td1+asc&shard.url=http://127.0.0.1:64547//collection1&rows=10&version=2&q=*:*&NOW=1500016459957&isShard=true&wt=javabin} hits=68 status=0 QTime=0
[junit4] 2> 914654 INFO (qtp659353522-8338) [ ] o.a.s.c.S.Request [collection1] webapp= path=/select params={q=*:*&df=text&distrib=false&shards.purpose=64&NOW=1500016459957&ids=12,144,124,103,115,6,106,129,141,142&isShard=true&shard.url=http://127.0.0.1:64547//collection1&wt=javabin&version=2} status=0 QTime=0
[junit4] 2> 914654 INFO (qtp659353522-8339) [ ] o.a.s.c.S.Request [collection1] webapp= path=/select params={q=*:*&shards=http://127.0.0.1:64547//collection1&sort=n_td1+asc&wt=javabin&version=2} hits=68 status=0 QTime=2
[junit4] 2> 914655 INFO (qtp55933908-8325) [ ] o.a.s.c.S.Request [collection1] webapp= path=/select params={q=*:*&distrib=false&sort=n_l1+desc&wt=javabin&version=2} hits=68 status=0 QTime=0
[junit4] 2> 914657 INFO (qtp659353522-8341) [ ] o.a.s.c.S.Request [collection1] webapp= path=/select params={df=text&distrib=false&fl=id&shards.purpose=4&start=0&fsv=true&sort=n_l1+desc&shard.url=[ff01::083]:33332/|http://127.0.0.1:64547//collection1|[ff01::213]:33332/&rows=10&version=2&q=*:*&NOW=1500016459961&isShard=true&wt=javabin} hits=68 status=0 QTime=0
[junit4] 2> 914658 INFO (qtp659353522-8337) [ ] o.a.s.c.S.Request [collection1] webapp= path=/select params={q=*:*&df=text&distrib=false&shards.purpose=64&NOW=1500016459961&ids=2,134,103,4,148,104,126,105,149,127&isShard=true&shard.url=[ff01::083]:33332/|http://127.0.0.1:64547//collection1|[ff01::213]:33332/&wt=javabin&version=2} status=0 QTime=0
[junit4] 2> 914659 INFO (qtp659353522-8342) [ ] o.a.s.c.S.Request [collection1] webapp= path=/select params={q=*:*&shards=[ff01::083]:33332/|http://127.0.0.1:64547//collection1|[ff01::213]:33332/&sort=n_l1+desc&wt=javabin&version=2} hits=68 status=0 QTime=2
[junit4] 2> 914660 INFO (qtp55933908-8321) [ ] o.a.s.c.S.Request [collection1] webapp= path=/select params={q=*:*&distrib=false&sort=n_l1+asc&wt=javabin&version=2} hits=68 status=0 QTime=0
[junit4] 2> 914662 INFO (qtp659353522-8335) [ ] o.a.s.c.S.Request [collection1] webapp= path=/select params={df=text&distrib=false&fl=id&shards.purpose=4&start=0&fsv=true&sort=n_l1+asc&shard.url=[ff01::083]:33332/|http://127.0.0.1:64547//collection1|[ff01::213]:33332/&rows=10&version=2&q=*:*&NOW=1500016459966&isShard=true&wt=javabin} hits=68 status=0 QTime=0
[junit4] 2> 914662 INFO (qtp659353522-8338) [ ] o.a.s.c.S.Request [collection1] webapp= path=/select params={q=*:*&df=text&distrib=false&shards.purpose=64&NOW=1500016459966&ids=110,11,135,14,136,15,116,106,107,108&isShard=true&shard.url=[ff01::083]:33332/|http://127.0.0.1:64547//collection1|[ff01::213]:33332/&wt=javabin&version=2} status=0 QTime=0
[junit4] 2> 914663 INFO (qtp659353522-8340) [ ] o.a.s.c.S.Request [collection1] webapp= path=/select params={q=*:*&shards=[ff01::083]:33332/|http://127.0.0.1:64547//collection1|[ff01::213]:33332/&sort=n_l1+asc&wt=javabin&version=2} hits=68 status=0 QTime=2
[junit4] 2> 914664 INFO (qtp55933908-8320) [ ] o.a.s.c.S.Request [collection1] webapp= path=/select params={q=*:*&distrib=false&sort=n_tl1+desc&wt=javabin&version=2} hits=68 status=0 QTime=0
[junit4] 2> 914666 INFO (qtp659353522-8341) [ ] o.a.s.c.S.Request [collection1] webapp= path=/select params={df=text&distrib=false&fl=id&shards.purpose=4&start=0&fsv=true&sort=n_tl1+desc&shard.url=[ff01::213]:33332/|http://127.0.0.1:64547//collection1&rows=10&version=2&q=*:*&NOW=1500016459970&isShard=true&wt=javabin} hits=68 status=0 QTime=0
[junit4] 2> 914667 INFO (qtp659353522-8337) [ ] o.a.s.c.S.Request [collection1] webapp= path=/select params={q=*:*&df=text&distrib=false&shards.purpose=64&NOW=1500016459970&ids=134,112,15,104,5,149,138,116,106,108&isShard=true&shard.url=[ff01::213]:33332/|http://127.0.0.1:64547//collection1&wt=javabin&version=2} status=0 QTime=0
[junit4] 2> 914668 INFO (qtp659353522-8339) [ ] o.a.s.c.S.Request [collection1] webapp= path=/select params={q=*:*&shards=[ff01::213]:33332/|http://127.0.0.1:64547//collection1&sort=n_tl1+desc&wt=javabin&version=2} hits=68 status=0 QTime=2
[junit4] 2> 914669 INFO (qtp55933908-8322) [ ] o.a.s.c.S.Request [collection1] webapp= path=/select params={q=*:*&distrib=false&sort=n_tl1+asc&wt=javabin&version=2} hits=68 status=0 QTime=0
[junit4] 2> 914671 INFO (qtp659353522-8335) [ ] o.a.s.c.S.Request [collection1] webapp= path=/select params={df=text&distrib=false&fl=id&shards.purpose=4&start=0&fsv=true&sort=n_tl1+asc&shard.url=http://127.0.0.1:64547//collection1&rows=10&version=2&q=*:*&NOW=1500016459975&isShard=true&wt=javabin} hits=68 status=0 QTime=0
[junit4] 2> 914672 INFO (qtp659353522-8338) [ ] o.a.s.c.S.Request [collection1] webapp= path=/select params={q=*:*&df=text&distrib=false&shards.purpose=64&NOW=1500016459975&ids=132,3,135,113,6,127,139,9,141,131&isShard=true&shard.url=http://127.0.0.1:64547//collection1&wt=javabin&version=2} status=0 QTime=0
[junit4] 2> 914673 INFO (qtp659353522-8342) [ ] o.a.s.c.S.Request [collection1] webapp= path=/select params={q=*:*&shards=http://127.0.0.1:64547//collection1&sort=n_tl1+asc&wt=javabin&version=2} hits=68 status=0 QTime=2
[junit4] 2> 914674 INFO (qtp55933908-8324) [ ] o.a.s.c.S.Request [collection1] webapp= path=/select params={q=*:*&distrib=false&sort=n_dt1+desc&wt=javabin&version=2} hits=68 status=0 QTime=0
[junit4] 2> 914675 INFO (qtp659353522-8341) [ ] o.a.s.c.S.Request [collection1] webapp= path=/select params={df=text&distrib=false&fl=id&shards.purpose=4&start=0&fsv=true&sort=n_dt1+desc&shard.url=[ff01::114]:33332/|[ff01::213]:33332/|http://127.0.0.1:64547//collection1&rows=10&version=2&q=*:*&NOW=1500016459980&isShard=true&wt=javabin} hits=68 status=0 QTime=0
[junit4] 2> 914676 INFO (qtp659353522-8337) [ ] o.a.s.c.S.Request [collection1] webapp= path=/select params={q=*:*&df=text&distrib=false&shards.purpose=64&NOW=1500016459980&ids=11,110,12,102,136,126,127,7,10,120&isShard=true&shard.url=[ff01::114]:33332/|[ff01::213]:33332/|http://127.0.0.1:64547//collection1&wt=javabin&version=2} status=0 QTime=0
[junit4] 2> 914677 INFO (qtp659353522-8340) [ ] o.a.s.c.S.Request [collection1] webapp= path=/select params={q=*:*&shards=[ff01::114]:33332/|[ff01::213]:33332/|http://127.0.0.1:64547//collection1&sort=n_dt1+desc&wt=javabin&version=2} hits=68 status=0 QTime=2
[junit4] 2> 914678 INFO (qtp55933908-8323) [ ] o.a.s.c.S.Request [collection1] webapp= path=/select params={q=*:*&distrib=false&sort=n_dt1+asc&wt=javabin&version=2} hits=68 status=0 QTime=0
[junit4] 2> 914680 INFO (qtp659353522-8335) [ ] o.a.s.c.S.Request [collection1] webapp= path=/select params={df=text&distrib=false&fl=id&shards.purpose=4&start=0&fsv=true&sort=n_dt1+asc&shard.url=[ff01::114]:33332/|[ff01::083]:33332/|[ff01::213]:33332/|http://127.0.0.1:64547//collection1&rows=10&version=2&q=*:*&NOW=1500016459984&isShard=true&wt=javabin} hits=68 status=0 QTime=0
[junit4] 2> 914681 INFO (qtp659353522-8338) [ ] o.a.s.c.S.Request [collection1] webapp= path=/select params={q=*:*&df=text&distrib=false&shards.purpose=64&NOW=1500016459984&ids=143,111,112,134,14,135,147,115,1001,142&isShard=true&shard.url=[ff01::114]:33332/|[ff01::083]:33332/|[ff01::213]:33332/|http://127.0.0.1:64547//collection1&wt=javabin&version=2} status=0 QTime=0
[junit4] 2> 914681 INFO (qtp659353522-8339) [ ] o.a.s.c.S.Request [collection1] webapp= path=/select params={q=*:*&shards=[ff01::114]:33332/|[ff01::083]:33332/|[ff01::213]:33332/|http://127.0.0.1:64547//collection1&sort=n_dt1+asc&wt=javabin&version=2} hits=68 status=0 QTime=2
[junit4] 2> 914682 INFO (qtp55933908-8318) [ ] o.a.s.c.S.Request [collection1] webapp= path=/select params={q=*:*&distrib=false&sort=n_tdt1+desc&wt=javabin&version=2} hits=68 status=0 QTime=0
[junit4] 2> 914684 INFO (qtp659353522-8341) [ ] o.a.s.c.S.Request [collection1] webapp= path=/select params={df=text&distrib=false&fl=id&shards.purpose=4&start=0&fsv=true&sort=n_tdt1+desc&shard.url=[ff01::213]:33332/|[ff01::083]:33332/|[ff01::114]:33332/|http://127.0.0.1:64547//collection1&rows=10&version=2&q=*:*&NOW=1500016459988&isShard=true&wt=javabin} hits=68 status=0 QTime=0
[junit4] 2> 914685 INFO (qtp659353522-8337) [ ] o.a.s.c.S.Request [collection1] webapp= path=/select params={q=*:*&df=text&distrib=false&shards.purpose=64&NOW=1500016459988&ids=1,112,123,102,14,103,15,7,1001,108&isShard=true&shard.url=[ff01::213]:33332/|[ff01::083]:33332/|[ff01::114]:33332/|http://127.0.0.1:64547//collection1&wt=javabin&version=2} status=0 QTime=0
[junit4] 2> 914686 INFO (qtp659353522-8342) [ ] o.a.s.c.S.Request [collection1] webapp= path=/select params={q=*:*&shards=[ff01::213]:33332/|[ff01::083]:33332/|[ff01::114]:33332/|http://127.0.0.1:64547//collection1&sort=n_tdt1+desc&wt=javabin&version=2} hits=68 status=0 QTime=2
[junit4] 2> 914687 INFO (qtp55933908-8325) [ ] o.a.s.c.S.Request [collection1] webapp= path=/select params={q=*:*&distrib=false&sort=n_tdt1+asc&wt=javabin&version=2} hits=68 status=0 QTime=0
[junit4] 2> 914688 INFO (qtp659353522-8335) [ ] o.a.s.c.S.Request [collection1] webapp= path=/select params={df=text&distrib=false&fl=id&shards.purpose=4&start=0&fsv=true&sort=n_tdt1+asc&shard.url=http://127.0.0.1:64547//collection1&rows=10&version=2&q=*:*&NOW=1500016459992&isShard=true&wt=javabin} hits=68 status=0 QTime=0
[junit4] 2> 914689 INFO (qtp659353522-8338) [ ] o.a.s.c.S.Request [collection1] webapp= path=/select params={q=*:*&df=text&distrib=false&shards.purpose=64&NOW=1500016459992&ids=110,111,13,136,115,6,128,117,129,130&isShard=true&shard.url=http://127.0.0.1:64547//collection1&wt=javabin&version=2} status=0 QTime=0
[junit4] 2> 914690 INFO (qtp659353522-8340) [ ] o.a.s.c.S.Request [collection1] webapp= path=/select params={q=*:*&shards=http://127.0.0.1:64547//collection1&sort=n_tdt1+asc&wt=javabin&version=2} hits=68 status=0 QTime=2
[junit4] 2> 914691 INFO (qtp55933908-8321) [ ] o.a.s.c.S.Request [collection1] webapp= path=/select params={q=*:*&distrib=false&sort=a_i1+desc&wt=javabin&version=2} hits=68 status=0 QTime=0
[junit4] 2> 914693 INFO (qtp659353522-8341) [ ] o.a.s.c.S.Request [collection1] webapp= path=/select params={df=text&distrib=false&fl=id&shards.purpose=4&start=0&fsv=true&sort=a_i1+desc&shard.url=http://127.0.0.1:64547//collection1|[ff01::114]:33332/|[ff01::083]:33332/&rows=10&version=2&q=*:*&NOW=1500016459997&isShard=true&wt=javabin} hits=68 status=0 QTime=0
[junit4] 2> 914694 INFO (qtp659353522-8337) [ ] o.a.s.c.S.Request [collection1] webapp= path=/select params={q=*:*&df=text&distrib=false&shards.purpose=64&NOW=1500016459997&ids=1,12,2,13,3,5,7,8,9,10&isShard=true&shard.url=http://127.0.0.1:64547//collection1|[ff01::114]:33332/|[ff01::083]:33332/&wt=javabin&version=2} status=0 QTime=0
[junit4] 2> 914695 INFO (qtp659353522-8339) [ ] o.a.s.c.S.Request [collection1] webapp= path=/select params={q=*:*&shards=http://127.0.0.1:64547//collection1|[ff01::114]:33332/|[ff01::083]:33332/&sort=a_i1+desc&wt=javabin&version=2} hits=68 status=0 QTime=2
[junit4] 2> 914696 INFO (qtp55933908-8320) [ ] o.a.s.c.S.Request [collection1] webapp= path=/select params={q=*:*&distrib=false&sort={!func}testfunc(add(a_i1,5))+desc&wt=javabin&version=2} hits=68 status=0 QTime=0
[junit4] 2> 914698 INFO (qtp659353522-8335) [ ] o.a.s.c.S.Request [collection1] webapp= path=/select params={df=text&distrib=false&fl=id&shards.purpose=4&start=0&fsv=true&sort={!func}testfunc(add(a_i1,5))+desc&shard.url=[ff01::114]:33332/|[ff01::213]:33332/|http://127.0.0.1:64547//collection1|[ff01::083]:33332/&rows=10&version=2&q=*:*&NOW=1500016460002&isShard=true&wt=javabin} hits=68 status=0 QTime=0
[junit4] 2> 914699 INFO (qtp659353522-8338) [ ] o.a.s.c.S.Request [collection1] webapp= path=/select params={q=*:*&df=text&distrib=false&shards.purpose=64&NOW=1500016460002&ids=1,12,2,13,3,5,7,8,9,10&isShard=true&shard.url=[ff01::114]:33332/|[ff01::213]:33332/|http://127.0.0.1:64547//collection1|[ff01::083]:33332/&wt=javabin&version=2} status=0 QTime=0
[junit4] 2> 914700 INFO (qtp659353522-8342) [ ] o.a.s.c.S.Request [collection1] webapp= path=/select params={q=*:*&shards=[ff01::114]:33332/|[ff01::213]:33332/|http://127.0.0.1:64547//collection1|[ff01::083]:33332/&sort={!func}testfunc(add(a_i1,5))+desc&wt=javabin&version=2} hits=68 status=0 QTime=3
[junit4] 2> 914702 INFO (qtp55933908-8322) [ ] o.a.s.c.S.Request [collection1] webapp= path=/select params={q=a_i1[*+TO+*]&distrib=false&sort=a_i1+asc&wt=javabin&version=2} hits=13 status=0 QTime=0
[junit4] 2> 914703 INFO (qtp659353522-8341) [ ] o.a.s.c.S.Request [collection1] webapp= path=/select params={df=text&distrib=false&fl=id&shards.purpose=4&start=0&fsv=true&sort=a_i1+asc&shard.url=[ff01::213]:33332/|http://127.0.0.1:64547//collection1&rows=10&version=2&q=a_i1[*+TO+*]&NOW=1500016460008&isShard=true&wt=javabin} hits=13 status=0 QTime=0
[junit4] 2> 914703 INFO (qtp659353522-8341) [ ] o.a.s.c.S.Request [collection1] webapp= path=/select params={q=a_i1[*+TO+*]&df=text&distrib=false&shards.purpose=64&NOW=1500016460008&ids=11,12,1,13,2,3,4,6,7,9&isShard=true&shard.url=[ff01::213]:33332/|http://127.0.0.1:64547//collection1&wt=javabin&version=2} status=0 QTime=0
[junit4] 2> 914703 INFO (qtp659353522-8340) [ ] o.a.s.c.S.Request [collection1] webapp= path=/select params={q=a_i1[*+TO+*]&shards=[ff01::213]:33332/|http://127.0.0.1:64547//collection1&sort=a_i1+asc&wt=javabin&version=2} hits=13 status=0 QTime=2
[junit4] 2> 914703 INFO (qtp55933908-8324) [ ] o.a.s.c.S.Request [collection1] webapp= path=/select params={q=*:*&distrib=false&sort=a_i1+asc,+id+desc&wt=javabin&version=2} hits=68 status=0 QTime=0
[junit4] 2> 914709 INFO (qtp659353522-8335) [ ] o.a.s.c.S.Request [collection1] webapp= path=/select params={df=text&distrib=false&fl=id&shards.purpose=4&start=0&fsv=true&sort=a_i1+asc,+id+desc&shard.url=http://127.0.0.1:64547//collection1&rows=10&version=2&q=*:*&NOW=1500016460013&isShard=true&wt=javabin} hits=68 status=0 QTime=0
[junit4] 2> 914709 INFO (qtp659353522-8338) [ ] o.a.s.c.S.Request [collection1] webapp= path=/select params={q=*:*&df=text&distrib=false&shards.purpose=64&NOW=1500016460013&ids=11,12,1,13,2,3,4,6,7,9&isShard=true&shard.url=http://127.0.0.1:64547//collection1&wt=javabin&version=2} status=0 QTime=0
[junit4] 2> 914711 INFO (qtp659353522-8339) [ ] o.a.s.c.S.Request [collection1] webapp= path=/select params={q=*:*&shards=http://127.0.0.1:64547//collection1&sort=a_i1+asc,+id+desc&wt=javabin&version=2} hits=68 status=0 QTime=2
[junit4] 2> 914712 INFO (qtp55933908-8323) [ ] o.a.s.c.S.Request [collection1] webapp= path=/select params={q=*:*&distrib=false&fl=*,score&sort=a_i1+desc&wt=javabin&version=2} hits=68 status=0 QTime=0
[junit4] 2> 914714 INFO (qtp659353522-8337) [ ] o.a.s.c.S.Request [collection1] webapp= path=/select params={df=text&distrib=false&fl=id&fl=score&shards.purpose=4&start=0&fsv=true&sort=a_i1+desc&shard.url=http://127.0.0.1:64547//collection1|[ff01::213]:33332/&rows=10&version=2&q=*:*&NOW=1500016460018&isShard=true&wt=javabin} hits=68 status=0 QTime=0
[junit4] 2> 914715 INFO (qtp659353522-8341) [ ] o.a.s.c.S.Request [collection1] webapp= path=/select params={q=*:*&df=text&distrib=false&fl=*,score&shards.purpose=64&NOW=1500016460018&ids=1,12,2,13,3,5,7,8,9,10&isShard=true&shard.url=http://127.0.0.1:64547//collection1|[ff01::213]:33332/&wt=javabin&version=2} status=0 QTime=0
[junit4] 2> 914716 INFO (qtp659353522-8338) [ ] o.a.s.c.S.Request [collection1] webapp= path=/select params={q=*:*&shards=http://127.0.0.1:64547//collection1|[ff01::213]:33332/&fl=*,score&sort=a_i1+desc&wt=javabin&version=2} hits=68 status=0 QTime=3
[junit4] 2> 914718 INFO (qtp55933908-8318) [ ] o.a.s.c.S.Request [collection1] webapp= path=/select params={q=*:*&distrib=false&fl=*,score&sort=n_tl1+asc&wt=javabin&version=2} hits=68 status=0 QTime=0
[junit4] 2> 914720 INFO (qtp659353522-8335) [ ] o.a.s.c.S.Request [collection1] webapp= path=/select params={df=text&distrib=false&fl=id&fl=score&shards.purpose=4&start=0&fsv=true&sort=n_tl1+asc&shard.url=[ff01::213]:33332/|http://127.0.0.1:64547//collection1&rows=10&version=2&q=*:*&NOW=1500016460024&isShard=true&wt=javabin} hits=68 status=0 QTime=0
[junit4] 2> 914721 INFO (qtp659353522-8342) [ ] o.a.s.c.S.Request [collection1] webapp= path=/select params={q=*:*&df=text&distrib=false&fl=*,score&shards.purpose=64&NOW=1500016460024&ids=132,3,135,113,6,127,139,9,141,131&isShard=true&shard.url=[ff01::213]:33332/|http://127.0.0.1:64547//collection1&wt=javabin&version=2} status=0 QTime=0
[junit4] 2> 914721 INFO (qtp659353522-8340) [ ] o.a.s.c.S.Request [collection1] webapp= path=/select params={q=*:*&shards=[ff01::213]:33332/|http://127.0.0.1:64547//collection1&fl=*,score&sort=n_tl1+asc&wt=javabin&version=2} hits=68 status=0 QTime=2
[junit4] 2> 914722 INFO (qtp55933908-8325) [ ] o.a.s.c.S.Request [collection1] webapp= path=/select params={q=*:*&distrib=false&sort=n_tl1+desc&wt=javabin&version=2} hits=68 status=0 QTime=0
[junit4] 2> 914724 INFO (qtp659353522-8337) [ ] o.a.s.c.S.Request [collection1] webapp= path=/select params={df=text&distrib=false&fl=id&shards.purpose=4&start=0&fsv=true&sort=n_tl1+desc&shard.url=http://127.0.0.1:64547//collection1&rows=10&version=2&q=*:*&NOW=1500016460028&isShard=true&wt=javabin} hits=68 status=0 QTime=0
[junit4] 2> 914728 INFO (qtp659353522-8341) [ ] o.a.s.c.S.Request [collection1] webapp= path=/select params={q=*:*&df=text&distrib=false&shards.purpose=64&NOW=1500016460028&ids=134,112,15,104,5,149,138,116,106,108&isShard=true&shard.url=http://127.0.0.1:64547//collection1&wt=javabin&version=2} status=0 QTime=0
[junit4] 2> 914732 INFO (qtp659353522-8339) [ ] o.a.s.c.S.Request [collection1] webapp= path=/select params={q=*:*&shards=http://127.0.0.1:64547//collection1&sort=n_tl1+desc&wt=javabin&version=2} hits=68 status=0 QTime=7
[junit4] 2> 914732 INFO (qtp55933908-8321) [ ] o.a.s.c.S.Request [collection1] webapp= path=/select params={q={!func}a_i1&distrib=false&wt=javabin&version=2} hits=68 status=0 QTime=0
[junit4] 2> 914734 INFO (qtp659353522-8335) [ ] o.a.s.c.S.Request [collection1] webapp= path=/select params={df=text&distrib=false&fl=id&fl=score&shards.purpose=4&start=0&fsv=true&shard.url=http://127.0.0.1:64547//collection1&rows=10&version=2&q={!f
[...truncated too long message...]
[junit4] 2> 966646 INFO (TEST-TestDistributedSearch.test-seed#[79D9B9D16F81043A]) [ ] o.a.s.c.CoreContainer Shutting down CoreContainer instance=78887578
[junit4] 2> 966647 INFO (TEST-TestDistributedSearch.test-seed#[79D9B9D16F81043A]) [ ] o.a.s.m.SolrMetricManager Closing metric reporters for registry=solr.node, tag=null
[junit4] 2> 966647 INFO (TEST-TestDistributedSearch.test-seed#[79D9B9D16F81043A]) [ ] o.a.s.m.SolrMetricManager Closing metric reporters for registry=solr.jvm, tag=null
[junit4] 2> 966647 INFO (TEST-TestDistributedSearch.test-seed#[79D9B9D16F81043A]) [ ] o.a.s.m.SolrMetricManager Closing metric reporters for registry=solr.jetty, tag=null
[junit4] 2> 966647 INFO (TEST-TestDistributedSearch.test-seed#[79D9B9D16F81043A]) [ ] o.a.s.c.TransientSolrCoreCacheDefault Allocating transient cache for 2147483647 transient cores
[junit4] 2> 966649 INFO (coreCloseExecutor-3951-thread-1) [ ] o.a.s.c.SolrCore [collection1] CLOSING SolrCore org.apache.solr.core.SolrCore@712ab80a
[junit4] 2> 966652 INFO (coreCloseExecutor-3951-thread-1) [ ] o.a.s.m.SolrMetricManager Closing metric reporters for registry=solr.core.collection1, tag=1898625034
[junit4] 2> 966652 INFO (TEST-TestDistributedSearch.test-seed#[79D9B9D16F81043A]) [ ] o.e.j.s.h.ContextHandler Stopped o.e.j.s.ServletContextHandler@1365fd82{/,null,UNAVAILABLE}
[junit4] 2> NOTE: reproduce with: ant test -Dtestcase=TestDistributedSearch -Dtests.method=test -Dtests.seed=79D9B9D16F81043A -Dtests.slow=true -Dtests.locale=en-SL -Dtests.timezone=Europe/Rome -Dtests.asserts=true -Dtests.file.encoding=US-ASCII
[junit4] FAILURE 54.2s J0 | TestDistributedSearch.test <<<
[junit4] > Throwable #1: java.lang.AssertionError: Expected to find shardAddress in the up shard info: {error=org.apache.solr.client.solrj.SolrServerException: Time allowed to handle this request exceeded,trace=org.apache.solr.client.solrj.SolrServerException: Time allowed to handle this request exceeded
[junit4] > at org.apache.solr.client.solrj.impl.LBHttpSolrClient.request(LBHttpSolrClient.java:460)
[junit4] > at org.apache.solr.handler.component.HttpShardHandlerFactory.makeLoadBalancedRequest(HttpShardHandlerFactory.java:273)
[junit4] > at org.apache.solr.handler.component.HttpShardHandler.lambda$submit$0(HttpShardHandler.java:175)
[junit4] > at java.base/java.util.concurrent.FutureTask.run(FutureTask.java:264)
[junit4] > at java.base/java.util.concurrent.Executors$RunnableAdapter.call(Executors.java:514)
[junit4] > at java.base/java.util.concurrent.FutureTask.run(FutureTask.java:264)
[junit4] > at com.codahale.metrics.InstrumentedExecutorService$InstrumentedRunnable.run(InstrumentedExecutorService.java:176)
[junit4] > at org.apache.solr.common.util.ExecutorUtil$MDCAwareThreadPoolExecutor.lambda$execute$0(ExecutorUtil.java:188)
[junit4] > at java.base/java.util.concurrent.ThreadPoolExecutor.runWorker(ThreadPoolExecutor.java:1161)
[junit4] > at java.base/java.util.concurrent.ThreadPoolExecutor$Worker.run(ThreadPoolExecutor.java:635)
[junit4] > at java.base/java.lang.Thread.run(Thread.java:844)
[junit4] > ,time=2}
[junit4] > at __randomizedtesting.SeedInfo.seed([79D9B9D16F81043A:F18D860BC17D69C2]:0)
[junit4] > at org.apache.solr.TestDistributedSearch.comparePartialResponses(TestDistributedSearch.java:1191)
[junit4] > at org.apache.solr.TestDistributedSearch.queryPartialResults(TestDistributedSearch.java:1132)
[junit4] > at org.apache.solr.TestDistributedSearch.test(TestDistributedSearch.java:992)
[junit4] > at java.base/jdk.internal.reflect.NativeMethodAccessorImpl.invoke0(Native Method)
[junit4] > at java.base/jdk.internal.reflect.NativeMethodAccessorImpl.invoke(NativeMethodAccessorImpl.java:62)
[junit4] > at java.base/jdk.internal.reflect.DelegatingMethodAccessorImpl.invoke(DelegatingMethodAccessorImpl.java:43)
[junit4] > at java.base/java.lang.reflect.Method.invoke(Method.java:564)
[junit4] > at org.apache.solr.BaseDistributedSearchTestCase$ShardsRepeatRule$ShardsRepeatStatement.callStatement(BaseDistributedSearchTestCase.java:1011)
[junit4] > at org.apache.solr.BaseDistributedSearchTestCase$ShardsRepeatRule$ShardsStatement.evaluate(BaseDistributedSearchTestCase.java:960)
[junit4] > at java.base/java.lang.Thread.run(Thread.java:844)
[junit4] 2> NOTE: leaving temporary files on disk at: C:\Users\jenkins\workspace\Lucene-Solr-7.x-Windows\solr\build\solr-core\test\J0\temp\solr.TestDistributedSearch_79D9B9D16F81043A-001
[junit4] 2> Jul 14, 2017 7:15:11 AM com.carrotsearch.randomizedtesting.ThreadLeakControl checkThreadLeaks
[junit4] 2> WARNING: Will linger awaiting termination of 1 leaked thread(s).
[junit4] 2> NOTE: test params are: codec=Asserting(Lucene70): {severity=PostingsFormat(name=Memory), foo_sev_enum=PostingsFormat(name=Memory), SubjectTerms_mfacet=PostingsFormat(name=Direct), multiDefault=PostingsFormat(name=LuceneVarGapDocFreqInterval), rnd_b=TestBloomFilteredLucenePostings(BloomFilteringPostingsFormat(Lucene50(blocksize=128))), a_s=PostingsFormat(name=Memory), oddField_s=TestBloomFilteredLucenePostings(BloomFilteringPostingsFormat(Lucene50(blocksize=128))), lowerfilt1and2=PostingsFormat(name=LuceneVarGapDocFreqInterval), a_t=PostingsFormat(name=LuceneVarGapDocFreqInterval), foo_b=PostingsFormat(name=Memory), lowerfilt=PostingsFormat(name=LuceneVarGapDocFreqInterval), id=TestBloomFilteredLucenePostings(BloomFilteringPostingsFormat(Lucene50(blocksize=128))), text=PostingsFormat(name=Memory)}, docValues:{other_tl1=DocValuesFormat(name=Lucene70), range_facet_l_dv=DocValuesFormat(name=Asserting), foo_sev_enum=DocValuesFormat(name=Memory), n_l1=DocValuesFormat(name=Direct), a_n_tdt=DocValuesFormat(name=Memory), intDefault=DocValuesFormat(name=Lucene70), n_dt1=DocValuesFormat(name=Lucene70), a_i1=DocValuesFormat(name=Direct), n_td1=DocValuesFormat(name=Lucene70), b_n_tdt=DocValuesFormat(name=Lucene70), n_d1=DocValuesFormat(name=Direct), range_facet_l=DocValuesFormat(name=Direct), n_f1=DocValuesFormat(name=Lucene70), n_ti1=DocValuesFormat(name=Asserting), n_tl1=DocValuesFormat(name=Lucene70), _version_=DocValuesFormat(name=Lucene70), n_tf1=DocValuesFormat(name=Direct), n_tdt1=DocValuesFormat(name=Lucene70), id_i1=DocValuesFormat(name=Lucene70), foo_d=DocValuesFormat(name=Asserting), range_facet_i_dv=DocValuesFormat(name=Direct), foo_f=DocValuesFormat(name=Memory), intDvoDefault=DocValuesFormat(name=Asserting), timestamp=DocValuesFormat(name=Direct)}, maxPointsInLeafNode=1888, maxMBSortInHeap=7.365805310874652, sim=RandomSimilarity(queryNorm=true): {}, locale=en-SL, timezone=Europe/Rome
[junit4] 2> NOTE: Windows 10 10.0 amd64/Oracle Corporation 9-ea (64-bit)/cpus=3,threads=1,free=346593696,total=494927872
[junit4] 2> NOTE: All tests run in this JVM: [TestReversedWildcardFilterFactory, MultiThreadedOCPTest, OverseerTaskQueueTest, MetricUtilsTest, SmileWriterTest, ScriptEngineTest, TestSweetSpotSimilarityFactory, ConfigSetsAPITest, TestDownShardTolerantSearch, IndexBasedSpellCheckerTest, SyncSliceTest, TestHdfsCloudBackupRestore, TestComplexPhraseLeadingWildcard, TestUpdate, VMParamsZkACLAndCredentialsProvidersTest, TestSubQueryTransformerDistrib, TestNumericRangeQuery64, TestDeleteCollectionOnDownNodes, TestSolrConfigHandler, CSVRequestHandlerTest, DistributedFacetPivotLongTailTest, TestSubQueryTransformer, TestSolrCoreParser, TestCSVResponseWriter, DirectSolrConnectionTest, TestPseudoReturnFields, PrimUtilsTest, RankQueryTest, TestPHPSerializedResponseWriter, UtilsToolTest, SharedFSAutoReplicaFailoverUtilsTest, SolrXmlInZkTest, HdfsWriteToMultipleCollectionsTest, SpatialRPTFieldTypeTest, DateMathParserTest, InfoHandlerTest, BlobRepositoryCloudTest, TestStressReorder, TestTrieFacet, TestXIncludeConfig, TestStressCloudBlindAtomicUpdates, IndexSchemaTest, SSLMigrationTest, DisMaxRequestHandlerTest, TestSolrQueryResponse, TestStressVersions, GraphQueryTest, CircularListTest, TestDFRSimilarityFactory, SoftAutoCommitTest, TestTolerantUpdateProcessorCloud, TestConfigOverlay, TestConfigsApi, RecoveryAfterSoftCommitTest, TestFunctionQuery, CoreAdminRequestStatusTest, TestBulkSchemaAPI, TestSolrCloudSnapshots, TestClusterStateMutator, PropertiesRequestHandlerTest, CollectionsAPISolrJTest, ShardSplitTest, SortByFunctionTest, OutOfBoxZkACLAndCredentialsProvidersTest, HighlighterMaxOffsetTest, TestUseDocValuesAsStored2, TestPayloadCheckQParserPlugin, SolrInfoBeanTest, XmlUpdateRequestHandlerTest, TestManagedSynonymFilterFactory, WrapperMergePolicyFactoryTest, TestXmlQParserPlugin, TestHighlightDedupGrouping, TestCustomSort, CollectionTooManyReplicasTest, TestClassicSimilarityFactory, SimplePostToolTest, AlternateDirectoryTest, PathHierarchyTokenizerFactoryTest, TestScoreJoinQPScore, HdfsNNFailoverTest, MinimalSchemaTest, TestExactStatsCache, DateRangeFieldTest, ResponseLogComponentTest, AnalysisErrorHandlingTest, ShufflingReplicaListTransformerTest, OverseerRolesTest, TestPhraseSuggestions, TestReqParamsAPI, TestUtils, TestQueryWrapperFilter, TestPrepRecovery, CoreAdminHandlerTest, QueryParsingTest, CloudMLTQParserTest, SegmentsInfoRequestHandlerTest, UUIDFieldTest, TestFieldTypeResource, TestBlobHandler, TestHashQParserPlugin, TestWriterPerf, SimpleFacetsTest, HighlighterConfigTest, TestCopyFieldCollectionResource, TestRandomDVFaceting, HdfsDirectoryTest, TestGroupingSearch, DefaultValueUpdateProcessorTest, TestCloudDeleteByQuery, TestSlowCompositeReaderWrapper, TestRecoveryHdfs, CdcrVersionReplicationTest, AtomicUpdatesTest, RAMDirectoryFactoryTest, DistributedSpellCheckComponentTest, RegexBoostProcessorTest, TestHdfsBackupRestoreCore, SuggesterWFSTTest, TestDistributedSearch]
[junit4] Completed [266/728 (1!)] on J0 in 54.52s, 1 test, 1 failure <<< FAILURES!
[...truncated 38073 lines...]
[JENKINS] Lucene-Solr-7.x-Windows (64bit/jdk1.8.0_131) - Build # 41
- Still Unstable!
Posted by Policeman Jenkins Server <je...@thetaphi.de>.
Build: https://jenkins.thetaphi.de/job/Lucene-Solr-7.x-Windows/41/
Java: 64bit/jdk1.8.0_131 -XX:+UseCompressedOops -XX:+UseConcMarkSweepGC
4 tests failed.
FAILED: org.apache.solr.cloud.OverseerRolesTest.testOverseerRole
Error Message:
Timed out waiting for overseer state change
Stack Trace:
java.lang.AssertionError: Timed out waiting for overseer state change
at __randomizedtesting.SeedInfo.seed([EA68968DD27CEB1A:BA36B19E9CFDDCB]:0)
at org.junit.Assert.fail(Assert.java:93)
at org.apache.solr.cloud.OverseerRolesTest.waitForNewOverseer(OverseerRolesTest.java:62)
at org.apache.solr.cloud.OverseerRolesTest.testOverseerRole(OverseerRolesTest.java:140)
at sun.reflect.NativeMethodAccessorImpl.invoke0(Native Method)
at sun.reflect.NativeMethodAccessorImpl.invoke(NativeMethodAccessorImpl.java:62)
at sun.reflect.DelegatingMethodAccessorImpl.invoke(DelegatingMethodAccessorImpl.java:43)
at java.lang.reflect.Method.invoke(Method.java:498)
at com.carrotsearch.randomizedtesting.RandomizedRunner.invoke(RandomizedRunner.java:1713)
at com.carrotsearch.randomizedtesting.RandomizedRunner$8.evaluate(RandomizedRunner.java:907)
at com.carrotsearch.randomizedtesting.RandomizedRunner$9.evaluate(RandomizedRunner.java:943)
at com.carrotsearch.randomizedtesting.RandomizedRunner$10.evaluate(RandomizedRunner.java:957)
at com.carrotsearch.randomizedtesting.rules.SystemPropertiesRestoreRule$1.evaluate(SystemPropertiesRestoreRule.java:57)
at org.apache.lucene.util.TestRuleSetupTeardownChained$1.evaluate(TestRuleSetupTeardownChained.java:49)
at org.apache.lucene.util.AbstractBeforeAfterRule$1.evaluate(AbstractBeforeAfterRule.java:45)
at org.apache.lucene.util.TestRuleThreadAndTestName$1.evaluate(TestRuleThreadAndTestName.java:48)
at org.apache.lucene.util.TestRuleIgnoreAfterMaxFailures$1.evaluate(TestRuleIgnoreAfterMaxFailures.java:64)
at org.apache.lucene.util.TestRuleMarkFailure$1.evaluate(TestRuleMarkFailure.java:47)
at com.carrotsearch.randomizedtesting.rules.StatementAdapter.evaluate(StatementAdapter.java:36)
at com.carrotsearch.randomizedtesting.ThreadLeakControl$StatementRunner.run(ThreadLeakControl.java:368)
at com.carrotsearch.randomizedtesting.ThreadLeakControl.forkTimeoutingTask(ThreadLeakControl.java:817)
at com.carrotsearch.randomizedtesting.ThreadLeakControl$3.evaluate(ThreadLeakControl.java:468)
at com.carrotsearch.randomizedtesting.RandomizedRunner.runSingleTest(RandomizedRunner.java:916)
at com.carrotsearch.randomizedtesting.RandomizedRunner$5.evaluate(RandomizedRunner.java:802)
at com.carrotsearch.randomizedtesting.RandomizedRunner$6.evaluate(RandomizedRunner.java:852)
at com.carrotsearch.randomizedtesting.RandomizedRunner$7.evaluate(RandomizedRunner.java:863)
at com.carrotsearch.randomizedtesting.rules.StatementAdapter.evaluate(StatementAdapter.java:36)
at com.carrotsearch.randomizedtesting.rules.SystemPropertiesRestoreRule$1.evaluate(SystemPropertiesRestoreRule.java:57)
at org.apache.lucene.util.AbstractBeforeAfterRule$1.evaluate(AbstractBeforeAfterRule.java:45)
at com.carrotsearch.randomizedtesting.rules.StatementAdapter.evaluate(StatementAdapter.java:36)
at org.apache.lucene.util.TestRuleStoreClassName$1.evaluate(TestRuleStoreClassName.java:41)
at com.carrotsearch.randomizedtesting.rules.NoShadowingOrOverridesOnMethodsRule$1.evaluate(NoShadowingOrOverridesOnMethodsRule.java:40)
at com.carrotsearch.randomizedtesting.rules.NoShadowingOrOverridesOnMethodsRule$1.evaluate(NoShadowingOrOverridesOnMethodsRule.java:40)
at com.carrotsearch.randomizedtesting.rules.StatementAdapter.evaluate(StatementAdapter.java:36)
at com.carrotsearch.randomizedtesting.rules.StatementAdapter.evaluate(StatementAdapter.java:36)
at com.carrotsearch.randomizedtesting.rules.StatementAdapter.evaluate(StatementAdapter.java:36)
at org.apache.lucene.util.TestRuleAssertionsRequired$1.evaluate(TestRuleAssertionsRequired.java:53)
at org.apache.lucene.util.TestRuleMarkFailure$1.evaluate(TestRuleMarkFailure.java:47)
at org.apache.lucene.util.TestRuleIgnoreAfterMaxFailures$1.evaluate(TestRuleIgnoreAfterMaxFailures.java:64)
at org.apache.lucene.util.TestRuleIgnoreTestSuites$1.evaluate(TestRuleIgnoreTestSuites.java:54)
at com.carrotsearch.randomizedtesting.rules.StatementAdapter.evaluate(StatementAdapter.java:36)
at com.carrotsearch.randomizedtesting.ThreadLeakControl$StatementRunner.run(ThreadLeakControl.java:368)
at java.lang.Thread.run(Thread.java:748)
FAILED: org.apache.solr.core.ExitableDirectoryReaderTest.testQueryResults
Error Message:
Should NOT have inserted partial results! expected:<5> but was:<6>
Stack Trace:
java.lang.AssertionError: Should NOT have inserted partial results! expected:<5> but was:<6>
at __randomizedtesting.SeedInfo.seed([EA68968DD27CEB1A:B7E1AEF47077B551]:0)
at org.junit.Assert.fail(Assert.java:93)
at org.junit.Assert.failNotEquals(Assert.java:647)
at org.junit.Assert.assertEquals(Assert.java:128)
at org.junit.Assert.assertEquals(Assert.java:472)
at org.apache.solr.core.ExitableDirectoryReaderTest.testQueryResults(ExitableDirectoryReaderTest.java:141)
at sun.reflect.NativeMethodAccessorImpl.invoke0(Native Method)
at sun.reflect.NativeMethodAccessorImpl.invoke(NativeMethodAccessorImpl.java:62)
at sun.reflect.DelegatingMethodAccessorImpl.invoke(DelegatingMethodAccessorImpl.java:43)
at java.lang.reflect.Method.invoke(Method.java:498)
at com.carrotsearch.randomizedtesting.RandomizedRunner.invoke(RandomizedRunner.java:1713)
at com.carrotsearch.randomizedtesting.RandomizedRunner$8.evaluate(RandomizedRunner.java:907)
at com.carrotsearch.randomizedtesting.RandomizedRunner$9.evaluate(RandomizedRunner.java:943)
at com.carrotsearch.randomizedtesting.RandomizedRunner$10.evaluate(RandomizedRunner.java:957)
at com.carrotsearch.randomizedtesting.rules.SystemPropertiesRestoreRule$1.evaluate(SystemPropertiesRestoreRule.java:57)
at org.apache.lucene.util.TestRuleSetupTeardownChained$1.evaluate(TestRuleSetupTeardownChained.java:49)
at org.apache.lucene.util.AbstractBeforeAfterRule$1.evaluate(AbstractBeforeAfterRule.java:45)
at org.apache.lucene.util.TestRuleThreadAndTestName$1.evaluate(TestRuleThreadAndTestName.java:48)
at org.apache.lucene.util.TestRuleIgnoreAfterMaxFailures$1.evaluate(TestRuleIgnoreAfterMaxFailures.java:64)
at org.apache.lucene.util.TestRuleMarkFailure$1.evaluate(TestRuleMarkFailure.java:47)
at com.carrotsearch.randomizedtesting.rules.StatementAdapter.evaluate(StatementAdapter.java:36)
at com.carrotsearch.randomizedtesting.ThreadLeakControl$StatementRunner.run(ThreadLeakControl.java:368)
at com.carrotsearch.randomizedtesting.ThreadLeakControl.forkTimeoutingTask(ThreadLeakControl.java:817)
at com.carrotsearch.randomizedtesting.ThreadLeakControl$3.evaluate(ThreadLeakControl.java:468)
at com.carrotsearch.randomizedtesting.RandomizedRunner.runSingleTest(RandomizedRunner.java:916)
at com.carrotsearch.randomizedtesting.RandomizedRunner$5.evaluate(RandomizedRunner.java:802)
at com.carrotsearch.randomizedtesting.RandomizedRunner$6.evaluate(RandomizedRunner.java:852)
at com.carrotsearch.randomizedtesting.RandomizedRunner$7.evaluate(RandomizedRunner.java:863)
at com.carrotsearch.randomizedtesting.rules.StatementAdapter.evaluate(StatementAdapter.java:36)
at com.carrotsearch.randomizedtesting.rules.SystemPropertiesRestoreRule$1.evaluate(SystemPropertiesRestoreRule.java:57)
at org.apache.lucene.util.AbstractBeforeAfterRule$1.evaluate(AbstractBeforeAfterRule.java:45)
at com.carrotsearch.randomizedtesting.rules.StatementAdapter.evaluate(StatementAdapter.java:36)
at org.apache.lucene.util.TestRuleStoreClassName$1.evaluate(TestRuleStoreClassName.java:41)
at com.carrotsearch.randomizedtesting.rules.NoShadowingOrOverridesOnMethodsRule$1.evaluate(NoShadowingOrOverridesOnMethodsRule.java:40)
at com.carrotsearch.randomizedtesting.rules.NoShadowingOrOverridesOnMethodsRule$1.evaluate(NoShadowingOrOverridesOnMethodsRule.java:40)
at com.carrotsearch.randomizedtesting.rules.StatementAdapter.evaluate(StatementAdapter.java:36)
at com.carrotsearch.randomizedtesting.rules.StatementAdapter.evaluate(StatementAdapter.java:36)
at com.carrotsearch.randomizedtesting.rules.StatementAdapter.evaluate(StatementAdapter.java:36)
at org.apache.lucene.util.TestRuleAssertionsRequired$1.evaluate(TestRuleAssertionsRequired.java:53)
at org.apache.lucene.util.TestRuleMarkFailure$1.evaluate(TestRuleMarkFailure.java:47)
at org.apache.lucene.util.TestRuleIgnoreAfterMaxFailures$1.evaluate(TestRuleIgnoreAfterMaxFailures.java:64)
at org.apache.lucene.util.TestRuleIgnoreTestSuites$1.evaluate(TestRuleIgnoreTestSuites.java:54)
at com.carrotsearch.randomizedtesting.rules.StatementAdapter.evaluate(StatementAdapter.java:36)
at com.carrotsearch.randomizedtesting.ThreadLeakControl$StatementRunner.run(ThreadLeakControl.java:368)
at java.lang.Thread.run(Thread.java:748)
FAILED: junit.framework.TestSuite.org.apache.solr.util.TestSolrCLIRunExample
Error Message:
ObjectTracker found 1 object(s) that were not released!!! [TransactionLog] org.apache.solr.common.util.ObjectReleaseTracker$ObjectTrackerException: org.apache.solr.update.TransactionLog at org.apache.solr.common.util.ObjectReleaseTracker.track(ObjectReleaseTracker.java:42) at org.apache.solr.update.TransactionLog.<init>(TransactionLog.java:190) at org.apache.solr.update.UpdateLog.newTransactionLog(UpdateLog.java:446) at org.apache.solr.update.UpdateLog.ensureLog(UpdateLog.java:1258) at org.apache.solr.update.UpdateLog.add(UpdateLog.java:532) at org.apache.solr.update.UpdateLog.add(UpdateLog.java:517) at org.apache.solr.update.DirectUpdateHandler2.doNormalUpdate(DirectUpdateHandler2.java:347) at org.apache.solr.update.DirectUpdateHandler2.addDoc0(DirectUpdateHandler2.java:266) at org.apache.solr.update.DirectUpdateHandler2.addDoc(DirectUpdateHandler2.java:216) at org.apache.solr.update.processor.RunUpdateProcessor.processAdd(RunUpdateProcessorFactory.java:67) at org.apache.solr.update.processor.UpdateRequestProcessor.processAdd(UpdateRequestProcessor.java:55) at org.apache.solr.update.processor.DistributedUpdateProcessor.doLocalAdd(DistributedUpdateProcessor.java:990) at org.apache.solr.update.processor.DistributedUpdateProcessor.versionAdd(DistributedUpdateProcessor.java:1206) at org.apache.solr.update.processor.DistributedUpdateProcessor.processAdd(DistributedUpdateProcessor.java:752) at org.apache.solr.update.processor.LogUpdateProcessorFactory$LogUpdateProcessor.processAdd(LogUpdateProcessorFactory.java:103) at org.apache.solr.update.processor.UpdateRequestProcessor.processAdd(UpdateRequestProcessor.java:55) at org.apache.solr.update.processor.AddSchemaFieldsUpdateProcessorFactory$AddSchemaFieldsUpdateProcessor.processAdd(AddSchemaFieldsUpdateProcessorFactory.java:474) at org.apache.solr.update.processor.UpdateRequestProcessor.processAdd(UpdateRequestProcessor.java:55) at org.apache.solr.update.processor.FieldMutatingUpdateProcessor.processAdd(FieldMutatingUpdateProcessor.java:118) at org.apache.solr.update.processor.UpdateRequestProcessor.processAdd(UpdateRequestProcessor.java:55) at org.apache.solr.update.processor.FieldMutatingUpdateProcessor.processAdd(FieldMutatingUpdateProcessor.java:118) at org.apache.solr.update.processor.UpdateRequestProcessor.processAdd(UpdateRequestProcessor.java:55) at org.apache.solr.update.processor.FieldMutatingUpdateProcessor.processAdd(FieldMutatingUpdateProcessor.java:118) at org.apache.solr.update.processor.UpdateRequestProcessor.processAdd(UpdateRequestProcessor.java:55) at org.apache.solr.update.processor.FieldMutatingUpdateProcessor.processAdd(FieldMutatingUpdateProcessor.java:118) at org.apache.solr.update.processor.UpdateRequestProcessor.processAdd(UpdateRequestProcessor.java:55) at org.apache.solr.update.processor.FieldNameMutatingUpdateProcessorFactory$1.processAdd(FieldNameMutatingUpdateProcessorFactory.java:74) at org.apache.solr.update.processor.UpdateRequestProcessor.processAdd(UpdateRequestProcessor.java:55) at org.apache.solr.update.processor.FieldMutatingUpdateProcessor.processAdd(FieldMutatingUpdateProcessor.java:118) at org.apache.solr.update.processor.UpdateRequestProcessor.processAdd(UpdateRequestProcessor.java:55) at org.apache.solr.update.processor.AbstractDefaultValueUpdateProcessorFactory$DefaultValueUpdateProcessor.processAdd(AbstractDefaultValueUpdateProcessorFactory.java:91) at org.apache.solr.handler.loader.JavabinLoader$1.update(JavabinLoader.java:98) at org.apache.solr.client.solrj.request.JavaBinUpdateRequestCodec$1.readOuterMostDocIterator(JavaBinUpdateRequestCodec.java:188) at org.apache.solr.client.solrj.request.JavaBinUpdateRequestCodec$1.readIterator(JavaBinUpdateRequestCodec.java:144) at org.apache.solr.common.util.JavaBinCodec.readObject(JavaBinCodec.java:311) at org.apache.solr.common.util.JavaBinCodec.readVal(JavaBinCodec.java:256) at org.apache.solr.client.solrj.request.JavaBinUpdateRequestCodec$1.readNamedList(JavaBinUpdateRequestCodec.java:130) at org.apache.solr.common.util.JavaBinCodec.readObject(JavaBinCodec.java:276) at org.apache.solr.common.util.JavaBinCodec.readVal(JavaBinCodec.java:256) at org.apache.solr.common.util.JavaBinCodec.unmarshal(JavaBinCodec.java:178) at org.apache.solr.client.solrj.request.JavaBinUpdateRequestCodec.unmarshal(JavaBinUpdateRequestCodec.java:195) at org.apache.solr.handler.loader.JavabinLoader.parseAndLoadDocs(JavabinLoader.java:108) at org.apache.solr.handler.loader.JavabinLoader.load(JavabinLoader.java:55) at org.apache.solr.handler.UpdateRequestHandler$1.load(UpdateRequestHandler.java:97) at org.apache.solr.handler.ContentStreamHandlerBase.handleRequestBody(ContentStreamHandlerBase.java:68) at org.apache.solr.handler.RequestHandlerBase.handleRequest(RequestHandlerBase.java:177) at org.apache.solr.core.SolrCore.execute(SolrCore.java:2473) at org.apache.solr.servlet.HttpSolrCall.execute(HttpSolrCall.java:720) at org.apache.solr.servlet.HttpSolrCall.call(HttpSolrCall.java:526) at org.apache.solr.servlet.SolrDispatchFilter.doFilter(SolrDispatchFilter.java:378) at org.apache.solr.servlet.SolrDispatchFilter.doFilter(SolrDispatchFilter.java:322) at org.eclipse.jetty.servlet.ServletHandler$CachedChain.doFilter(ServletHandler.java:1699) at org.apache.solr.client.solrj.embedded.JettySolrRunner$DebugFilter.doFilter(JettySolrRunner.java:139) at org.eclipse.jetty.servlet.ServletHandler$CachedChain.doFilter(ServletHandler.java:1699) at org.eclipse.jetty.servlet.ServletHandler.doHandle(ServletHandler.java:582) at org.eclipse.jetty.server.session.SessionHandler.doHandle(SessionHandler.java:224) at org.eclipse.jetty.server.handler.ContextHandler.doHandle(ContextHandler.java:1180) at org.eclipse.jetty.servlet.ServletHandler.doScope(ServletHandler.java:512) at org.eclipse.jetty.server.session.SessionHandler.doScope(SessionHandler.java:185) at org.eclipse.jetty.server.handler.ContextHandler.doScope(ContextHandler.java:1112) at org.eclipse.jetty.server.handler.ScopedHandler.handle(ScopedHandler.java:141) at org.eclipse.jetty.server.handler.gzip.GzipHandler.handle(GzipHandler.java:395) at org.eclipse.jetty.server.handler.HandlerWrapper.handle(HandlerWrapper.java:134) at org.eclipse.jetty.server.Server.handle(Server.java:534) at org.eclipse.jetty.server.HttpChannel.handle(HttpChannel.java:320) at org.eclipse.jetty.server.HttpConnection.onFillable(HttpConnection.java:251) at org.eclipse.jetty.io.AbstractConnection$ReadCallback.succeeded(AbstractConnection.java:273) at org.eclipse.jetty.io.FillInterest.fillable(FillInterest.java:95) at org.eclipse.jetty.io.SelectChannelEndPoint$2.run(SelectChannelEndPoint.java:93) at org.eclipse.jetty.util.thread.strategy.ExecuteProduceConsume.executeProduceConsume(ExecuteProduceConsume.java:303) at org.eclipse.jetty.util.thread.strategy.ExecuteProduceConsume.produceConsume(ExecuteProduceConsume.java:148) at org.eclipse.jetty.util.thread.strategy.ExecuteProduceConsume.run(ExecuteProduceConsume.java:136) at org.eclipse.jetty.util.thread.QueuedThreadPool.runJob(QueuedThreadPool.java:671) at org.eclipse.jetty.util.thread.QueuedThreadPool$2.run(QueuedThreadPool.java:589) at java.lang.Thread.run(Thread.java:748)
Stack Trace:
java.lang.AssertionError: ObjectTracker found 1 object(s) that were not released!!! [TransactionLog]
org.apache.solr.common.util.ObjectReleaseTracker$ObjectTrackerException: org.apache.solr.update.TransactionLog
at org.apache.solr.common.util.ObjectReleaseTracker.track(ObjectReleaseTracker.java:42)
at org.apache.solr.update.TransactionLog.<init>(TransactionLog.java:190)
at org.apache.solr.update.UpdateLog.newTransactionLog(UpdateLog.java:446)
at org.apache.solr.update.UpdateLog.ensureLog(UpdateLog.java:1258)
at org.apache.solr.update.UpdateLog.add(UpdateLog.java:532)
at org.apache.solr.update.UpdateLog.add(UpdateLog.java:517)
at org.apache.solr.update.DirectUpdateHandler2.doNormalUpdate(DirectUpdateHandler2.java:347)
at org.apache.solr.update.DirectUpdateHandler2.addDoc0(DirectUpdateHandler2.java:266)
at org.apache.solr.update.DirectUpdateHandler2.addDoc(DirectUpdateHandler2.java:216)
at org.apache.solr.update.processor.RunUpdateProcessor.processAdd(RunUpdateProcessorFactory.java:67)
at org.apache.solr.update.processor.UpdateRequestProcessor.processAdd(UpdateRequestProcessor.java:55)
at org.apache.solr.update.processor.DistributedUpdateProcessor.doLocalAdd(DistributedUpdateProcessor.java:990)
at org.apache.solr.update.processor.DistributedUpdateProcessor.versionAdd(DistributedUpdateProcessor.java:1206)
at org.apache.solr.update.processor.DistributedUpdateProcessor.processAdd(DistributedUpdateProcessor.java:752)
at org.apache.solr.update.processor.LogUpdateProcessorFactory$LogUpdateProcessor.processAdd(LogUpdateProcessorFactory.java:103)
at org.apache.solr.update.processor.UpdateRequestProcessor.processAdd(UpdateRequestProcessor.java:55)
at org.apache.solr.update.processor.AddSchemaFieldsUpdateProcessorFactory$AddSchemaFieldsUpdateProcessor.processAdd(AddSchemaFieldsUpdateProcessorFactory.java:474)
at org.apache.solr.update.processor.UpdateRequestProcessor.processAdd(UpdateRequestProcessor.java:55)
at org.apache.solr.update.processor.FieldMutatingUpdateProcessor.processAdd(FieldMutatingUpdateProcessor.java:118)
at org.apache.solr.update.processor.UpdateRequestProcessor.processAdd(UpdateRequestProcessor.java:55)
at org.apache.solr.update.processor.FieldMutatingUpdateProcessor.processAdd(FieldMutatingUpdateProcessor.java:118)
at org.apache.solr.update.processor.UpdateRequestProcessor.processAdd(UpdateRequestProcessor.java:55)
at org.apache.solr.update.processor.FieldMutatingUpdateProcessor.processAdd(FieldMutatingUpdateProcessor.java:118)
at org.apache.solr.update.processor.UpdateRequestProcessor.processAdd(UpdateRequestProcessor.java:55)
at org.apache.solr.update.processor.FieldMutatingUpdateProcessor.processAdd(FieldMutatingUpdateProcessor.java:118)
at org.apache.solr.update.processor.UpdateRequestProcessor.processAdd(UpdateRequestProcessor.java:55)
at org.apache.solr.update.processor.FieldNameMutatingUpdateProcessorFactory$1.processAdd(FieldNameMutatingUpdateProcessorFactory.java:74)
at org.apache.solr.update.processor.UpdateRequestProcessor.processAdd(UpdateRequestProcessor.java:55)
at org.apache.solr.update.processor.FieldMutatingUpdateProcessor.processAdd(FieldMutatingUpdateProcessor.java:118)
at org.apache.solr.update.processor.UpdateRequestProcessor.processAdd(UpdateRequestProcessor.java:55)
at org.apache.solr.update.processor.AbstractDefaultValueUpdateProcessorFactory$DefaultValueUpdateProcessor.processAdd(AbstractDefaultValueUpdateProcessorFactory.java:91)
at org.apache.solr.handler.loader.JavabinLoader$1.update(JavabinLoader.java:98)
at org.apache.solr.client.solrj.request.JavaBinUpdateRequestCodec$1.readOuterMostDocIterator(JavaBinUpdateRequestCodec.java:188)
at org.apache.solr.client.solrj.request.JavaBinUpdateRequestCodec$1.readIterator(JavaBinUpdateRequestCodec.java:144)
at org.apache.solr.common.util.JavaBinCodec.readObject(JavaBinCodec.java:311)
at org.apache.solr.common.util.JavaBinCodec.readVal(JavaBinCodec.java:256)
at org.apache.solr.client.solrj.request.JavaBinUpdateRequestCodec$1.readNamedList(JavaBinUpdateRequestCodec.java:130)
at org.apache.solr.common.util.JavaBinCodec.readObject(JavaBinCodec.java:276)
at org.apache.solr.common.util.JavaBinCodec.readVal(JavaBinCodec.java:256)
at org.apache.solr.common.util.JavaBinCodec.unmarshal(JavaBinCodec.java:178)
at org.apache.solr.client.solrj.request.JavaBinUpdateRequestCodec.unmarshal(JavaBinUpdateRequestCodec.java:195)
at org.apache.solr.handler.loader.JavabinLoader.parseAndLoadDocs(JavabinLoader.java:108)
at org.apache.solr.handler.loader.JavabinLoader.load(JavabinLoader.java:55)
at org.apache.solr.handler.UpdateRequestHandler$1.load(UpdateRequestHandler.java:97)
at org.apache.solr.handler.ContentStreamHandlerBase.handleRequestBody(ContentStreamHandlerBase.java:68)
at org.apache.solr.handler.RequestHandlerBase.handleRequest(RequestHandlerBase.java:177)
at org.apache.solr.core.SolrCore.execute(SolrCore.java:2473)
at org.apache.solr.servlet.HttpSolrCall.execute(HttpSolrCall.java:720)
at org.apache.solr.servlet.HttpSolrCall.call(HttpSolrCall.java:526)
at org.apache.solr.servlet.SolrDispatchFilter.doFilter(SolrDispatchFilter.java:378)
at org.apache.solr.servlet.SolrDispatchFilter.doFilter(SolrDispatchFilter.java:322)
at org.eclipse.jetty.servlet.ServletHandler$CachedChain.doFilter(ServletHandler.java:1699)
at org.apache.solr.client.solrj.embedded.JettySolrRunner$DebugFilter.doFilter(JettySolrRunner.java:139)
at org.eclipse.jetty.servlet.ServletHandler$CachedChain.doFilter(ServletHandler.java:1699)
at org.eclipse.jetty.servlet.ServletHandler.doHandle(ServletHandler.java:582)
at org.eclipse.jetty.server.session.SessionHandler.doHandle(SessionHandler.java:224)
at org.eclipse.jetty.server.handler.ContextHandler.doHandle(ContextHandler.java:1180)
at org.eclipse.jetty.servlet.ServletHandler.doScope(ServletHandler.java:512)
at org.eclipse.jetty.server.session.SessionHandler.doScope(SessionHandler.java:185)
at org.eclipse.jetty.server.handler.ContextHandler.doScope(ContextHandler.java:1112)
at org.eclipse.jetty.server.handler.ScopedHandler.handle(ScopedHandler.java:141)
at org.eclipse.jetty.server.handler.gzip.GzipHandler.handle(GzipHandler.java:395)
at org.eclipse.jetty.server.handler.HandlerWrapper.handle(HandlerWrapper.java:134)
at org.eclipse.jetty.server.Server.handle(Server.java:534)
at org.eclipse.jetty.server.HttpChannel.handle(HttpChannel.java:320)
at org.eclipse.jetty.server.HttpConnection.onFillable(HttpConnection.java:251)
at org.eclipse.jetty.io.AbstractConnection$ReadCallback.succeeded(AbstractConnection.java:273)
at org.eclipse.jetty.io.FillInterest.fillable(FillInterest.java:95)
at org.eclipse.jetty.io.SelectChannelEndPoint$2.run(SelectChannelEndPoint.java:93)
at org.eclipse.jetty.util.thread.strategy.ExecuteProduceConsume.executeProduceConsume(ExecuteProduceConsume.java:303)
at org.eclipse.jetty.util.thread.strategy.ExecuteProduceConsume.produceConsume(ExecuteProduceConsume.java:148)
at org.eclipse.jetty.util.thread.strategy.ExecuteProduceConsume.run(ExecuteProduceConsume.java:136)
at org.eclipse.jetty.util.thread.QueuedThreadPool.runJob(QueuedThreadPool.java:671)
at org.eclipse.jetty.util.thread.QueuedThreadPool$2.run(QueuedThreadPool.java:589)
at java.lang.Thread.run(Thread.java:748)
at __randomizedtesting.SeedInfo.seed([EA68968DD27CEB1A]:0)
at org.junit.Assert.fail(Assert.java:93)
at org.junit.Assert.assertTrue(Assert.java:43)
at org.junit.Assert.assertNull(Assert.java:551)
at org.apache.solr.SolrTestCaseJ4.teardownTestCases(SolrTestCaseJ4.java:296)
at sun.reflect.GeneratedMethodAccessor32.invoke(Unknown Source)
at sun.reflect.DelegatingMethodAccessorImpl.invoke(DelegatingMethodAccessorImpl.java:43)
at java.lang.reflect.Method.invoke(Method.java:498)
at com.carrotsearch.randomizedtesting.RandomizedRunner.invoke(RandomizedRunner.java:1713)
at com.carrotsearch.randomizedtesting.RandomizedRunner$7.evaluate(RandomizedRunner.java:870)
at com.carrotsearch.randomizedtesting.rules.StatementAdapter.evaluate(StatementAdapter.java:36)
at com.carrotsearch.randomizedtesting.rules.SystemPropertiesRestoreRule$1.evaluate(SystemPropertiesRestoreRule.java:57)
at org.apache.lucene.util.AbstractBeforeAfterRule$1.evaluate(AbstractBeforeAfterRule.java:45)
at com.carrotsearch.randomizedtesting.rules.StatementAdapter.evaluate(StatementAdapter.java:36)
at org.apache.lucene.util.TestRuleStoreClassName$1.evaluate(TestRuleStoreClassName.java:41)
at com.carrotsearch.randomizedtesting.rules.NoShadowingOrOverridesOnMethodsRule$1.evaluate(NoShadowingOrOverridesOnMethodsRule.java:40)
at com.carrotsearch.randomizedtesting.rules.NoShadowingOrOverridesOnMethodsRule$1.evaluate(NoShadowingOrOverridesOnMethodsRule.java:40)
at com.carrotsearch.randomizedtesting.rules.StatementAdapter.evaluate(StatementAdapter.java:36)
at com.carrotsearch.randomizedtesting.rules.StatementAdapter.evaluate(StatementAdapter.java:36)
at com.carrotsearch.randomizedtesting.rules.StatementAdapter.evaluate(StatementAdapter.java:36)
at org.apache.lucene.util.TestRuleAssertionsRequired$1.evaluate(TestRuleAssertionsRequired.java:53)
at org.apache.lucene.util.TestRuleMarkFailure$1.evaluate(TestRuleMarkFailure.java:47)
at org.apache.lucene.util.TestRuleIgnoreAfterMaxFailures$1.evaluate(TestRuleIgnoreAfterMaxFailures.java:64)
at org.apache.lucene.util.TestRuleIgnoreTestSuites$1.evaluate(TestRuleIgnoreTestSuites.java:54)
at com.carrotsearch.randomizedtesting.rules.StatementAdapter.evaluate(StatementAdapter.java:36)
at com.carrotsearch.randomizedtesting.ThreadLeakControl$StatementRunner.run(ThreadLeakControl.java:368)
at java.lang.Thread.run(Thread.java:748)
FAILED: junit.framework.TestSuite.org.apache.solr.util.TestSolrCLIRunExample
Error Message:
Could not remove the following files (in the order of attempts): C:\Users\jenkins\workspace\Lucene-Solr-7.x-Windows\solr\build\solr-core\test\J1\temp\solr.util.TestSolrCLIRunExample_EA68968DD27CEB1A-001\tempDir-004\node1\testCloudExamplePrompt_shard1_replica_n2\data\tlog\tlog.0000000000000000000: java.nio.file.FileSystemException: C:\Users\jenkins\workspace\Lucene-Solr-7.x-Windows\solr\build\solr-core\test\J1\temp\solr.util.TestSolrCLIRunExample_EA68968DD27CEB1A-001\tempDir-004\node1\testCloudExamplePrompt_shard1_replica_n2\data\tlog\tlog.0000000000000000000: The process cannot access the file because it is being used by another process. C:\Users\jenkins\workspace\Lucene-Solr-7.x-Windows\solr\build\solr-core\test\J1\temp\solr.util.TestSolrCLIRunExample_EA68968DD27CEB1A-001\tempDir-004\node1\testCloudExamplePrompt_shard1_replica_n2\data\tlog: java.nio.file.DirectoryNotEmptyException: C:\Users\jenkins\workspace\Lucene-Solr-7.x-Windows\solr\build\solr-core\test\J1\temp\solr.util.TestSolrCLIRunExample_EA68968DD27CEB1A-001\tempDir-004\node1\testCloudExamplePrompt_shard1_replica_n2\data\tlog C:\Users\jenkins\workspace\Lucene-Solr-7.x-Windows\solr\build\solr-core\test\J1\temp\solr.util.TestSolrCLIRunExample_EA68968DD27CEB1A-001\tempDir-004\node1\testCloudExamplePrompt_shard1_replica_n2\data: java.nio.file.DirectoryNotEmptyException: C:\Users\jenkins\workspace\Lucene-Solr-7.x-Windows\solr\build\solr-core\test\J1\temp\solr.util.TestSolrCLIRunExample_EA68968DD27CEB1A-001\tempDir-004\node1\testCloudExamplePrompt_shard1_replica_n2\data C:\Users\jenkins\workspace\Lucene-Solr-7.x-Windows\solr\build\solr-core\test\J1\temp\solr.util.TestSolrCLIRunExample_EA68968DD27CEB1A-001\tempDir-004\node1\testCloudExamplePrompt_shard1_replica_n2: java.nio.file.DirectoryNotEmptyException: C:\Users\jenkins\workspace\Lucene-Solr-7.x-Windows\solr\build\solr-core\test\J1\temp\solr.util.TestSolrCLIRunExample_EA68968DD27CEB1A-001\tempDir-004\node1\testCloudExamplePrompt_shard1_replica_n2 C:\Users\jenkins\workspace\Lucene-Solr-7.x-Windows\solr\build\solr-core\test\J1\temp\solr.util.TestSolrCLIRunExample_EA68968DD27CEB1A-001\tempDir-004\node1: java.nio.file.DirectoryNotEmptyException: C:\Users\jenkins\workspace\Lucene-Solr-7.x-Windows\solr\build\solr-core\test\J1\temp\solr.util.TestSolrCLIRunExample_EA68968DD27CEB1A-001\tempDir-004\node1 C:\Users\jenkins\workspace\Lucene-Solr-7.x-Windows\solr\build\solr-core\test\J1\temp\solr.util.TestSolrCLIRunExample_EA68968DD27CEB1A-001\tempDir-004: java.nio.file.DirectoryNotEmptyException: C:\Users\jenkins\workspace\Lucene-Solr-7.x-Windows\solr\build\solr-core\test\J1\temp\solr.util.TestSolrCLIRunExample_EA68968DD27CEB1A-001\tempDir-004 C:\Users\jenkins\workspace\Lucene-Solr-7.x-Windows\solr\build\solr-core\test\J1\temp\solr.util.TestSolrCLIRunExample_EA68968DD27CEB1A-001: java.nio.file.DirectoryNotEmptyException: C:\Users\jenkins\workspace\Lucene-Solr-7.x-Windows\solr\build\solr-core\test\J1\temp\solr.util.TestSolrCLIRunExample_EA68968DD27CEB1A-001
Stack Trace:
java.io.IOException: Could not remove the following files (in the order of attempts):
C:\Users\jenkins\workspace\Lucene-Solr-7.x-Windows\solr\build\solr-core\test\J1\temp\solr.util.TestSolrCLIRunExample_EA68968DD27CEB1A-001\tempDir-004\node1\testCloudExamplePrompt_shard1_replica_n2\data\tlog\tlog.0000000000000000000: java.nio.file.FileSystemException: C:\Users\jenkins\workspace\Lucene-Solr-7.x-Windows\solr\build\solr-core\test\J1\temp\solr.util.TestSolrCLIRunExample_EA68968DD27CEB1A-001\tempDir-004\node1\testCloudExamplePrompt_shard1_replica_n2\data\tlog\tlog.0000000000000000000: The process cannot access the file because it is being used by another process.
C:\Users\jenkins\workspace\Lucene-Solr-7.x-Windows\solr\build\solr-core\test\J1\temp\solr.util.TestSolrCLIRunExample_EA68968DD27CEB1A-001\tempDir-004\node1\testCloudExamplePrompt_shard1_replica_n2\data\tlog: java.nio.file.DirectoryNotEmptyException: C:\Users\jenkins\workspace\Lucene-Solr-7.x-Windows\solr\build\solr-core\test\J1\temp\solr.util.TestSolrCLIRunExample_EA68968DD27CEB1A-001\tempDir-004\node1\testCloudExamplePrompt_shard1_replica_n2\data\tlog
C:\Users\jenkins\workspace\Lucene-Solr-7.x-Windows\solr\build\solr-core\test\J1\temp\solr.util.TestSolrCLIRunExample_EA68968DD27CEB1A-001\tempDir-004\node1\testCloudExamplePrompt_shard1_replica_n2\data: java.nio.file.DirectoryNotEmptyException: C:\Users\jenkins\workspace\Lucene-Solr-7.x-Windows\solr\build\solr-core\test\J1\temp\solr.util.TestSolrCLIRunExample_EA68968DD27CEB1A-001\tempDir-004\node1\testCloudExamplePrompt_shard1_replica_n2\data
C:\Users\jenkins\workspace\Lucene-Solr-7.x-Windows\solr\build\solr-core\test\J1\temp\solr.util.TestSolrCLIRunExample_EA68968DD27CEB1A-001\tempDir-004\node1\testCloudExamplePrompt_shard1_replica_n2: java.nio.file.DirectoryNotEmptyException: C:\Users\jenkins\workspace\Lucene-Solr-7.x-Windows\solr\build\solr-core\test\J1\temp\solr.util.TestSolrCLIRunExample_EA68968DD27CEB1A-001\tempDir-004\node1\testCloudExamplePrompt_shard1_replica_n2
C:\Users\jenkins\workspace\Lucene-Solr-7.x-Windows\solr\build\solr-core\test\J1\temp\solr.util.TestSolrCLIRunExample_EA68968DD27CEB1A-001\tempDir-004\node1: java.nio.file.DirectoryNotEmptyException: C:\Users\jenkins\workspace\Lucene-Solr-7.x-Windows\solr\build\solr-core\test\J1\temp\solr.util.TestSolrCLIRunExample_EA68968DD27CEB1A-001\tempDir-004\node1
C:\Users\jenkins\workspace\Lucene-Solr-7.x-Windows\solr\build\solr-core\test\J1\temp\solr.util.TestSolrCLIRunExample_EA68968DD27CEB1A-001\tempDir-004: java.nio.file.DirectoryNotEmptyException: C:\Users\jenkins\workspace\Lucene-Solr-7.x-Windows\solr\build\solr-core\test\J1\temp\solr.util.TestSolrCLIRunExample_EA68968DD27CEB1A-001\tempDir-004
C:\Users\jenkins\workspace\Lucene-Solr-7.x-Windows\solr\build\solr-core\test\J1\temp\solr.util.TestSolrCLIRunExample_EA68968DD27CEB1A-001: java.nio.file.DirectoryNotEmptyException: C:\Users\jenkins\workspace\Lucene-Solr-7.x-Windows\solr\build\solr-core\test\J1\temp\solr.util.TestSolrCLIRunExample_EA68968DD27CEB1A-001
at org.apache.lucene.util.IOUtils.rm(IOUtils.java:329)
at org.apache.lucene.util.TestRuleTemporaryFilesCleanup.afterAlways(TestRuleTemporaryFilesCleanup.java:216)
at com.carrotsearch.randomizedtesting.rules.TestRuleAdapter$1.afterAlways(TestRuleAdapter.java:31)
at com.carrotsearch.randomizedtesting.rules.StatementAdapter.evaluate(StatementAdapter.java:43)
at com.carrotsearch.randomizedtesting.rules.StatementAdapter.evaluate(StatementAdapter.java:36)
at org.apache.lucene.util.TestRuleAssertionsRequired$1.evaluate(TestRuleAssertionsRequired.java:53)
at org.apache.lucene.util.TestRuleMarkFailure$1.evaluate(TestRuleMarkFailure.java:47)
at org.apache.lucene.util.TestRuleIgnoreAfterMaxFailures$1.evaluate(TestRuleIgnoreAfterMaxFailures.java:64)
at org.apache.lucene.util.TestRuleIgnoreTestSuites$1.evaluate(TestRuleIgnoreTestSuites.java:54)
at com.carrotsearch.randomizedtesting.rules.StatementAdapter.evaluate(StatementAdapter.java:36)
at com.carrotsearch.randomizedtesting.ThreadLeakControl$StatementRunner.run(ThreadLeakControl.java:368)
at java.lang.Thread.run(Thread.java:748)
Build Log:
[...truncated 11476 lines...]
[junit4] Suite: org.apache.solr.cloud.OverseerRolesTest
[junit4] 2> Creating dataDir: C:\Users\jenkins\workspace\Lucene-Solr-7.x-Windows\solr\build\solr-core\test\J0\temp\solr.cloud.OverseerRolesTest_EA68968DD27CEB1A-001\init-core-data-001
[junit4] 2> 791133 WARN (SUITE-OverseerRolesTest-seed#[EA68968DD27CEB1A]-worker) [ ] o.a.s.SolrTestCaseJ4 startTrackingSearchers: numOpens=3 numCloses=3
[junit4] 2> 791133 INFO (SUITE-OverseerRolesTest-seed#[EA68968DD27CEB1A]-worker) [ ] o.a.s.SolrTestCaseJ4 Using TrieFields (NUMERIC_POINTS_SYSPROP=false) w/NUMERIC_DOCVALUES_SYSPROP=false
[junit4] 2> 791136 INFO (SUITE-OverseerRolesTest-seed#[EA68968DD27CEB1A]-worker) [ ] o.a.s.SolrTestCaseJ4 Randomized ssl (false) and clientAuth (false) via: @org.apache.solr.util.RandomizeSSL(reason=, value=NaN, ssl=NaN, clientAuth=NaN)
[junit4] 2> 791137 INFO (SUITE-OverseerRolesTest-seed#[EA68968DD27CEB1A]-worker) [ ] o.a.s.c.MiniSolrCloudCluster Starting cluster of 4 servers in C:\Users\jenkins\workspace\Lucene-Solr-7.x-Windows\solr\build\solr-core\test\J0\temp\solr.cloud.OverseerRolesTest_EA68968DD27CEB1A-001\tempDir-001
[junit4] 2> 791137 INFO (SUITE-OverseerRolesTest-seed#[EA68968DD27CEB1A]-worker) [ ] o.a.s.c.ZkTestServer STARTING ZK TEST SERVER
[junit4] 2> 791137 INFO (Thread-2023) [ ] o.a.s.c.ZkTestServer client port:0.0.0.0/0.0.0.0:0
[junit4] 2> 791137 INFO (Thread-2023) [ ] o.a.s.c.ZkTestServer Starting server
[junit4] 2> 791141 ERROR (Thread-2023) [ ] o.a.z.s.ZooKeeperServer ZKShutdownHandler is not registered, so ZooKeeper server won't take any action on ERROR or SHUTDOWN server state changes
[junit4] 2> 791238 INFO (SUITE-OverseerRolesTest-seed#[EA68968DD27CEB1A]-worker) [ ] o.a.s.c.ZkTestServer start zk server on port:52252
[junit4] 2> 791246 INFO (jetty-launcher-1970-thread-1) [ ] o.e.j.s.Server jetty-9.3.14.v20161028
[junit4] 2> 791246 INFO (jetty-launcher-1970-thread-4) [ ] o.e.j.s.Server jetty-9.3.14.v20161028
[junit4] 2> 791246 INFO (jetty-launcher-1970-thread-2) [ ] o.e.j.s.Server jetty-9.3.14.v20161028
[junit4] 2> 791247 INFO (jetty-launcher-1970-thread-1) [ ] o.e.j.s.h.ContextHandler Started o.e.j.s.ServletContextHandler@59c2e19a{/solr,null,AVAILABLE}
[junit4] 2> 791247 INFO (jetty-launcher-1970-thread-3) [ ] o.e.j.s.Server jetty-9.3.14.v20161028
[junit4] 2> 791247 INFO (jetty-launcher-1970-thread-2) [ ] o.e.j.s.h.ContextHandler Started o.e.j.s.ServletContextHandler@6fec3ece{/solr,null,AVAILABLE}
[junit4] 2> 791247 INFO (jetty-launcher-1970-thread-3) [ ] o.e.j.s.h.ContextHandler Started o.e.j.s.ServletContextHandler@4f0a8ea4{/solr,null,AVAILABLE}
[junit4] 2> 791247 INFO (jetty-launcher-1970-thread-1) [ ] o.e.j.s.AbstractConnector Started ServerConnector@3b2aba81{HTTP/1.1,[http/1.1]}{127.0.0.1:52256}
[junit4] 2> 791247 INFO (jetty-launcher-1970-thread-2) [ ] o.e.j.s.AbstractConnector Started ServerConnector@78d03dfe{HTTP/1.1,[http/1.1]}{127.0.0.1:52258}
[junit4] 2> 791247 INFO (jetty-launcher-1970-thread-1) [ ] o.e.j.s.Server Started @808281ms
[junit4] 2> 791247 INFO (jetty-launcher-1970-thread-2) [ ] o.e.j.s.Server Started @808281ms
[junit4] 2> 791247 INFO (jetty-launcher-1970-thread-1) [ ] o.a.s.c.s.e.JettySolrRunner Jetty properties: {hostContext=/solr, hostPort=52256}
[junit4] 2> 791247 INFO (jetty-launcher-1970-thread-2) [ ] o.a.s.c.s.e.JettySolrRunner Jetty properties: {hostContext=/solr, hostPort=52258}
[junit4] 2> 791247 ERROR (jetty-launcher-1970-thread-1) [ ] o.a.s.s.StartupLoggingUtils Missing Java Option solr.log.dir. Logging may be missing or incomplete.
[junit4] 2> 791247 INFO (jetty-launcher-1970-thread-4) [ ] o.e.j.s.h.ContextHandler Started o.e.j.s.ServletContextHandler@64e3b97e{/solr,null,AVAILABLE}
[junit4] 2> 791248 INFO (jetty-launcher-1970-thread-1) [ ] o.a.s.s.SolrDispatchFilter ___ _ Welcome to Apache Solr? version 7.1.0
[junit4] 2> 791247 INFO (jetty-launcher-1970-thread-3) [ ] o.e.j.s.AbstractConnector Started ServerConnector@31b24509{HTTP/1.1,[http/1.1]}{127.0.0.1:52262}
[junit4] 2> 791248 INFO (jetty-launcher-1970-thread-1) [ ] o.a.s.s.SolrDispatchFilter / __| ___| |_ _ Starting in cloud mode on port null
[junit4] 2> 791248 INFO (jetty-launcher-1970-thread-3) [ ] o.e.j.s.Server Started @808282ms
[junit4] 2> 791248 INFO (jetty-launcher-1970-thread-1) [ ] o.a.s.s.SolrDispatchFilter \__ \/ _ \ | '_| Install dir: null, Default config dir: null
[junit4] 2> 791248 INFO (jetty-launcher-1970-thread-3) [ ] o.a.s.c.s.e.JettySolrRunner Jetty properties: {hostContext=/solr, hostPort=52262}
[junit4] 2> 791248 INFO (jetty-launcher-1970-thread-1) [ ] o.a.s.s.SolrDispatchFilter |___/\___/_|_| Start time: 2017-07-14T22:02:47.671Z
[junit4] 2> 791248 ERROR (jetty-launcher-1970-thread-3) [ ] o.a.s.s.StartupLoggingUtils Missing Java Option solr.log.dir. Logging may be missing or incomplete.
[junit4] 2> 791248 INFO (jetty-launcher-1970-thread-4) [ ] o.e.j.s.AbstractConnector Started ServerConnector@46efa26c{HTTP/1.1,[http/1.1]}{127.0.0.1:52265}
[junit4] 2> 791248 INFO (jetty-launcher-1970-thread-3) [ ] o.a.s.s.SolrDispatchFilter ___ _ Welcome to Apache Solr? version 7.1.0
[junit4] 2> 791248 INFO (jetty-launcher-1970-thread-3) [ ] o.a.s.s.SolrDispatchFilter / __| ___| |_ _ Starting in cloud mode on port null
[junit4] 2> 791248 INFO (jetty-launcher-1970-thread-3) [ ] o.a.s.s.SolrDispatchFilter \__ \/ _ \ | '_| Install dir: null, Default config dir: null
[junit4] 2> 791248 INFO (jetty-launcher-1970-thread-3) [ ] o.a.s.s.SolrDispatchFilter |___/\___/_|_| Start time: 2017-07-14T22:02:47.671Z
[junit4] 2> 791247 ERROR (jetty-launcher-1970-thread-2) [ ] o.a.s.s.StartupLoggingUtils Missing Java Option solr.log.dir. Logging may be missing or incomplete.
[junit4] 2> 791249 INFO (jetty-launcher-1970-thread-2) [ ] o.a.s.s.SolrDispatchFilter ___ _ Welcome to Apache Solr? version 7.1.0
[junit4] 2> 791249 INFO (jetty-launcher-1970-thread-2) [ ] o.a.s.s.SolrDispatchFilter / __| ___| |_ _ Starting in cloud mode on port null
[junit4] 2> 791249 INFO (jetty-launcher-1970-thread-2) [ ] o.a.s.s.SolrDispatchFilter \__ \/ _ \ | '_| Install dir: null, Default config dir: null
[junit4] 2> 791249 INFO (jetty-launcher-1970-thread-2) [ ] o.a.s.s.SolrDispatchFilter |___/\___/_|_| Start time: 2017-07-14T22:02:47.672Z
[junit4] 2> 791248 INFO (jetty-launcher-1970-thread-4) [ ] o.e.j.s.Server Started @808282ms
[junit4] 2> 791249 INFO (jetty-launcher-1970-thread-4) [ ] o.a.s.c.s.e.JettySolrRunner Jetty properties: {hostContext=/solr, hostPort=52265}
[junit4] 2> 791249 ERROR (jetty-launcher-1970-thread-4) [ ] o.a.s.s.StartupLoggingUtils Missing Java Option solr.log.dir. Logging may be missing or incomplete.
[junit4] 2> 791249 INFO (jetty-launcher-1970-thread-4) [ ] o.a.s.s.SolrDispatchFilter ___ _ Welcome to Apache Solr? version 7.1.0
[junit4] 2> 791249 INFO (jetty-launcher-1970-thread-4) [ ] o.a.s.s.SolrDispatchFilter / __| ___| |_ _ Starting in cloud mode on port null
[junit4] 2> 791249 INFO (jetty-launcher-1970-thread-4) [ ] o.a.s.s.SolrDispatchFilter \__ \/ _ \ | '_| Install dir: null, Default config dir: null
[junit4] 2> 791249 INFO (jetty-launcher-1970-thread-4) [ ] o.a.s.s.SolrDispatchFilter |___/\___/_|_| Start time: 2017-07-14T22:02:47.672Z
[junit4] 2> 791258 INFO (jetty-launcher-1970-thread-2) [ ] o.a.s.s.SolrDispatchFilter solr.xml found in ZooKeeper. Loading...
[junit4] 2> 791258 INFO (jetty-launcher-1970-thread-3) [ ] o.a.s.s.SolrDispatchFilter solr.xml found in ZooKeeper. Loading...
[junit4] 2> 791258 INFO (jetty-launcher-1970-thread-4) [ ] o.a.s.s.SolrDispatchFilter solr.xml found in ZooKeeper. Loading...
[junit4] 2> 791258 INFO (jetty-launcher-1970-thread-1) [ ] o.a.s.s.SolrDispatchFilter solr.xml found in ZooKeeper. Loading...
[junit4] 2> 791271 WARN (NIOServerCxn.Factory:0.0.0.0/0.0.0.0:0) [ ] o.a.z.s.NIOServerCnxn caught end of stream exception
[junit4] 2> EndOfStreamException: Unable to read additional data from client sessionid 0x15d4320298b0002, likely client has closed socket
[junit4] 2> at org.apache.zookeeper.server.NIOServerCnxn.doIO(NIOServerCnxn.java:239)
[junit4] 2> at org.apache.zookeeper.server.NIOServerCnxnFactory.run(NIOServerCnxnFactory.java:203)
[junit4] 2> at java.lang.Thread.run(Thread.java:748)
[junit4] 2> 791275 INFO (jetty-launcher-1970-thread-1) [ ] o.a.s.c.ZkContainer Zookeeper client=127.0.0.1:52252/solr
[junit4] 2> 791275 INFO (jetty-launcher-1970-thread-2) [ ] o.a.s.c.ZkContainer Zookeeper client=127.0.0.1:52252/solr
[junit4] 2> 791276 INFO (jetty-launcher-1970-thread-4) [ ] o.a.s.c.ZkContainer Zookeeper client=127.0.0.1:52252/solr
[junit4] 2> 791277 INFO (jetty-launcher-1970-thread-3) [ ] o.a.s.c.ZkContainer Zookeeper client=127.0.0.1:52252/solr
[junit4] 2> 791280 WARN (NIOServerCxn.Factory:0.0.0.0/0.0.0.0:0) [ ] o.a.z.s.NIOServerCnxn caught end of stream exception
[junit4] 2> EndOfStreamException: Unable to read additional data from client sessionid 0x15d4320298b0006, likely client has closed socket
[junit4] 2> at org.apache.zookeeper.server.NIOServerCnxn.doIO(NIOServerCnxn.java:239)
[junit4] 2> at org.apache.zookeeper.server.NIOServerCnxnFactory.run(NIOServerCnxnFactory.java:203)
[junit4] 2> at java.lang.Thread.run(Thread.java:748)
[junit4] 2> 791281 WARN (NIOServerCxn.Factory:0.0.0.0/0.0.0.0:0) [ ] o.a.z.s.NIOServerCnxn caught end of stream exception
[junit4] 2> EndOfStreamException: Unable to read additional data from client sessionid 0x15d4320298b0005, likely client has closed socket
[junit4] 2> at org.apache.zookeeper.server.NIOServerCnxn.doIO(NIOServerCnxn.java:239)
[junit4] 2> at org.apache.zookeeper.server.NIOServerCnxnFactory.run(NIOServerCnxnFactory.java:203)
[junit4] 2> at java.lang.Thread.run(Thread.java:748)
[junit4] 2> 791282 WARN (NIOServerCxn.Factory:0.0.0.0/0.0.0.0:0) [ ] o.a.z.s.NIOServerCnxn caught end of stream exception
[junit4] 2> EndOfStreamException: Unable to read additional data from client sessionid 0x15d4320298b0007, likely client has closed socket
[junit4] 2> at org.apache.zookeeper.server.NIOServerCnxn.doIO(NIOServerCnxn.java:239)
[junit4] 2> at org.apache.zookeeper.server.NIOServerCnxnFactory.run(NIOServerCnxnFactory.java:203)
[junit4] 2> at java.lang.Thread.run(Thread.java:748)
[junit4] 2> 791283 WARN (NIOServerCxn.Factory:0.0.0.0/0.0.0.0:0) [ ] o.a.z.s.NIOServerCnxn caught end of stream exception
[junit4] 2> EndOfStreamException: Unable to read additional data from client sessionid 0x15d4320298b0008, likely client has closed socket
[junit4] 2> at org.apache.zookeeper.server.NIOServerCnxn.doIO(NIOServerCnxn.java:239)
[junit4] 2> at org.apache.zookeeper.server.NIOServerCnxnFactory.run(NIOServerCnxnFactory.java:203)
[junit4] 2> at java.lang.Thread.run(Thread.java:748)
[junit4] 2> 791397 INFO (jetty-launcher-1970-thread-1) [n:127.0.0.1:52256_solr ] o.a.s.c.Overseer Overseer (id=null) closing
[junit4] 2> 791397 INFO (jetty-launcher-1970-thread-4) [n:127.0.0.1:52265_solr ] o.a.s.c.Overseer Overseer (id=null) closing
[junit4] 2> 791398 INFO (jetty-launcher-1970-thread-2) [n:127.0.0.1:52258_solr ] o.a.s.c.Overseer Overseer (id=null) closing
[junit4] 2> 791399 INFO (jetty-launcher-1970-thread-1) [n:127.0.0.1:52256_solr ] o.a.s.c.OverseerElectionContext I am going to be the leader 127.0.0.1:52256_solr
[junit4] 2> 791399 INFO (jetty-launcher-1970-thread-4) [n:127.0.0.1:52265_solr ] o.a.s.c.ZkController Register node as live in ZooKeeper:/live_nodes/127.0.0.1:52265_solr
[junit4] 2> 791399 INFO (jetty-launcher-1970-thread-2) [n:127.0.0.1:52258_solr ] o.a.s.c.ZkController Register node as live in ZooKeeper:/live_nodes/127.0.0.1:52258_solr
[junit4] 2> 791400 INFO (jetty-launcher-1970-thread-1) [n:127.0.0.1:52256_solr ] o.a.s.c.Overseer Overseer (id=98308572287008779-127.0.0.1:52256_solr-n_0000000000) starting
[junit4] 2> 791402 INFO (zkCallback-1990-thread-1-processing-n:127.0.0.1:52256_solr) [n:127.0.0.1:52256_solr ] o.a.s.c.c.ZkStateReader Updated live nodes from ZooKeeper... (0) -> (2)
[junit4] 2> 791403 INFO (zkCallback-1991-thread-1-processing-n:127.0.0.1:52258_solr) [n:127.0.0.1:52258_solr ] o.a.s.c.c.ZkStateReader Updated live nodes from ZooKeeper... (0) -> (2)
[junit4] 2> 791403 INFO (zkCallback-1989-thread-1-processing-n:127.0.0.1:52265_solr) [n:127.0.0.1:52265_solr ] o.a.s.c.c.ZkStateReader Updated live nodes from ZooKeeper... (0) -> (2)
[junit4] 2> 791410 INFO (jetty-launcher-1970-thread-1) [n:127.0.0.1:52256_solr ] o.a.s.c.ZkController Register node as live in ZooKeeper:/live_nodes/127.0.0.1:52256_solr
[junit4] 2> 791468 INFO (zkCallback-1990-thread-1-processing-n:127.0.0.1:52256_solr) [n:127.0.0.1:52256_solr ] o.a.s.c.c.ZkStateReader Updated live nodes from ZooKeeper... (2) -> (3)
[junit4] 2> 791471 INFO (zkCallback-1989-thread-1-processing-n:127.0.0.1:52265_solr) [n:127.0.0.1:52265_solr ] o.a.s.c.c.ZkStateReader Updated live nodes from ZooKeeper... (2) -> (3)
[junit4] 2> 791471 INFO (zkCallback-1991-thread-1-processing-n:127.0.0.1:52258_solr) [n:127.0.0.1:52258_solr ] o.a.s.c.c.ZkStateReader Updated live nodes from ZooKeeper... (2) -> (3)
[junit4] 2> 791476 INFO (jetty-launcher-1970-thread-3) [n:127.0.0.1:52262_solr ] o.a.s.c.c.ZkStateReader Updated live nodes from ZooKeeper... (0) -> (3)
[junit4] 2> 791478 INFO (jetty-launcher-1970-thread-3) [n:127.0.0.1:52262_solr ] o.a.s.c.Overseer Overseer (id=null) closing
[junit4] 2> 791479 INFO (jetty-launcher-1970-thread-3) [n:127.0.0.1:52262_solr ] o.a.s.c.ZkController Register node as live in ZooKeeper:/live_nodes/127.0.0.1:52262_solr
[junit4] 2> 791536 INFO (jetty-launcher-1970-thread-4) [n:127.0.0.1:52265_solr ] o.a.s.m.r.SolrJmxReporter JMX monitoring for 'solr_52265.solr.node' (registry 'solr.node') enabled at server: com.sun.jmx.mbeanserver.JmxMBeanServer@1b39fc6f
[junit4] 2> 791541 INFO (zkCallback-1989-thread-1-processing-n:127.0.0.1:52265_solr) [n:127.0.0.1:52265_solr ] o.a.s.c.c.ZkStateReader Updated live nodes from ZooKeeper... (3) -> (4)
[junit4] 2> 791542 INFO (zkCallback-1991-thread-1-processing-n:127.0.0.1:52258_solr) [n:127.0.0.1:52258_solr ] o.a.s.c.c.ZkStateReader Updated live nodes from ZooKeeper... (3) -> (4)
[junit4] 2> 791542 INFO (zkCallback-1990-thread-1-processing-n:127.0.0.1:52256_solr) [n:127.0.0.1:52256_solr ] o.a.s.c.c.ZkStateReader Updated live nodes from ZooKeeper... (3) -> (4)
[junit4] 2> 791549 INFO (jetty-launcher-1970-thread-4) [n:127.0.0.1:52265_solr ] o.a.s.m.r.SolrJmxReporter JMX monitoring for 'solr_52265.solr.jvm' (registry 'solr.jvm') enabled at server: com.sun.jmx.mbeanserver.JmxMBeanServer@1b39fc6f
[junit4] 2> 791549 INFO (jetty-launcher-1970-thread-4) [n:127.0.0.1:52265_solr ] o.a.s.m.r.SolrJmxReporter JMX monitoring for 'solr_52265.solr.jetty' (registry 'solr.jetty') enabled at server: com.sun.jmx.mbeanserver.JmxMBeanServer@1b39fc6f
[junit4] 2> 791551 INFO (jetty-launcher-1970-thread-4) [n:127.0.0.1:52265_solr ] o.a.s.c.CorePropertiesLocator Found 0 core definitions underneath C:\Users\jenkins\workspace\Lucene-Solr-7.x-Windows\solr\build\solr-core\test\J0\temp\solr.cloud.OverseerRolesTest_EA68968DD27CEB1A-001\tempDir-001\node4\.
[junit4] 2> 791552 INFO (zkCallback-1992-thread-1-processing-n:127.0.0.1:52262_solr) [n:127.0.0.1:52262_solr ] o.a.s.c.c.ZkStateReader Updated live nodes from ZooKeeper... (3) -> (4)
[junit4] 2> 791595 INFO (jetty-launcher-1970-thread-1) [n:127.0.0.1:52256_solr ] o.a.s.m.r.SolrJmxReporter JMX monitoring for 'solr_52256.solr.node' (registry 'solr.node') enabled at server: com.sun.jmx.mbeanserver.JmxMBeanServer@1b39fc6f
[junit4] 2> 791599 INFO (jetty-launcher-1970-thread-1) [n:127.0.0.1:52256_solr ] o.a.s.m.r.SolrJmxReporter JMX monitoring for 'solr_52256.solr.jvm' (registry 'solr.jvm') enabled at server: com.sun.jmx.mbeanserver.JmxMBeanServer@1b39fc6f
[junit4] 2> 791600 INFO (jetty-launcher-1970-thread-1) [n:127.0.0.1:52256_solr ] o.a.s.m.r.SolrJmxReporter JMX monitoring for 'solr_52256.solr.jetty' (registry 'solr.jetty') enabled at server: com.sun.jmx.mbeanserver.JmxMBeanServer@1b39fc6f
[junit4] 2> 791601 INFO (jetty-launcher-1970-thread-1) [n:127.0.0.1:52256_solr ] o.a.s.c.CorePropertiesLocator Found 0 core definitions underneath C:\Users\jenkins\workspace\Lucene-Solr-7.x-Windows\solr\build\solr-core\test\J0\temp\solr.cloud.OverseerRolesTest_EA68968DD27CEB1A-001\tempDir-001\node1\.
[junit4] 2> 791675 INFO (jetty-launcher-1970-thread-2) [n:127.0.0.1:52258_solr ] o.a.s.m.r.SolrJmxReporter JMX monitoring for 'solr_52258.solr.node' (registry 'solr.node') enabled at server: com.sun.jmx.mbeanserver.JmxMBeanServer@1b39fc6f
[junit4] 2> 791677 INFO (jetty-launcher-1970-thread-3) [n:127.0.0.1:52262_solr ] o.a.s.m.r.SolrJmxReporter JMX monitoring for 'solr_52262.solr.node' (registry 'solr.node') enabled at server: com.sun.jmx.mbeanserver.JmxMBeanServer@1b39fc6f
[junit4] 2> 791681 INFO (jetty-launcher-1970-thread-2) [n:127.0.0.1:52258_solr ] o.a.s.m.r.SolrJmxReporter JMX monitoring for 'solr_52258.solr.jvm' (registry 'solr.jvm') enabled at server: com.sun.jmx.mbeanserver.JmxMBeanServer@1b39fc6f
[junit4] 2> 791681 INFO (jetty-launcher-1970-thread-2) [n:127.0.0.1:52258_solr ] o.a.s.m.r.SolrJmxReporter JMX monitoring for 'solr_52258.solr.jetty' (registry 'solr.jetty') enabled at server: com.sun.jmx.mbeanserver.JmxMBeanServer@1b39fc6f
[junit4] 2> 791682 INFO (jetty-launcher-1970-thread-2) [n:127.0.0.1:52258_solr ] o.a.s.c.CorePropertiesLocator Found 0 core definitions underneath C:\Users\jenkins\workspace\Lucene-Solr-7.x-Windows\solr\build\solr-core\test\J0\temp\solr.cloud.OverseerRolesTest_EA68968DD27CEB1A-001\tempDir-001\node2\.
[junit4] 2> 791682 INFO (jetty-launcher-1970-thread-3) [n:127.0.0.1:52262_solr ] o.a.s.m.r.SolrJmxReporter JMX monitoring for 'solr_52262.solr.jvm' (registry 'solr.jvm') enabled at server: com.sun.jmx.mbeanserver.JmxMBeanServer@1b39fc6f
[junit4] 2> 791682 INFO (jetty-launcher-1970-thread-3) [n:127.0.0.1:52262_solr ] o.a.s.m.r.SolrJmxReporter JMX monitoring for 'solr_52262.solr.jetty' (registry 'solr.jetty') enabled at server: com.sun.jmx.mbeanserver.JmxMBeanServer@1b39fc6f
[junit4] 2> 791684 INFO (jetty-launcher-1970-thread-3) [n:127.0.0.1:52262_solr ] o.a.s.c.CorePropertiesLocator Found 0 core definitions underneath C:\Users\jenkins\workspace\Lucene-Solr-7.x-Windows\solr\build\solr-core\test\J0\temp\solr.cloud.OverseerRolesTest_EA68968DD27CEB1A-001\tempDir-001\node3\.
[junit4] 2> 791740 WARN (NIOServerCxn.Factory:0.0.0.0/0.0.0.0:0) [ ] o.a.z.s.NIOServerCnxn caught end of stream exception
[junit4] 2> EndOfStreamException: Unable to read additional data from client sessionid 0x15d4320298b000d, likely client has closed socket
[junit4] 2> at org.apache.zookeeper.server.NIOServerCnxn.doIO(NIOServerCnxn.java:239)
[junit4] 2> at org.apache.zookeeper.server.NIOServerCnxnFactory.run(NIOServerCnxnFactory.java:203)
[junit4] 2> at java.lang.Thread.run(Thread.java:748)
[junit4] 2> 791749 INFO (SUITE-OverseerRolesTest-seed#[EA68968DD27CEB1A]-worker) [ ] o.a.s.c.c.ZkStateReader Updated live nodes from ZooKeeper... (0) -> (4)
[junit4] 2> 791750 INFO (SUITE-OverseerRolesTest-seed#[EA68968DD27CEB1A]-worker) [ ] o.a.s.c.s.i.ZkClientClusterStateProvider Cluster at 127.0.0.1:52252/solr ready
[junit4] 2> 791782 INFO (TEST-OverseerRolesTest.testOverseerRole-seed#[EA68968DD27CEB1A]) [ ] o.a.s.SolrTestCaseJ4 ###Starting testOverseerRole
[junit4] 2> 791783 INFO (TEST-OverseerRolesTest.testOverseerRole-seed#[EA68968DD27CEB1A]) [ ] o.a.s.c.OverseerRolesTest Overseer: 127.0.0.1:52256_solr
[junit4] 2> 791783 INFO (TEST-OverseerRolesTest.testOverseerRole-seed#[EA68968DD27CEB1A]) [ ] o.a.s.c.OverseerRolesTest Election queue:
[junit4] 2> 791784 INFO (TEST-OverseerRolesTest.testOverseerRole-seed#[EA68968DD27CEB1A]) [ ] o.a.s.c.OverseerRolesTest ### Setting overseer designate 127.0.0.1:52258_solr
[junit4] 2> 791792 INFO (qtp914843614-9140) [n:127.0.0.1:52258_solr ] o.a.s.h.a.CollectionsHandler Invoked Collection Action :addrole with params node=127.0.0.1:52258_solr&role=overseer&action=ADDROLE&wt=javabin&version=2 and sendToOCPQueue=true
[junit4] 2> 791802 INFO (OverseerThreadFactory-3692-thread-1-processing-n:127.0.0.1:52256_solr) [n:127.0.0.1:52256_solr ] o.a.s.c.OverseerRoleCmd Overseer role added to 127.0.0.1:52258_solr
[junit4] 2> 791805 INFO (qtp914843614-9140) [n:127.0.0.1:52258_solr ] o.a.s.s.HttpSolrCall [admin] webapp=null path=/admin/collections params={node=127.0.0.1:52258_solr&role=overseer&action=ADDROLE&wt=javabin&version=2} status=0 QTime=12
[junit4] 2> 791806 INFO (Thread-2071) [n:127.0.0.1:52256_solr ] o.a.s.c.OverseerNodePrioritizer prioritizing overseer nodes at 98308572287008779-127.0.0.1:52256_solr-n_0000000000 overseer designates are [127.0.0.1:52258_solr]
[junit4] 2> 791806 INFO (Thread-2071) [n:127.0.0.1:52256_solr ] o.a.s.c.OverseerNodePrioritizer sorted nodes [98308572287008779-127.0.0.1:52256_solr-n_0000000000, 98308572287008777-127.0.0.1:52265_solr-n_0000000001, 98308572287008780-127.0.0.1:52258_solr-n_0000000002, 98308572287008778-127.0.0.1:52262_solr-n_0000000003]
[junit4] 2> 791806 INFO (Thread-2071) [n:127.0.0.1:52256_solr ] o.a.s.c.OverseerNodePrioritizer asking node 98308572287008780-127.0.0.1:52258_solr-n_0000000002 to come join election at head
[junit4] 2> 791808 INFO (qtp914843614-9141) [n:127.0.0.1:52258_solr ] o.a.s.s.HttpSolrCall [admin] webapp=null path=/admin/cores params={op=rejoinAtHead&qt=/admin/cores&action=OVERSEEROP&electionNode=98308572287008780-127.0.0.1:52258_solr-n_0000000002&wt=javabin&version=2} status=0 QTime=0
[junit4] 2> 791808 INFO (Thread-2071) [n:127.0.0.1:52256_solr ] o.a.s.c.OverseerNodePrioritizer asking the old first in line 98308572287008777-127.0.0.1:52265_solr-n_0000000001 to rejoin election
[junit4] 2> 791811 INFO (qtp376813001-9148) [n:127.0.0.1:52265_solr ] o.a.s.s.HttpSolrCall [admin] webapp=null path=/admin/cores params={op=rejoin&qt=/admin/cores&action=OVERSEEROP&electionNode=98308572287008777-127.0.0.1:52265_solr-n_0000000001&wt=javabin&version=2} status=0 QTime=0
[junit4] 2> 791815 INFO (OverseerStateUpdate-98308572287008779-127.0.0.1:52256_solr-n_0000000000) [n:127.0.0.1:52256_solr ] o.a.s.c.Overseer Quit command received {
[junit4] 2> "operation":"quit",
[junit4] 2> "id":"98308572287008779-127.0.0.1:52256_solr-n_0000000000"} 127.0.0.1:52256_solr
[junit4] 2> 791816 INFO (OverseerStateUpdate-98308572287008779-127.0.0.1:52256_solr-n_0000000000) [n:127.0.0.1:52256_solr ] o.a.s.c.Overseer Overseer Loop exiting : 127.0.0.1:52256_solr
[junit4] 2> 791818 WARN (OverseerExitThread) [n:127.0.0.1:52256_solr ] o.a.s.c.Overseer I'm exiting, but I'm still the leader
[junit4] 2> 791820 INFO (OverseerExitThread) [n:127.0.0.1:52256_solr ] o.a.s.c.Overseer Overseer (id=98308572287008779-127.0.0.1:52256_solr-n_0000000000) closing
[junit4] 2> 791821 INFO (zkCallback-1989-thread-1-processing-n:127.0.0.1:52265_solr) [n:127.0.0.1:52265_solr ] o.a.s.c.OverseerElectionContext I am going to be the leader 127.0.0.1:52265_solr
[junit4] 2> 791823 INFO (zkCallback-1989-thread-1-processing-n:127.0.0.1:52265_solr) [n:127.0.0.1:52265_solr ] o.a.s.c.Overseer Overseer (id=98308572287008777-127.0.0.1:52265_solr-n_0000000001) starting
[junit4] 2> 791829 INFO (OverseerCollectionConfigSetProcessor-98308572287008777-127.0.0.1:52265_solr-n_0000000001) [n:127.0.0.1:52265_solr ] o.a.s.c.OverseerNodePrioritizer prioritizing overseer nodes at 98308572287008777-127.0.0.1:52265_solr-n_0000000001 overseer designates are [127.0.0.1:52258_solr]
[junit4] 2> 791829 INFO (OverseerCollectionConfigSetProcessor-98308572287008777-127.0.0.1:52265_solr-n_0000000001) [n:127.0.0.1:52265_solr ] o.a.s.c.OverseerNodePrioritizer sorted nodes [98308572287008777-127.0.0.1:52265_solr-n_0000000001, 98308572287008780-127.0.0.1:52258_solr-n_0000000002, 98308572287008778-127.0.0.1:52262_solr-n_0000000003, 98308572287008779-127.0.0.1:52256_solr-n_0000000004]
[junit4] 2> 791831 INFO (OverseerStateUpdate-98308572287008777-127.0.0.1:52265_solr-n_0000000001) [n:127.0.0.1:52265_solr ] o.a.s.c.Overseer Quit command received {
[junit4] 2> "operation":"quit",
[junit4] 2> "id":"98308572287008777-127.0.0.1:52265_solr-n_0000000001"} 127.0.0.1:52265_solr
[junit4] 2> 791832 INFO (OverseerStateUpdate-98308572287008777-127.0.0.1:52265_solr-n_0000000001) [n:127.0.0.1:52265_solr ] o.a.s.c.Overseer Overseer Loop exiting : 127.0.0.1:52265_solr
[junit4] 2> 791835 WARN (OverseerExitThread) [n:127.0.0.1:52265_solr ] o.a.s.c.Overseer I'm exiting, but I'm still the leader
[junit4] 2> 791836 INFO (OverseerExitThread) [n:127.0.0.1:52265_solr ] o.a.s.c.Overseer Overseer (id=98308572287008777-127.0.0.1:52265_solr-n_0000000001) closing
[junit4] 2> 791838 INFO (zkCallback-1991-thread-1-processing-n:127.0.0.1:52258_solr) [n:127.0.0.1:52258_solr ] o.a.s.c.OverseerElectionContext I am going to be the leader 127.0.0.1:52258_solr
[junit4] 2> 791839 INFO (zkCallback-1991-thread-1-processing-n:127.0.0.1:52258_solr) [n:127.0.0.1:52258_solr ] o.a.s.c.Overseer Overseer (id=98308572287008780-127.0.0.1:52258_solr-n_0000000002) starting
[junit4] 2> 791907 INFO (TEST-OverseerRolesTest.testOverseerRole-seed#[EA68968DD27CEB1A]) [ ] o.a.s.c.OverseerRolesTest ### Adding another overseer designate 127.0.0.1:52262_solr
[junit4] 2> 791907 INFO (qtp914843614-9141) [n:127.0.0.1:52258_solr ] o.a.s.h.a.CollectionsHandler Invoked Collection Action :addrole with params node=127.0.0.1:52262_solr&role=overseer&action=ADDROLE&wt=javabin&version=2 and sendToOCPQueue=true
[junit4] 2> 791910 INFO (OverseerThreadFactory-3703-thread-1-processing-n:127.0.0.1:52258_solr) [n:127.0.0.1:52258_solr ] o.a.s.c.OverseerRoleCmd Overseer role added to 127.0.0.1:52262_solr
[junit4] 2> 791912 INFO (qtp914843614-9141) [n:127.0.0.1:52258_solr ] o.a.s.s.HttpSolrCall [admin] webapp=null path=/admin/collections params={node=127.0.0.1:52262_solr&role=overseer&action=ADDROLE&wt=javabin&version=2} status=0 QTime=4
[junit4] 2> 791913 INFO (TEST-OverseerRolesTest.testOverseerRole-seed#[EA68968DD27CEB1A]) [ ] o.a.s.c.OverseerRolesTest Overseer: 127.0.0.1:52258_solr
[junit4] 2> 791913 INFO (TEST-OverseerRolesTest.testOverseerRole-seed#[EA68968DD27CEB1A]) [ ] o.a.s.c.OverseerRolesTest Election queue:
[junit4] 2> 791913 INFO (TEST-OverseerRolesTest.testOverseerRole-seed#[EA68968DD27CEB1A]) [ ] o.a.s.c.ChaosMonkey monkey: stop jetty! 52258
[junit4] 2> 791913 INFO (TEST-OverseerRolesTest.testOverseerRole-seed#[EA68968DD27CEB1A]) [ ] o.a.s.c.CoreContainer Shutting down CoreContainer instance=86397619
[junit4] 2> 791914 INFO (TEST-OverseerRolesTest.testOverseerRole-seed#[EA68968DD27CEB1A]) [ ] o.a.s.m.SolrMetricManager Closing metric reporters for registry=solr.node, tag=null
[junit4] 2> 791914 INFO (TEST-OverseerRolesTest.testOverseerRole-seed#[EA68968DD27CEB1A]) [ ] o.a.s.m.SolrMetricManager Closing metric reporters for registry=solr.jvm, tag=null
[junit4] 2> 791915 INFO (TEST-OverseerRolesTest.testOverseerRole-seed#[EA68968DD27CEB1A]) [ ] o.a.s.m.SolrMetricManager Closing metric reporters for registry=solr.jetty, tag=null
[junit4] 2> 791920 INFO (TEST-OverseerRolesTest.testOverseerRole-seed#[EA68968DD27CEB1A]) [ ] o.a.s.m.SolrMetricManager Closing metric reporters for registry=solr.cluster, tag=null
[junit4] 2> 791920 INFO (TEST-OverseerRolesTest.testOverseerRole-seed#[EA68968DD27CEB1A]) [ ] o.a.s.c.TransientSolrCoreCacheDefault Allocating transient cache for 2147483647 transient cores
[junit4] 2> 791920 INFO (TEST-OverseerRolesTest.testOverseerRole-seed#[EA68968DD27CEB1A]) [ ] o.a.s.c.Overseer Overseer (id=98308572287008780-127.0.0.1:52258_solr-n_0000000002) closing
[junit4] 2> 791920 INFO (OverseerStateUpdate-98308572287008780-127.0.0.1:52258_solr-n_0000000002) [n:127.0.0.1:52258_solr ] o.a.s.c.Overseer Overseer Loop exiting : 127.0.0.1:52258_solr
[junit4] 2> 791923 WARN (zkCallback-1991-thread-1-processing-n:127.0.0.1:52258_solr) [n:127.0.0.1:52258_solr ] o.a.s.c.c.ZkStateReader ZooKeeper watch triggered, but Solr cannot talk to ZK: [KeeperErrorCode = Session expired for /live_nodes]
[junit4] 2> 791923 INFO (TEST-OverseerRolesTest.testOverseerRole-seed#[EA68968DD27CEB1A]) [ ] o.e.j.s.AbstractConnector Stopped ServerConnector@78d03dfe{HTTP/1.1,[http/1.1]}{127.0.0.1:0}
[junit4] 2> 791925 INFO (zkCallback-1989-thread-1-processing-n:127.0.0.1:52265_solr) [n:127.0.0.1:52265_solr ] o.a.s.c.c.ZkStateReader Updated live nodes from ZooKeeper... (4) -> (3)
[junit4] 2> 791925 INFO (zkCallback-1992-thread-1-processing-n:127.0.0.1:52262_solr) [n:127.0.0.1:52262_solr ] o.a.s.c.OverseerElectionContext I am going to be the leader 127.0.0.1:52262_solr
[junit4] 2> 791925 INFO (zkCallback-1990-thread-2-processing-n:127.0.0.1:52256_solr) [n:127.0.0.1:52256_solr ] o.a.s.c.c.ZkStateReader Updated live nodes from ZooKeeper... (4) -> (3)
[junit4] 2> 791925 INFO (TEST-OverseerRolesTest.testOverseerRole-seed#[EA68968DD27CEB1A]) [ ] o.e.j.s.h.ContextHandler Stopped o.e.j.s.ServletContextHandler@6fec3ece{/solr,null,UNAVAILABLE}
[junit4] 2> 791926 INFO (zkCallback-2000-thread-1) [ ] o.a.s.c.c.ZkStateReader Updated live nodes from ZooKeeper... (4) -> (3)
[junit4] 2> 791926 INFO (zkCallback-1992-thread-2-processing-n:127.0.0.1:52262_solr) [n:127.0.0.1:52262_solr ] o.a.s.c.c.ZkStateReader Updated live nodes from ZooKeeper... (4) -> (3)
[junit4] 2> 791928 INFO (TEST-OverseerRolesTest.testOverseerRole-seed#[EA68968DD27CEB1A]) [ ] o.a.s.c.OverseerRolesTest ### Adding last overseer designate 127.0.0.1:52265_solr
[junit4] 2> 791928 INFO (zkCallback-1992-thread-1-processing-n:127.0.0.1:52262_solr) [n:127.0.0.1:52262_solr ] o.a.s.c.Overseer Overseer (id=98308572287008778-127.0.0.1:52262_solr-n_0000000003) starting
[junit4] 2> 791930 INFO (qtp1227115696-9153) [n:127.0.0.1:52262_solr ] o.a.s.h.a.CollectionsHandler Invoked Collection Action :addrole with params node=127.0.0.1:52265_solr&role=overseer&action=ADDROLE&wt=javabin&version=2 and sendToOCPQueue=true
[junit4] 2> 791938 INFO (OverseerThreadFactory-3706-thread-1-processing-n:127.0.0.1:52262_solr) [n:127.0.0.1:52262_solr ] o.a.s.c.OverseerRoleCmd Overseer role added to 127.0.0.1:52265_solr
[junit4] 2> 791939 INFO (qtp1227115696-9153) [n:127.0.0.1:52262_solr ] o.a.s.s.HttpSolrCall [admin] webapp=null path=/admin/collections params={node=127.0.0.1:52265_solr&role=overseer&action=ADDROLE&wt=javabin&version=2} status=0 QTime=9
[junit4] 2> 791940 INFO (TEST-OverseerRolesTest.testOverseerRole-seed#[EA68968DD27CEB1A]) [ ] o.a.s.c.OverseerRolesTest Overseer: 127.0.0.1:52262_solr
[junit4] 2> 791940 INFO (TEST-OverseerRolesTest.testOverseerRole-seed#[EA68968DD27CEB1A]) [ ] o.a.s.c.OverseerRolesTest Election queue:
[junit4] 2> 791942 INFO (qtp1227115696-9152) [n:127.0.0.1:52262_solr ] o.a.s.h.a.CollectionsHandler Invoked Collection Action :removerole with params node=127.0.0.1:52262_solr&role=overseer&action=REMOVEROLE&wt=javabin&version=2 and sendToOCPQueue=true
[junit4] 2> 791944 INFO (OverseerCollectionConfigSetProcessor-98308572287008778-127.0.0.1:52262_solr-n_0000000003) [n:127.0.0.1:52262_solr ] o.a.s.c.OverseerTaskQueue Response ZK path: /overseer/collection-queue-work/qnr-0000000004 doesn't exist. Requestor may have disconnected from ZooKeeper
[junit4] 2> 791945 INFO (OverseerThreadFactory-3706-thread-2-processing-n:127.0.0.1:52262_solr) [n:127.0.0.1:52262_solr ] o.a.s.c.OverseerRoleCmd Overseer role removed from 127.0.0.1:52262_solr
[junit4] 2> 791947 INFO (qtp1227115696-9152) [n:127.0.0.1:52262_solr ] o.a.s.s.HttpSolrCall [admin] webapp=null path=/admin/collections params={node=127.0.0.1:52262_solr&role=overseer&action=REMOVEROLE&wt=javabin&version=2} status=0 QTime=4
[junit4] 2> 791947 INFO (Thread-2075) [n:127.0.0.1:52262_solr ] o.a.s.c.OverseerNodePrioritizer prioritizing overseer nodes at 98308572287008778-127.0.0.1:52262_solr-n_0000000003 overseer designates are [127.0.0.1:52258_solr, 127.0.0.1:52265_solr]
[junit4] 2> 791947 INFO (Thread-2075) [n:127.0.0.1:52262_solr ] o.a.s.c.OverseerNodePrioritizer sorted nodes [98308572287008778-127.0.0.1:52262_solr-n_0000000003, 98308572287008779-127.0.0.1:52256_solr-n_0000000004, 98308572287008777-127.0.0.1:52265_solr-n_0000000005]
[junit4] 2> 791947 INFO (Thread-2075) [n:127.0.0.1:52262_solr ] o.a.s.c.OverseerNodePrioritizer asking node 98308572287008777-127.0.0.1:52265_solr-n_0000000005 to come join election at head
[junit4] 2> 791951 INFO (qtp376813001-9144) [n:127.0.0.1:52265_solr ] o.a.s.s.HttpSolrCall [admin] webapp=null path=/admin/cores params={op=rejoinAtHead&qt=/admin/cores&action=OVERSEEROP&electionNode=98308572287008777-127.0.0.1:52265_solr-n_0000000005&wt=javabin&version=2} status=0 QTime=0
[junit4] 2> 791951 INFO (Thread-2075) [n:127.0.0.1:52262_solr ] o.a.s.c.OverseerNodePrioritizer asking the old first in line 98308572287008779-127.0.0.1:52256_solr-n_0000000004 to rejoin election
[junit4] 2> 791953 INFO (qtp1721400931-9167) [n:127.0.0.1:52256_solr ] o.a.s.s.HttpSolrCall [admin] webapp=null path=/admin/cores params={op=rejoin&qt=/admin/cores&action=OVERSEEROP&electionNode=98308572287008779-127.0.0.1:52256_solr-n_0000000004&wt=javabin&version=2} status=0 QTime=0
[junit4] 2> 791955 INFO (OverseerStateUpdate-98308572287008778-127.0.0.1:52262_solr-n_0000000003) [n:127.0.0.1:52262_solr ] o.a.s.c.Overseer Quit command received {
[junit4] 2> "operation":"quit",
[junit4] 2> "id":"98308572287008778-127.0.0.1:52262_solr-n_0000000003"} 127.0.0.1:52262_solr
[junit4] 2> 791956 INFO (OverseerStateUpdate-98308572287008778-127.0.0.1:52262_solr-n_0000000003) [n:127.0.0.1:52262_solr ] o.a.s.c.Overseer Overseer Loop exiting : 127.0.0.1:52262_solr
[junit4] 2> 791958 WARN (OverseerExitThread) [n:127.0.0.1:52262_solr ] o.a.s.c.Overseer I'm exiting, but I'm still the leader
[junit4] 2> 791959 INFO (OverseerExitThread) [n:127.0.0.1:52262_solr ] o.a.s.c.Overseer Overseer (id=98308572287008778-127.0.0.1:52262_solr-n_0000000003) closing
[junit4] 2> 791960 INFO (zkCallback-1990-thread-2-processing-n:127.0.0.1:52256_solr) [n:127.0.0.1:52256_solr ] o.a.s.c.OverseerElectionContext I am going to be the leader 127.0.0.1:52256_solr
[junit4] 2> 791962 INFO (zkCallback-1990-thread-2-processing-n:127.0.0.1:52256_solr) [n:127.0.0.1:52256_solr ] o.a.s.c.Overseer Overseer (id=98308572287008779-127.0.0.1:52256_solr-n_0000000004) starting
[junit4] 2> 791970 INFO (OverseerCollectionConfigSetProcessor-98308572287008779-127.0.0.1:52256_solr-n_0000000004) [n:127.0.0.1:52256_solr ] o.a.s.c.OverseerNodePrioritizer prioritizing overseer nodes at 98308572287008779-127.0.0.1:52256_solr-n_0000000004 overseer designates are [127.0.0.1:52258_solr, 127.0.0.1:52265_solr]
[junit4] 2> 791970 INFO (OverseerCollectionConfigSetProcessor-98308572287008779-127.0.0.1:52256_solr-n_0000000004) [n:127.0.0.1:52256_solr ] o.a.s.c.OverseerNodePrioritizer sorted nodes [98308572287008779-127.0.0.1:52256_solr-n_0000000004, 98308572287008777-127.0.0.1:52265_solr-n_0000000005, 98308572287008778-127.0.0.1:52262_solr-n_0000000006]
[junit4] 2> 791972 INFO (OverseerStateUpdate-98308572287008779-127.0.0.1:52256_solr-n_0000000004) [n:127.0.0.1:52256_solr ] o.a.s.c.Overseer Quit command received {
[junit4] 2> "operation":"quit",
[junit4] 2> "id":"98308572287008779-127.0.0.1:52256_solr-n_0000000004"} 127.0.0.1:52256_solr
[junit4] 2> 791972 INFO (OverseerStateUpdate-98308572287008779-127.0.0.1:52256_solr-n_0000000004) [n:127.0.0.1:52256_solr ] o.a.s.c.Overseer Overseer Loop exiting : 127.0.0.1:52256_solr
[junit4] 2> 791974 WARN (OverseerExitThread) [n:127.0.0.1:52256_solr ] o.a.s.c.Overseer I'm exiting, but I'm still the leader
[junit4] 2> 791974 INFO (OverseerExitThread) [n:127.0.0.1:52256_solr ] o.a.s.c.Overseer Overseer (id=98308572287008779-127.0.0.1:52256_solr-n_0000000004) closing
[junit4] 2> 791977 INFO (zkCallback-1989-thread-1-processing-n:127.0.0.1:52265_solr) [n:127.0.0.1:52265_solr ] o.a.s.c.OverseerElectionContext I am going to be the leader 127.0.0.1:52265_solr
[junit4] 2> 791978 INFO (zkCallback-1989-thread-1-processing-n:127.0.0.1:52265_solr) [n:127.0.0.1:52265_solr ] o.a.s.c.Overseer Overseer (id=98308572287008777-127.0.0.1:52265_solr-n_0000000005) starting
[junit4] 2> 792049 INFO (qtp1227115696-9151) [n:127.0.0.1:52262_solr ] o.a.s.h.a.CollectionsHandler Invoked Collection Action :addrole with params node=127.0.0.1:52262_solr&role=overseer&action=ADDROLE&wt=javabin&version=2 and sendToOCPQueue=true
[junit4] 2> 792056 INFO (OverseerThreadFactory-3710-thread-1-processing-n:127.0.0.1:52265_solr) [n:127.0.0.1:52265_solr ] o.a.s.c.OverseerRoleCmd Overseer role added to 127.0.0.1:52262_solr
[junit4] 2> 792057 INFO (qtp1227115696-9151) [n:127.0.0.1:52262_solr ] o.a.s.s.HttpSolrCall [admin] webapp=null path=/admin/collections params={node=127.0.0.1:52262_solr&role=overseer&action=ADDROLE&wt=javabin&version=2} status=0 QTime=9
[junit4] 2> 792058 INFO (TEST-OverseerRolesTest.testOverseerRole-seed#[EA68968DD27CEB1A]) [ ] o.a.s.c.OverseerRolesTest ### Sending QUIT to overseer 127.0.0.1:52265_solr
[junit4] 2> 792061 INFO (OverseerCollectionConfigSetProcessor-98308572287008777-127.0.0.1:52265_solr-n_0000000005) [n:127.0.0.1:52265_solr ] o.a.s.c.OverseerTaskQueue Response ZK path: /overseer/collection-queue-work/qnr-0000000008 doesn't exist. Requestor may have disconnected from ZooKeeper
[junit4] 2> 792062 INFO (OverseerStateUpdate-98308572287008777-127.0.0.1:52265_solr-n_0000000005) [n:127.0.0.1:52265_solr ] o.a.s.c.Overseer Quit command received {
[junit4] 2> "operation":"quit",
[junit4] 2> "id":"98308572287008777-127.0.0.1:52265_solr-n_0000000005"} 127.0.0.1:52265_solr
[junit4] 2> 792063 INFO (OverseerStateUpdate-98308572287008777-127.0.0.1:52265_solr-n_0000000005) [n:127.0.0.1:52265_solr ] o.a.s.c.Overseer Overseer Loop exiting : 127.0.0.1:52265_solr
[junit4] 2> 792065 WARN (OverseerExitThread) [n:127.0.0.1:52265_solr ] o.a.s.c.Overseer I'm exiting, but I'm still the leader
[junit4] 2> 792066 INFO (Thread-2076) [n:127.0.0.1:52265_solr ] o.a.s.c.OverseerNodePrioritizer prioritizing overseer nodes at 98308572287008777-127.0.0.1:52265_solr-n_0000000005 overseer designates are [127.0.0.1:52258_solr, 127.0.0.1:52265_solr, 127.0.0.1:52262_solr]
[junit4] 2> 792066 INFO (OverseerExitThread) [n:127.0.0.1:52265_solr ] o.a.s.c.Overseer Overseer (id=98308572287008777-127.0.0.1:52265_solr-n_0000000005) closing
[junit4] 2> 792067 INFO (Thread-2076) [n:127.0.0.1:52265_solr ] o.a.s.c.OverseerNodePrioritizer sorted nodes [98308572287008778-127.0.0.1:52262_solr-n_0000000006, 98308572287008779-127.0.0.1:52256_solr-n_0000000007]
[junit4] 2> 792067 INFO (Thread-2076) [n:127.0.0.1:52265_solr ] o.a.s.c.OverseerNodePrioritizer asking node 98308572287008778-127.0.0.1:52262_solr-n_0000000006 to come join election at head
[junit4] 2> 792068 INFO (zkCallback-1992-thread-1-processing-n:127.0.0.1:52262_solr) [n:127.0.0.1:52262_solr ] o.a.s.c.OverseerElectionContext I am going to be the leader 127.0.0.1:52262_solr
[junit4] 2> 792070 INFO (zkCallback-1992-thread-1-processing-n:127.0.0.1:52262_solr) [n:127.0.0.1:52262_solr ] o.a.s.c.Overseer Overseer (id=98308572287008778-127.0.0.1:52262_solr-n_0000000006) starting
[junit4] 2> 792083 INFO (qtp1227115696-9150) [n:127.0.0.1:52262_solr ] o.a.s.s.HttpSolrCall [admin] webapp=null path=/admin/cores params={op=rejoinAtHead&qt=/admin/cores&action=OVERSEEROP&electionNode=98308572287008778-127.0.0.1:52262_solr-n_0000000006&wt=javabin&version=2} status=0 QTime=0
[junit4] 2> 792083 INFO (Thread-2076) [n:127.0.0.1:52265_solr ] o.a.s.c.OverseerNodePrioritizer asking the old first in line 98308572287008779-127.0.0.1:52256_solr-n_0000000007 to rejoin election
[junit4] 2> 792084 INFO (qtp1721400931-9169) [n:127.0.0.1:52256_solr ] o.a.s.s.HttpSolrCall [admin] webapp=null path=/admin/cores params={op=rejoin&qt=/admin/cores&action=OVERSEEROP&electionNode=98308572287008779-127.0.0.1:52256_solr-n_0000000007&wt=javabin&version=2} status=0 QTime=0
[junit4] 2> 792088 INFO (OverseerStateUpdate-98308572287008778-127.0.0.1:52262_solr-n_0000000006) [n:127.0.0.1:52262_solr ] o.a.s.c.Overseer Quit command received {
[junit4] 2> "operation":"quit",
[junit4] 2> "id":"98308572287008778-127.0.0.1:52262_solr-n_0000000006"} 127.0.0.1:52262_solr
[junit4] 2> 792088 INFO (OverseerStateUpdate-98308572287008778-127.0.0.1:52262_solr-n_0000000006) [n:127.0.0.1:52262_solr ] o.a.s.c.Overseer Overseer Loop exiting : 127.0.0.1:52262_solr
[junit4] 2> 792089 WARN (OverseerExitThread) [n:127.0.0.1:52262_solr ] o.a.s.c.Overseer I'm exiting, but I'm still the leader
[junit4] 2> 792091 INFO (OverseerExitThread) [n:127.0.0.1:52262_solr ] o.a.s.c.Overseer Overseer (id=98308572287008778-127.0.0.1:52262_solr-n_0000000006) closing
[junit4] 2> 792092 INFO (zkCallback-1990-thread-2-processing-n:127.0.0.1:52256_solr) [n:127.0.0.1:52256_solr ] o.a.s.c.OverseerElectionContext I am going to be the leader 127.0.0.1:52256_solr
[junit4] 2> 792095 INFO (zkCallback-1990-thread-2-processing-n:127.0.0.1:52256_solr) [n:127.0.0.1:52256_solr ] o.a.s.c.Overseer Overseer (id=98308572287008779-127.0.0.1:52256_solr-n_0000000007) starting
[junit4] 2> 792103 INFO (OverseerCollectionConfigSetProcessor-98308572287008779-127.0.0.1:52256_solr-n_0000000007) [n:127.0.0.1:52256_solr ] o.a.s.c.OverseerNodePrioritizer prioritizing overseer nodes at 98308572287008779-127.0.0.1:52256_solr-n_0000000007 overseer designates are [127.0.0.1:52258_solr, 127.0.0.1:52265_solr, 127.0.0.1:52262_solr]
[junit4] 2> 792104 INFO (OverseerCollectionConfigSetProcessor-98308572287008779-127.0.0.1:52256_solr-n_0000000007) [n:127.0.0.1:52256_solr ] o.a.s.c.OverseerNodePrioritizer sorted nodes [98308572287008779-127.0.0.1:52256_solr-n_0000000007, 98308572287008777-127.0.0.1:52265_solr-n_0000000008, 98308572287008778-127.0.0.1:52262_solr-n_0000000009]
[junit4] 2> 792106 INFO (OverseerStateUpdate-98308572287008779-127.0.0.1:52256_solr-n_0000000007) [n:127.0.0.1:52256_solr ] o.a.s.c.Overseer Quit command received {
[junit4] 2> "operation":"quit",
[junit4] 2> "id":"98308572287008779-127.0.0.1:52256_solr-n_0000000007"} 127.0.0.1:52256_solr
[junit4] 2> 792107 INFO (OverseerStateUpdate-98308572287008779-127.0.0.1:52256_solr-n_0000000007) [n:127.0.0.1:52256_solr ] o.a.s.c.Overseer Overseer Loop exiting : 127.0.0.1:52256_solr
[junit4] 2> 792109 WARN (OverseerExitThread) [n:127.0.0.1:52256_solr ] o.a.s.c.Overseer I'm exiting, but I'm still the leader
[junit4] 2> 792110 INFO (OverseerExitThread) [n:127.0.0.1:52256_solr ] o.a.s.c.Overseer Overseer (id=98308572287008779-127.0.0.1:52256_solr-n_0000000007) closing
[junit4] 2> 792112 INFO (zkCallback-1989-thread-1-processing-n:127.0.0.1:52265_solr) [n:127.0.0.1:52265_solr ] o.a.s.c.OverseerElectionContext I am going to be the leader 127.0.0.1:52265_solr
[junit4] 2> 792114 INFO (zkCallback-1989-thread-1-processing-n:127.0.0.1:52265_solr) [n:127.0.0.1:52265_solr ] o.a.s.c.Overseer Overseer (id=98308572287008777-127.0.0.1:52265_solr-n_0000000008) starting
[junit4] 2> 807155 INFO (TEST-OverseerRolesTest.testOverseerRole-seed#[EA68968DD27CEB1A]) [ ] o.a.s.SolrTestCaseJ4 ###Ending testOverseerRole
[junit4] 2> NOTE: reproduce with: ant test -Dtestcase=OverseerRolesTest -Dtests.method=testOverseerRole -Dtests.seed=EA68968DD27CEB1A -Dtests.slow=true -Dtests.locale=es -Dtests.timezone=Australia/Queensland -Dtests.asserts=true -Dtests.file.encoding=US-ASCII
[junit4] FAILURE 15.4s J0 | OverseerRolesTest.testOverseerRole <<<
[junit4] > Throwable #1: java.lang.AssertionError: Timed out waiting for overseer state change
[junit4] > at __randomizedtesting.SeedInfo.seed([EA68968DD27CEB1A:BA36B19E9CFDDCB]:0)
[junit4] > at org.apache.solr.cloud.OverseerRolesTest.waitForNewOverseer(OverseerRolesTest.java:62)
[junit4] > at org.apache.solr.cloud.OverseerRolesTest.testOverseerRole(OverseerRolesTest.java:140)
[junit4] > at java.lang.Thread.run(Thread.java:748)
[junit4] 2> 807201 INFO (jetty-closer-1971-thread-1) [ ] o.e.j.s.AbstractConnector Stopped ServerConnector@46efa26c{HTTP/1.1,[http/1.1]}{127.0.0.1:0}
[junit4] 2> 807207 INFO (jetty-closer-1971-thread-1) [ ] o.a.s.c.CoreContainer Shutting down CoreContainer instance=187646584
[junit4] 2> 807208 INFO (jetty-closer-1971-thread-1) [ ] o.a.s.m.SolrMetricManager Closing metric reporters for registry=solr.node, tag=null
[junit4] 2> 807208 INFO (jetty-closer-1971-thread-1) [ ] o.a.s.m.SolrMetricManager Closing metric reporters for registry=solr.jvm, tag=null
[junit4] 2> 807209 INFO (jetty-closer-1971-thread-1) [ ] o.a.s.m.SolrMetricManager Closing metric reporters for registry=solr.jetty, tag=null
[junit4] 2> 807213 INFO (jetty-closer-1971-thread-4) [ ] o.e.j.s.AbstractConnector Stopped ServerConnector@31b24509{HTTP/1.1,[http/1.1]}{127.0.0.1:0}
[junit4] 2> 807214 INFO (jetty-closer-1971-thread-4) [ ] o.a.s.c.CoreContainer Shutting down CoreContainer instance=1515116053
[junit4] 2> 807215 INFO (jetty-closer-1971-thread-2) [ ] o.e.j.s.AbstractConnector Stopped ServerConnector@3b2aba81{HTTP/1.1,[http/1.1]}{127.0.0.1:0}
[junit4] 2> 807215 INFO (jetty-closer-1971-thread-2) [ ] o.a.s.c.CoreContainer Shutting down CoreContainer instance=1866703798
[junit4] 2> 807216 INFO (jetty-closer-1971-thread-4) [ ] o.a.s.m.SolrMetricManager Closing metric reporters for registry=solr.node, tag=null
[junit4] 2> 807216 INFO (jetty-closer-1971-thread-2) [ ] o.a.s.m.SolrMetricManager Closing metric reporters for registry=solr.node, tag=null
[junit4] 2> 807218 INFO (jetty-closer-1971-thread-1) [ ] o.a.s.m.SolrMetricManager Closing metric reporters for registry=solr.cluster, tag=null
[junit4] 2> 807218 INFO (jetty-closer-1971-thread-1) [ ] o.a.s.c.TransientSolrCoreCacheDefault Allocating transient cache for 2147483647 transient cores
[junit4] 2> 807222 INFO (jetty-closer-1971-thread-1) [ ] o.a.s.c.Overseer Overseer (id=98308572287008777-127.0.0.1:52265_solr-n_0000000008) closing
[junit4] 2> 807235 INFO (OverseerStateUpdate-98308572287008777-127.0.0.1:52265_solr-n_0000000008) [n:127.0.0.1:52265_solr ] o.a.s.c.Overseer Overseer Loop exiting : 127.0.0.1:52265_solr
[junit4] 2> 807263 WARN (zkCallback-1989-thread-1-processing-n:127.0.0.1:52265_solr) [n:127.0.0.1:52265_solr ] o.a.s.c.c.ZkStateReader ZooKeeper watch triggered, but Solr cannot talk to ZK: [KeeperErrorCode = Session expired for /live_nodes]
[junit4] 2> 807265 INFO (jetty-closer-1971-thread-1) [ ] o.e.j.s.h.ContextHandler Stopped o.e.j.s.ServletContextHandler@64e3b97e{/solr,null,UNAVAILABLE}
[junit4] 2> 807272 INFO (zkCallback-1992-thread-1-processing-n:127.0.0.1:52262_solr) [n:127.0.0.1:52262_solr ] o.a.s.c.c.ZkStateReader Updated live nodes from ZooKeeper... (3) -> (2)
[junit4] 2> 807272 INFO (zkCallback-1990-thread-2-processing-n:127.0.0.1:52256_solr) [n:127.0.0.1:52256_solr ] o.a.s.c.c.ZkStateReader Updated live nodes from ZooKeeper... (3) -> (2)
[junit4] 2> 807272 INFO (zkCallback-1992-thread-2-processing-n:127.0.0.1:52262_solr) [n:127.0.0.1:52262_solr ] o.a.s.c.OverseerElectionContext I am going to be the leader 127.0.0.1:52262_solr
[junit4] 2> 807345 INFO (jetty-closer-1971-thread-2) [ ] o.a.s.m.SolrMetricManager Closing metric reporters for registry=solr.jvm, tag=null
[junit4] 2> 807345 INFO (jetty-closer-1971-thread-4) [ ] o.a.s.m.SolrMetricManager Closing metric reporters for registry=solr.jvm, tag=null
[junit4] 2> 807348 INFO (jetty-closer-1971-thread-2) [ ] o.a.s.m.SolrMetricManager Closing metric reporters for registry=solr.jetty, tag=null
[junit4] 2> 807348 INFO (jetty-closer-1971-thread-4) [ ] o.a.s.m.SolrMetricManager Closing metric reporters for registry=solr.jetty, tag=null
[junit4] 2> 807356 INFO (jetty-closer-1971-thread-2) [ ] o.a.s.m.SolrMetricManager Closing metric reporters for registry=solr.cluster, tag=null
[junit4] 2> 807357 INFO (jetty-closer-1971-thread-2) [ ] o.a.s.c.TransientSolrCoreCacheDefault Allocating transient cache for 2147483647 transient cores
[junit4] 2> 807356 INFO (jetty-closer-1971-thread-4) [ ] o.a.s.m.SolrMetricManager Closing metric reporters for registry=solr.cluster, tag=null
[junit4] 2> 807357 INFO (jetty-closer-1971-thread-4) [ ] o.a.s.c.TransientSolrCoreCacheDefault Allocating transient cache for 2147483647 transient cores
[junit4] 2> 807373 WARN (zkCallback-1990-thread-2-processing-n:127.0.0.1:52256_solr) [n:127.0.0.1:52256_solr ] o.a.s.c.c.ZkStateReader ZooKeeper watch triggered, but Solr cannot talk to ZK: [KeeperErrorCode = Session expired for /live_nodes]
[junit4] 2> 807375 WARN (zkCallback-1992-thread-2-processing-n:127.0.0.1:52262_solr) [n:127.0.0.1:52262_solr ] o.a.s.c.c.ZkStateReader ZooKeeper watch triggered, but Solr cannot talk to ZK: [KeeperErrorCode = Session expired for /live_nodes]
[junit4] 2> 807376 INFO (jetty-closer-1971-thread-2) [ ] o.e.j.s.h.ContextHandler Stopped o.e.j.s.ServletContextHandler@59c2e19a{/solr,null,UNAVAILABLE}
[junit4] 2> 807376 INFO (jetty-closer-1971-thread-4) [ ] o.e.j.s.h.ContextHandler Stopped o.e.j.s.ServletContextHandler@4f0a8ea4{/solr,null,UNAVAILABLE}
[junit4] 2> 807420 ERROR (SUITE-OverseerRolesTest-seed#[EA68968DD27CEB1A]-worker) [ ] o.a.z.s.ZooKeeperServer ZKShutdownHandler is not registered, so ZooKeeper server won't take any action on ERROR or SHUTDOWN server state changes
[junit4] 2> 807420 INFO (SUITE-OverseerRolesTest-seed#[EA68968DD27CEB1A]-worker) [ ] o.a.s.c.ZkTestServer connecting to 127.0.0.1:52252 52252
[junit4] 2> 807425 INFO (Thread-2023) [ ] o.a.s.c.ZkTestServer connecting to 127.0.0.1:52252 52252
[junit4] 2> 807428 WARN (Thread-2023) [ ] o.a.s.c.ZkTestServer Watch limit violations:
[junit4] 2> Maximum concurrent create/delete watches above limit:
[junit4] 2>
[junit4] 2> 5 /solr/aliases.json
[junit4] 2> 5 /solr/clusterprops.json
[junit4] 2> 4 /solr/security.json
[junit4] 2>
[junit4] 2> Maximum concurrent data watches above limit:
[junit4] 2>
[junit4] 2> 5 /solr/clusterstate.json
[junit4] 2>
[junit4] 2> Maximum concurrent children watches above limit:
[junit4] 2>
[junit4] 2> 9 /solr/overseer/queue-work
[junit4] 2> 5 /solr/live_nodes
[junit4] 2> 5 /solr/collections
[junit4] 2> 5 /solr/overseer/collection-queue-work
[junit4] 2> 2 /solr/overseer/queue
[junit4] 2>
[junit4] 2> NOTE: leaving temporary files on disk at: C:\Users\jenkins\workspace\Lucene-Solr-7.x-Windows\solr\build\solr-core\test\J0\temp\solr.cloud.OverseerRolesTest_EA68968DD27CEB1A-001
[junit4] 2> Jul 14, 2017 10:03:03 PM com.carrotsearch.randomizedtesting.ThreadLeakControl checkThreadLeaks
[junit4] 2> WARNING: Will linger awaiting termination of 3 leaked thread(s).
[junit4] 2> NOTE: test params are: codec=CheapBastard, sim=RandomSimilarity(queryNorm=true): {}, locale=es, timezone=Australia/Queensland
[junit4] 2> NOTE: Windows 10 10.0 amd64/Oracle Corporation 1.8.0_131 (64-bit)/cpus=3,threads=1,free=64433040,total=315461632
[junit4] 2> NOTE: All tests run in this JVM: [TestNumericRangeQuery64, TestConfigsApi, ResourceLoaderTest, BJQParserTest, CollectionTooManyReplicasTest, TestReplicationHandler, TestCoreContainer, WordBreakSolrSpellCheckerTest, ConnectionReuseTest, RankQueryTest, RequestLoggingTest, TestFieldCacheSortRandom, TestNRTOpen, TestPullReplicaErrorHandling, UniqFieldsUpdateProcessorFactoryTest, CdcrReplicationHandlerTest, TestLMDirichletSimilarityFactory, CircularListTest, TestQuerySenderListener, DistributedQueryComponentCustomSortTest, TestAtomicUpdateErrorCases, ZkControllerTest, TestPayloadCheckQParserPlugin, HdfsChaosMonkeySafeLeaderTest, HdfsNNFailoverTest, HdfsBasicDistributedZkTest, TestCloudDeleteByQuery, TestDynamicLoading, TestSurroundQueryParser, ShardSplitTest, DistributedDebugComponentTest, TestBulkSchemaAPI, TestGroupingSearch, TestPHPSerializedResponseWriter, TestMiniSolrCloudClusterSSL, ResponseLogComponentTest, TestSQLHandler, TestSearcherReuse, DirectUpdateHandlerOptimizeTest, TestSchemalessBufferedUpdates, TimeZoneUtilsTest, SolrShardReporterTest, TestCopyFieldCollectionResource, PreAnalyzedUpdateProcessorTest, TestHdfsCloudBackupRestore, TestUseDocValuesAsStored2, XmlUpdateRequestHandlerTest, TestHighlightDedupGrouping, TestFilteredDocIdSet, DirectUpdateHandlerTest, TestOmitPositions, BinaryUpdateRequestHandlerTest, CdcrVersionReplicationTest, TestCorePropertiesReload, TestFieldCacheWithThreads, TestLocalFSCloudBackupRestore, TestRandomDVFaceting, TestManagedSchemaAPI, PreAnalyzedFieldManagedSchemaCloudTest, TestNumericTerms32, TestDeleteCollectionOnDownNodes, TestMultiValuedNumericRangeQuery, TestSolrConfigHandler, RequestHandlersTest, OverseerRolesTest]
[junit4] Completed [190/728 (1!)] on J0 in 16.61s, 1 test, 1 failure <<< FAILURES!
[...truncated 1254 lines...]
[junit4] Suite: org.apache.solr.core.ExitableDirectoryReaderTest
[junit4] 2> Creating dataDir: C:\Users\jenkins\workspace\Lucene-Solr-7.x-Windows\solr\build\solr-core\test\J1\temp\solr.core.ExitableDirectoryReaderTest_EA68968DD27CEB1A-001\init-core-data-001
[junit4] 2> 2486911 INFO (SUITE-ExitableDirectoryReaderTest-seed#[EA68968DD27CEB1A]-worker) [ ] o.a.s.SolrTestCaseJ4 Using PointFields (NUMERIC_POINTS_SYSPROP=true) w/NUMERIC_DOCVALUES_SYSPROP=true
[junit4] 2> 2486913 INFO (SUITE-ExitableDirectoryReaderTest-seed#[EA68968DD27CEB1A]-worker) [ ] o.a.s.SolrTestCaseJ4 Randomized ssl (false) and clientAuth (false) via: @org.apache.solr.util.RandomizeSSL(reason=, value=NaN, ssl=NaN, clientAuth=NaN)
[junit4] 2> 2486915 INFO (SUITE-ExitableDirectoryReaderTest-seed#[EA68968DD27CEB1A]-worker) [ ] o.a.s.SolrTestCaseJ4 ####initCore
[junit4] 2> 2486916 INFO (SUITE-ExitableDirectoryReaderTest-seed#[EA68968DD27CEB1A]-worker) [ ] o.a.s.c.SolrResourceLoader [null] Added 2 libs to classloader, from paths: [/C:/Users/jenkins/workspace/Lucene-Solr-7.x-Windows/solr/core/src/test-files/solr/collection1/lib, /C:/Users/jenkins/workspace/Lucene-Solr-7.x-Windows/solr/core/src/test-files/solr/collection1/lib/classes]
[junit4] 2> 2486955 ERROR (Finalizer) [ ] o.a.s.c.CoreContainer CoreContainer was not close prior to finalize(), indicates a bug -- POSSIBLE RESOURCE LEAK!!! instance=1700873558
[junit4] 2> 2486990 INFO (SUITE-ExitableDirectoryReaderTest-seed#[EA68968DD27CEB1A]-worker) [ ] o.a.s.c.SolrConfig Using Lucene MatchVersion: 7.1.0
[jun
[...truncated too long message...]
apache.solr.update.processor.FieldMutatingUpdateProcessor.processAdd(FieldMutatingUpdateProcessor.java:118)
[junit4] > at org.apache.solr.update.processor.UpdateRequestProcessor.processAdd(UpdateRequestProcessor.java:55)
[junit4] > at org.apache.solr.update.processor.FieldMutatingUpdateProcessor.processAdd(FieldMutatingUpdateProcessor.java:118)
[junit4] > at org.apache.solr.update.processor.UpdateRequestProcessor.processAdd(UpdateRequestProcessor.java:55)
[junit4] > at org.apache.solr.update.processor.FieldMutatingUpdateProcessor.processAdd(FieldMutatingUpdateProcessor.java:118)
[junit4] > at org.apache.solr.update.processor.UpdateRequestProcessor.processAdd(UpdateRequestProcessor.java:55)
[junit4] > at org.apache.solr.update.processor.FieldMutatingUpdateProcessor.processAdd(FieldMutatingUpdateProcessor.java:118)
[junit4] > at org.apache.solr.update.processor.UpdateRequestProcessor.processAdd(UpdateRequestProcessor.java:55)
[junit4] > at org.apache.solr.update.processor.FieldNameMutatingUpdateProcessorFactory$1.processAdd(FieldNameMutatingUpdateProcessorFactory.java:74)
[junit4] > at org.apache.solr.update.processor.UpdateRequestProcessor.processAdd(UpdateRequestProcessor.java:55)
[junit4] > at org.apache.solr.update.processor.FieldMutatingUpdateProcessor.processAdd(FieldMutatingUpdateProcessor.java:118)
[junit4] > at org.apache.solr.update.processor.UpdateRequestProcessor.processAdd(UpdateRequestProcessor.java:55)
[junit4] > at org.apache.solr.update.processor.AbstractDefaultValueUpdateProcessorFactory$DefaultValueUpdateProcessor.processAdd(AbstractDefaultValueUpdateProcessorFactory.java:91)
[junit4] > at org.apache.solr.handler.loader.JavabinLoader$1.update(JavabinLoader.java:98)
[junit4] > at org.apache.solr.client.solrj.request.JavaBinUpdateRequestCodec$1.readOuterMostDocIterator(JavaBinUpdateRequestCodec.java:188)
[junit4] > at org.apache.solr.client.solrj.request.JavaBinUpdateRequestCodec$1.readIterator(JavaBinUpdateRequestCodec.java:144)
[junit4] > at org.apache.solr.common.util.JavaBinCodec.readObject(JavaBinCodec.java:311)
[junit4] > at org.apache.solr.common.util.JavaBinCodec.readVal(JavaBinCodec.java:256)
[junit4] > at org.apache.solr.client.solrj.request.JavaBinUpdateRequestCodec$1.readNamedList(JavaBinUpdateRequestCodec.java:130)
[junit4] > at org.apache.solr.common.util.JavaBinCodec.readObject(JavaBinCodec.java:276)
[junit4] > at org.apache.solr.common.util.JavaBinCodec.readVal(JavaBinCodec.java:256)
[junit4] > at org.apache.solr.common.util.JavaBinCodec.unmarshal(JavaBinCodec.java:178)
[junit4] > at org.apache.solr.client.solrj.request.JavaBinUpdateRequestCodec.unmarshal(JavaBinUpdateRequestCodec.java:195)
[junit4] > at org.apache.solr.handler.loader.JavabinLoader.parseAndLoadDocs(JavabinLoader.java:108)
[junit4] > at org.apache.solr.handler.loader.JavabinLoader.load(JavabinLoader.java:55)
[junit4] > at org.apache.solr.handler.UpdateRequestHandler$1.load(UpdateRequestHandler.java:97)
[junit4] > at org.apache.solr.handler.ContentStreamHandlerBase.handleRequestBody(ContentStreamHandlerBase.java:68)
[junit4] > at org.apache.solr.handler.RequestHandlerBase.handleRequest(RequestHandlerBase.java:177)
[junit4] > at org.apache.solr.core.SolrCore.execute(SolrCore.java:2473)
[junit4] > at org.apache.solr.servlet.HttpSolrCall.execute(HttpSolrCall.java:720)
[junit4] > at org.apache.solr.servlet.HttpSolrCall.call(HttpSolrCall.java:526)
[junit4] > at org.apache.solr.servlet.SolrDispatchFilter.doFilter(SolrDispatchFilter.java:378)
[junit4] > at org.apache.solr.servlet.SolrDispatchFilter.doFilter(SolrDispatchFilter.java:322)
[junit4] > at org.eclipse.jetty.servlet.ServletHandler$CachedChain.doFilter(ServletHandler.java:1699)
[junit4] > at org.apache.solr.client.solrj.embedded.JettySolrRunner$DebugFilter.doFilter(JettySolrRunner.java:139)
[junit4] > at org.eclipse.jetty.servlet.ServletHandler$CachedChain.doFilter(ServletHandler.java:1699)
[junit4] > at org.eclipse.jetty.servlet.ServletHandler.doHandle(ServletHandler.java:582)
[junit4] > at org.eclipse.jetty.server.session.SessionHandler.doHandle(SessionHandler.java:224)
[junit4] > at org.eclipse.jetty.server.handler.ContextHandler.doHandle(ContextHandler.java:1180)
[junit4] > at org.eclipse.jetty.servlet.ServletHandler.doScope(ServletHandler.java:512)
[junit4] > at org.eclipse.jetty.server.session.SessionHandler.doScope(SessionHandler.java:185)
[junit4] > at org.eclipse.jetty.server.handler.ContextHandler.doScope(ContextHandler.java:1112)
[junit4] > at org.eclipse.jetty.server.handler.ScopedHandler.handle(ScopedHandler.java:141)
[junit4] > at org.eclipse.jetty.server.handler.gzip.GzipHandler.handle(GzipHandler.java:395)
[junit4] > at org.eclipse.jetty.server.handler.HandlerWrapper.handle(HandlerWrapper.java:134)
[junit4] > at org.eclipse.jetty.server.Server.handle(Server.java:534)
[junit4] > at org.eclipse.jetty.server.HttpChannel.handle(HttpChannel.java:320)
[junit4] > at org.eclipse.jetty.server.HttpConnection.onFillable(HttpConnection.java:251)
[junit4] > at org.eclipse.jetty.io.AbstractConnection$ReadCallback.succeeded(AbstractConnection.java:273)
[junit4] > at org.eclipse.jetty.io.FillInterest.fillable(FillInterest.java:95)
[junit4] > at org.eclipse.jetty.io.SelectChannelEndPoint$2.run(SelectChannelEndPoint.java:93)
[junit4] > at org.eclipse.jetty.util.thread.strategy.ExecuteProduceConsume.executeProduceConsume(ExecuteProduceConsume.java:303)
[junit4] > at org.eclipse.jetty.util.thread.strategy.ExecuteProduceConsume.produceConsume(ExecuteProduceConsume.java:148)
[junit4] > at org.eclipse.jetty.util.thread.strategy.ExecuteProduceConsume.run(ExecuteProduceConsume.java:136)
[junit4] > at org.eclipse.jetty.util.thread.QueuedThreadPool.runJob(QueuedThreadPool.java:671)
[junit4] > at org.eclipse.jetty.util.thread.QueuedThreadPool$2.run(QueuedThreadPool.java:589)
[junit4] > at java.lang.Thread.run(Thread.java:748)
[junit4] > at __randomizedtesting.SeedInfo.seed([EA68968DD27CEB1A]:0)
[junit4] > at org.apache.solr.SolrTestCaseJ4.teardownTestCases(SolrTestCaseJ4.java:296)
[junit4] > at java.lang.Thread.run(Thread.java:748)Throwable #2: java.io.IOException: Could not remove the following files (in the order of attempts):
[junit4] > C:\Users\jenkins\workspace\Lucene-Solr-7.x-Windows\solr\build\solr-core\test\J1\temp\solr.util.TestSolrCLIRunExample_EA68968DD27CEB1A-001\tempDir-004\node1\testCloudExamplePrompt_shard1_replica_n2\data\tlog\tlog.0000000000000000000: java.nio.file.FileSystemException: C:\Users\jenkins\workspace\Lucene-Solr-7.x-Windows\solr\build\solr-core\test\J1\temp\solr.util.TestSolrCLIRunExample_EA68968DD27CEB1A-001\tempDir-004\node1\testCloudExamplePrompt_shard1_replica_n2\data\tlog\tlog.0000000000000000000: The process cannot access the file because it is being used by another process.
[junit4] > C:\Users\jenkins\workspace\Lucene-Solr-7.x-Windows\solr\build\solr-core\test\J1\temp\solr.util.TestSolrCLIRunExample_EA68968DD27CEB1A-001\tempDir-004\node1\testCloudExamplePrompt_shard1_replica_n2\data\tlog: java.nio.file.DirectoryNotEmptyException: C:\Users\jenkins\workspace\Lucene-Solr-7.x-Windows\solr\build\solr-core\test\J1\temp\solr.util.TestSolrCLIRunExample_EA68968DD27CEB1A-001\tempDir-004\node1\testCloudExamplePrompt_shard1_replica_n2\data\tlog
[junit4] > C:\Users\jenkins\workspace\Lucene-Solr-7.x-Windows\solr\build\solr-core\test\J1\temp\solr.util.TestSolrCLIRunExample_EA68968DD27CEB1A-001\tempDir-004\node1\testCloudExamplePrompt_shard1_replica_n2\data: java.nio.file.DirectoryNotEmptyException: C:\Users\jenkins\workspace\Lucene-Solr-7.x-Windows\solr\build\solr-core\test\J1\temp\solr.util.TestSolrCLIRunExample_EA68968DD27CEB1A-001\tempDir-004\node1\testCloudExamplePrompt_shard1_replica_n2\data
[junit4] > C:\Users\jenkins\workspace\Lucene-Solr-7.x-Windows\solr\build\solr-core\test\J1\temp\solr.util.TestSolrCLIRunExample_EA68968DD27CEB1A-001\tempDir-004\node1\testCloudExamplePrompt_shard1_replica_n2: java.nio.file.DirectoryNotEmptyException: C:\Users\jenkins\workspace\Lucene-Solr-7.x-Windows\solr\build\solr-core\test\J1\temp\solr.util.TestSolrCLIRunExample_EA68968DD27CEB1A-001\tempDir-004\node1\testCloudExamplePrompt_shard1_replica_n2
[junit4] > C:\Users\jenkins\workspace\Lucene-Solr-7.x-Windows\solr\build\solr-core\test\J1\temp\solr.util.TestSolrCLIRunExample_EA68968DD27CEB1A-001\tempDir-004\node1: java.nio.file.DirectoryNotEmptyException: C:\Users\jenkins\workspace\Lucene-Solr-7.x-Windows\solr\build\solr-core\test\J1\temp\solr.util.TestSolrCLIRunExample_EA68968DD27CEB1A-001\tempDir-004\node1
[junit4] > C:\Users\jenkins\workspace\Lucene-Solr-7.x-Windows\solr\build\solr-core\test\J1\temp\solr.util.TestSolrCLIRunExample_EA68968DD27CEB1A-001\tempDir-004: java.nio.file.DirectoryNotEmptyException: C:\Users\jenkins\workspace\Lucene-Solr-7.x-Windows\solr\build\solr-core\test\J1\temp\solr.util.TestSolrCLIRunExample_EA68968DD27CEB1A-001\tempDir-004
[junit4] > C:\Users\jenkins\workspace\Lucene-Solr-7.x-Windows\solr\build\solr-core\test\J1\temp\solr.util.TestSolrCLIRunExample_EA68968DD27CEB1A-001: java.nio.file.DirectoryNotEmptyException: C:\Users\jenkins\workspace\Lucene-Solr-7.x-Windows\solr\build\solr-core\test\J1\temp\solr.util.TestSolrCLIRunExample_EA68968DD27CEB1A-001
[junit4] > at org.apache.lucene.util.IOUtils.rm(IOUtils.java:329)
[junit4] > at java.lang.Thread.run(Thread.java:748)
[junit4] Completed [728/728 (3!)] on J1 in 51.29s, 4 tests, 1 failure, 1 error <<< FAILURES!
[...truncated 43339 lines...]
[JENKINS] Lucene-Solr-7.x-Windows (64bit/jdk1.8.0_131) - Build # 40
- Still Unstable!
Posted by Policeman Jenkins Server <je...@thetaphi.de>.
Build: https://jenkins.thetaphi.de/job/Lucene-Solr-7.x-Windows/40/
Java: 64bit/jdk1.8.0_131 -XX:-UseCompressedOops -XX:+UseSerialGC
1 tests failed.
FAILED: junit.framework.TestSuite.org.apache.solr.servlet.DirectSolrConnectionTest
Error Message:
Could not remove the following files (in the order of attempts): C:\Users\jenkins\workspace\Lucene-Solr-7.x-Windows\solr\build\solr-core\test\J0\temp\solr.servlet.DirectSolrConnectionTest_E448390C8F21B6F2-001\init-core-data-001: java.nio.file.AccessDeniedException: C:\Users\jenkins\workspace\Lucene-Solr-7.x-Windows\solr\build\solr-core\test\J0\temp\solr.servlet.DirectSolrConnectionTest_E448390C8F21B6F2-001\init-core-data-001 C:\Users\jenkins\workspace\Lucene-Solr-7.x-Windows\solr\build\solr-core\test\J0\temp\solr.servlet.DirectSolrConnectionTest_E448390C8F21B6F2-001: java.nio.file.DirectoryNotEmptyException: C:\Users\jenkins\workspace\Lucene-Solr-7.x-Windows\solr\build\solr-core\test\J0\temp\solr.servlet.DirectSolrConnectionTest_E448390C8F21B6F2-001
Stack Trace:
java.io.IOException: Could not remove the following files (in the order of attempts):
C:\Users\jenkins\workspace\Lucene-Solr-7.x-Windows\solr\build\solr-core\test\J0\temp\solr.servlet.DirectSolrConnectionTest_E448390C8F21B6F2-001\init-core-data-001: java.nio.file.AccessDeniedException: C:\Users\jenkins\workspace\Lucene-Solr-7.x-Windows\solr\build\solr-core\test\J0\temp\solr.servlet.DirectSolrConnectionTest_E448390C8F21B6F2-001\init-core-data-001
C:\Users\jenkins\workspace\Lucene-Solr-7.x-Windows\solr\build\solr-core\test\J0\temp\solr.servlet.DirectSolrConnectionTest_E448390C8F21B6F2-001: java.nio.file.DirectoryNotEmptyException: C:\Users\jenkins\workspace\Lucene-Solr-7.x-Windows\solr\build\solr-core\test\J0\temp\solr.servlet.DirectSolrConnectionTest_E448390C8F21B6F2-001
at __randomizedtesting.SeedInfo.seed([E448390C8F21B6F2]:0)
at org.apache.lucene.util.IOUtils.rm(IOUtils.java:329)
at org.apache.lucene.util.TestRuleTemporaryFilesCleanup.afterAlways(TestRuleTemporaryFilesCleanup.java:216)
at com.carrotsearch.randomizedtesting.rules.TestRuleAdapter$1.afterAlways(TestRuleAdapter.java:31)
at com.carrotsearch.randomizedtesting.rules.StatementAdapter.evaluate(StatementAdapter.java:43)
at com.carrotsearch.randomizedtesting.rules.StatementAdapter.evaluate(StatementAdapter.java:36)
at org.apache.lucene.util.TestRuleAssertionsRequired$1.evaluate(TestRuleAssertionsRequired.java:53)
at org.apache.lucene.util.TestRuleMarkFailure$1.evaluate(TestRuleMarkFailure.java:47)
at org.apache.lucene.util.TestRuleIgnoreAfterMaxFailures$1.evaluate(TestRuleIgnoreAfterMaxFailures.java:64)
at org.apache.lucene.util.TestRuleIgnoreTestSuites$1.evaluate(TestRuleIgnoreTestSuites.java:54)
at com.carrotsearch.randomizedtesting.rules.StatementAdapter.evaluate(StatementAdapter.java:36)
at com.carrotsearch.randomizedtesting.ThreadLeakControl$StatementRunner.run(ThreadLeakControl.java:368)
at java.lang.Thread.run(Thread.java:748)
Build Log:
[...truncated 10877 lines...]
[junit4] Suite: org.apache.solr.servlet.DirectSolrConnectionTest
[junit4] 2> Creating dataDir: C:\Users\jenkins\workspace\Lucene-Solr-7.x-Windows\solr\build\solr-core\test\J0\temp\solr.servlet.DirectSolrConnectionTest_E448390C8F21B6F2-001\init-core-data-001
[junit4] 2> 47855 WARN (SUITE-DirectSolrConnectionTest-seed#[E448390C8F21B6F2]-worker) [ ] o.a.s.SolrTestCaseJ4 startTrackingSearchers: numOpens=2 numCloses=2
[junit4] 2> 47855 INFO (SUITE-DirectSolrConnectionTest-seed#[E448390C8F21B6F2]-worker) [ ] o.a.s.SolrTestCaseJ4 Using TrieFields (NUMERIC_POINTS_SYSPROP=false) w/NUMERIC_DOCVALUES_SYSPROP=false
[junit4] 2> 47861 INFO (SUITE-DirectSolrConnectionTest-seed#[E448390C8F21B6F2]-worker) [ ] o.a.s.SolrTestCaseJ4 Randomized ssl (false) and clientAuth (false) via: @org.apache.solr.util.RandomizeSSL(reason=, value=NaN, ssl=NaN, clientAuth=NaN)
[junit4] 2> 47882 INFO (SUITE-DirectSolrConnectionTest-seed#[E448390C8F21B6F2]-worker) [ ] o.a.s.SolrTestCaseJ4 ####initCore
[junit4] 2> 47883 INFO (SUITE-DirectSolrConnectionTest-seed#[E448390C8F21B6F2]-worker) [ ] o.a.s.c.SolrResourceLoader [null] Added 2 libs to classloader, from paths: [/C:/Users/jenkins/workspace/Lucene-Solr-7.x-Windows/solr/core/src/test-files/solr/collection1/lib, /C:/Users/jenkins/workspace/Lucene-Solr-7.x-Windows/solr/core/src/test-files/solr/collection1/lib/classes]
[junit4] 2> 48034 INFO (SUITE-DirectSolrConnectionTest-seed#[E448390C8F21B6F2]-worker) [ ] o.a.s.c.SolrConfig Using Lucene MatchVersion: 7.1.0
[junit4] 2> 48051 INFO (SUITE-DirectSolrConnectionTest-seed#[E448390C8F21B6F2]-worker) [ ] o.a.s.s.IndexSchema [null] Schema name=test
[junit4] 2> 48055 INFO (SUITE-DirectSolrConnectionTest-seed#[E448390C8F21B6F2]-worker) [ ] o.a.s.s.IndexSchema Loaded schema test/1.0 with uniqueid field id
[junit4] 2> 48195 INFO (SUITE-DirectSolrConnectionTest-seed#[E448390C8F21B6F2]-worker) [ ] o.a.s.m.r.SolrJmxReporter JMX monitoring for 'solr.node' (registry 'solr.node') enabled at server: com.sun.jmx.mbeanserver.JmxMBeanServer@3fa7655d
[junit4] 2> 48199 INFO (SUITE-DirectSolrConnectionTest-seed#[E448390C8F21B6F2]-worker) [ ] o.a.s.m.r.SolrJmxReporter JMX monitoring for 'solr.jvm' (registry 'solr.jvm') enabled at server: com.sun.jmx.mbeanserver.JmxMBeanServer@3fa7655d
[junit4] 2> 48200 INFO (SUITE-DirectSolrConnectionTest-seed#[E448390C8F21B6F2]-worker) [ ] o.a.s.m.r.SolrJmxReporter JMX monitoring for 'solr.jetty' (registry 'solr.jetty') enabled at server: com.sun.jmx.mbeanserver.JmxMBeanServer@3fa7655d
[junit4] 2> 48247 INFO (coreLoadExecutor-153-thread-1) [ x:collection1] o.a.s.c.SolrResourceLoader [null] Added 2 libs to classloader, from paths: [/C:/Users/jenkins/workspace/Lucene-Solr-7.x-Windows/solr/core/src/test-files/solr/collection1/lib, /C:/Users/jenkins/workspace/Lucene-Solr-7.x-Windows/solr/core/src/test-files/solr/collection1/lib/classes]
[junit4] 2> 48369 INFO (coreLoadExecutor-153-thread-1) [ x:collection1] o.a.s.c.SolrConfig Using Lucene MatchVersion: 7.1.0
[junit4] 2> 48385 INFO (coreLoadExecutor-153-thread-1) [ x:collection1] o.a.s.s.IndexSchema [collection1] Schema name=test
[junit4] 2> 48387 INFO (coreLoadExecutor-153-thread-1) [ x:collection1] o.a.s.s.IndexSchema Loaded schema test/1.0 with uniqueid field id
[junit4] 2> 48387 INFO (coreLoadExecutor-153-thread-1) [ x:collection1] o.a.s.c.CoreContainer Creating SolrCore 'collection1' using configuration from instancedir C:\Users\jenkins\workspace\Lucene-Solr-7.x-Windows\solr\core\src\test-files\solr\collection1, trusted=true
[junit4] 2> 48387 INFO (coreLoadExecutor-153-thread-1) [ x:collection1] o.a.s.m.r.SolrJmxReporter JMX monitoring for 'solr.core.collection1' (registry 'solr.core.collection1') enabled at server: com.sun.jmx.mbeanserver.JmxMBeanServer@3fa7655d
[junit4] 2> 48393 INFO (coreLoadExecutor-153-thread-1) [ x:collection1] o.a.s.c.SolrCore solr.RecoveryStrategy.Builder
[junit4] 2> 48394 INFO (coreLoadExecutor-153-thread-1) [ x:collection1] o.a.s.c.SolrCore [[collection1] ] Opening new SolrCore at [C:\Users\jenkins\workspace\Lucene-Solr-7.x-Windows\solr\core\src\test-files\solr\collection1], dataDir=[C:\Users\jenkins\workspace\Lucene-Solr-7.x-Windows\solr\build\solr-core\test\J0\temp\solr.servlet.DirectSolrConnectionTest_E448390C8F21B6F2-001\init-core-data-001\]
[junit4] 2> 48402 INFO (coreLoadExecutor-153-thread-1) [ x:collection1] o.a.s.u.RandomMergePolicy RandomMergePolicy wrapping class org.apache.lucene.index.AlcoholicMergePolicy: [AlcoholicMergePolicy: minMergeSize=0, mergeFactor=10, maxMergeSize=1356026879, maxMergeSizeForForcedMerge=9223372036854775807, calibrateSizeByDeletes=true, maxMergeDocs=2147483647, maxCFSSegmentSizeMB=8.796093022207999E12, noCFSRatio=0.1]
[junit4] 2> 48449 INFO (coreLoadExecutor-153-thread-1) [ x:collection1] o.a.s.r.XSLTResponseWriter xsltCacheLifetimeSeconds=60
[junit4] 2> 48529 INFO (coreLoadExecutor-153-thread-1) [ x:collection1] o.a.s.u.CommitTracker Hard AutoCommit: disabled
[junit4] 2> 48529 INFO (coreLoadExecutor-153-thread-1) [ x:collection1] o.a.s.u.CommitTracker Soft AutoCommit: disabled
[junit4] 2> 48531 INFO (coreLoadExecutor-153-thread-1) [ x:collection1] o.a.s.u.RandomMergePolicy RandomMergePolicy wrapping class org.apache.lucene.index.TieredMergePolicy: [TieredMergePolicy: maxMergeAtOnce=34, maxMergeAtOnceExplicit=26, maxMergedSegmentMB=30.83984375, floorSegmentMB=1.4443359375, forceMergeDeletesPctAllowed=1.7293293980655333, segmentsPerTier=11.0, maxCFSSegmentSizeMB=8.796093022207999E12, noCFSRatio=0.19723433054631834
[junit4] 2> 48543 INFO (coreLoadExecutor-153-thread-1) [ x:collection1] o.a.s.s.SolrIndexSearcher Opening [Searcher@75d6741a[collection1] main]
[junit4] 2> 48547 WARN (coreLoadExecutor-153-thread-1) [ x:collection1] o.a.s.r.ManagedResourceStorage Cannot write to config directory C:\Users\jenkins\workspace\Lucene-Solr-7.x-Windows\solr\core\src\test-files\solr\collection1\conf; switching to use InMemory storage instead.
[junit4] 2> 48551 INFO (coreLoadExecutor-153-thread-1) [ x:collection1] o.a.s.h.ReplicationHandler Commits will be reserved for 10000
[junit4] 2> 48553 INFO (searcherExecutor-154-thread-1-processing-x:collection1) [ x:collection1] o.a.s.c.SolrCore [collection1] Registered new searcher Searcher@75d6741a[collection1] main{ExitableDirectoryReader(UninvertingDirectoryReader())}
[junit4] 2> 48555 INFO (SUITE-DirectSolrConnectionTest-seed#[E448390C8F21B6F2]-worker) [ ] o.a.s.SolrTestCaseJ4 ####initCore end
[junit4] 2> 48556 INFO (TEST-DirectSolrConnectionTest.testInsertThenSelect-seed#[E448390C8F21B6F2]) [ ] o.a.s.SolrTestCaseJ4 ###Starting testInsertThenSelect
[junit4] 2> 48561 INFO (TEST-DirectSolrConnectionTest.testInsertThenSelect-seed#[E448390C8F21B6F2]) [ ] o.a.s.u.p.LogUpdateProcessorFactory [collection1] webapp=null path=null params={stream.body=<delete><id>42</id></delete>}{delete=[42]} 0 1
[junit4] 2> 48573 INFO (TEST-DirectSolrConnectionTest.testInsertThenSelect-seed#[E448390C8F21B6F2]) [ ] o.a.s.u.p.LogUpdateProcessorFactory [collection1] webapp=null path=null params={stream.body=<add><doc><field+name%3D"id">42</field><field+name%3D"subject">Kittens!!!+?</field></doc></add>}{add=[42]} 0 11
[junit4] 2> 48574 INFO (TEST-DirectSolrConnectionTest.testInsertThenSelect-seed#[E448390C8F21B6F2]) [ ] o.a.s.u.DirectUpdateHandler2 start commit{,optimize=false,openSearcher=true,waitSearcher=true,expungeDeletes=false,softCommit=false,prepareCommit=false}
[junit4] 2> 48574 INFO (TEST-DirectSolrConnectionTest.testInsertThenSelect-seed#[E448390C8F21B6F2]) [ ] o.a.s.u.SolrIndexWriter Calling setCommitData with IW:org.apache.solr.update.SolrIndexWriter@32e47718 commitCommandVersion:0
[junit4] 2> 48588 INFO (TEST-DirectSolrConnectionTest.testInsertThenSelect-seed#[E448390C8F21B6F2]) [ ] o.a.s.s.SolrIndexSearcher Opening [Searcher@2ae9bb46[collection1] main]
[junit4] 2> 48588 INFO (TEST-DirectSolrConnectionTest.testInsertThenSelect-seed#[E448390C8F21B6F2]) [ ] o.a.s.u.DirectUpdateHandler2 end_commit_flush
[junit4] 2> 48589 INFO (searcherExecutor-154-thread-1) [ ] o.a.s.c.SolrCore [collection1] Registered new searcher Searcher@2ae9bb46[collection1] main{ExitableDirectoryReader(UninvertingDirectoryReader(Uninverting(_0(7.1.0):c1)))}
[junit4] 2> 48589 INFO (TEST-DirectSolrConnectionTest.testInsertThenSelect-seed#[E448390C8F21B6F2]) [ ] o.a.s.u.p.LogUpdateProcessorFactory [collection1] webapp=null path=null params={stream.body=<commit/>}{commit=} 0 15
[junit4] 2> 48613 INFO (TEST-DirectSolrConnectionTest.testInsertThenSelect-seed#[E448390C8F21B6F2]) [ ] o.a.s.c.S.Request [collection1] webapp=null path=null params={q=id:42&wt=xml} hits=1 status=0 QTime=24
[junit4] 2> 48615 INFO (TEST-DirectSolrConnectionTest.testInsertThenSelect-seed#[E448390C8F21B6F2]) [ ] o.a.s.u.p.LogUpdateProcessorFactory [collection1] webapp=null path=null params={}{delete=[42]} 0 0
[junit4] 2> 48616 INFO (TEST-DirectSolrConnectionTest.testInsertThenSelect-seed#[E448390C8F21B6F2]) [ ] o.a.s.u.p.LogUpdateProcessorFactory [collection1] webapp=null path=null params={}{add=[42]} 0 0
[junit4] 2> 48616 INFO (TEST-DirectSolrConnectionTest.testInsertThenSelect-seed#[E448390C8F21B6F2]) [ ] o.a.s.u.DirectUpdateHandler2 start commit{,optimize=false,openSearcher=true,waitSearcher=true,expungeDeletes=false,softCommit=false,prepareCommit=false}
[junit4] 2> 48616 INFO (TEST-DirectSolrConnectionTest.testInsertThenSelect-seed#[E448390C8F21B6F2]) [ ] o.a.s.u.SolrIndexWriter Calling setCommitData with IW:org.apache.solr.update.SolrIndexWriter@32e47718 commitCommandVersion:0
[junit4] 2> 48635 INFO (TEST-DirectSolrConnectionTest.testInsertThenSelect-seed#[E448390C8F21B6F2]) [ ] o.a.s.s.SolrIndexSearcher Opening [Searcher@5c12afc8[collection1] main]
[junit4] 2> 48636 INFO (searcherExecutor-154-thread-1) [ ] o.a.s.c.SolrCore [collection1] Registered new searcher Searcher@5c12afc8[collection1] main{ExitableDirectoryReader(UninvertingDirectoryReader(Uninverting(_1(7.1.0):c1)))}
[junit4] 2> 48636 INFO (TEST-DirectSolrConnectionTest.testInsertThenSelect-seed#[E448390C8F21B6F2]) [ ] o.a.s.u.DirectUpdateHandler2 end_commit_flush
[junit4] 2> 48637 INFO (TEST-DirectSolrConnectionTest.testInsertThenSelect-seed#[E448390C8F21B6F2]) [ ] o.a.s.u.p.LogUpdateProcessorFactory [collection1] webapp=null path=null params={}{commit=} 0 20
[junit4] 2> 48638 INFO (TEST-DirectSolrConnectionTest.testInsertThenSelect-seed#[E448390C8F21B6F2]) [ ] o.a.s.c.S.Request [collection1] webapp=null path=null params={q=id:42&wt=xml} hits=1 status=0 QTime=0
[junit4] 2> 48638 INFO (TEST-DirectSolrConnectionTest.testInsertThenSelect-seed#[E448390C8F21B6F2]) [ ] o.a.s.SolrTestCaseJ4 ###Ending testInsertThenSelect
[junit4] 2> 48639 INFO (TEST-DirectSolrConnectionTest.testSimpleRequest-seed#[E448390C8F21B6F2]) [ ] o.a.s.SolrTestCaseJ4 ###Starting testSimpleRequest
[junit4] 2> 48643 INFO (TEST-DirectSolrConnectionTest.testSimpleRequest-seed#[E448390C8F21B6F2]) [ ] o.a.s.c.S.Request [collection1] webapp=null path=null params={q=*:*&echoParams=explicit&wt=xml&version=2.2} hits=1 status=0 QTime=3
[junit4] 2> 48643 INFO (TEST-DirectSolrConnectionTest.testSimpleRequest-seed#[E448390C8F21B6F2]) [ ] o.a.s.SolrTestCaseJ4 ###Ending testSimpleRequest
[junit4] 2> 48643 INFO (SUITE-DirectSolrConnectionTest-seed#[E448390C8F21B6F2]-worker) [ ] o.a.s.SolrTestCaseJ4 ###deleteCore
[junit4] 2> 48643 INFO (SUITE-DirectSolrConnectionTest-seed#[E448390C8F21B6F2]-worker) [ ] o.a.s.c.CoreContainer Shutting down CoreContainer instance=1877321722
[junit4] 2> 48643 INFO (SUITE-DirectSolrConnectionTest-seed#[E448390C8F21B6F2]-worker) [ ] o.a.s.m.SolrMetricManager Closing metric reporters for registry=solr.node, tag=null
[junit4] 2> 48644 INFO (SUITE-DirectSolrConnectionTest-seed#[E448390C8F21B6F2]-worker) [ ] o.a.s.m.SolrMetricManager Closing metric reporters for registry=solr.jvm, tag=null
[junit4] 2> 48645 INFO (SUITE-DirectSolrConnectionTest-seed#[E448390C8F21B6F2]-worker) [ ] o.a.s.m.SolrMetricManager Closing metric reporters for registry=solr.jetty, tag=null
[junit4] 2> 48645 INFO (SUITE-DirectSolrConnectionTest-seed#[E448390C8F21B6F2]-worker) [ ] o.a.s.c.TransientSolrCoreCacheDefault Allocating transient cache for 2147483647 transient cores
[junit4] 2> 48647 INFO (coreCloseExecutor-158-thread-1) [ x:collection1] o.a.s.c.SolrCore [collection1] CLOSING SolrCore org.apache.solr.core.SolrCore@28bca27b
[junit4] 2> 48649 INFO (coreCloseExecutor-158-thread-1) [ x:collection1] o.a.s.m.SolrMetricManager Closing metric reporters for registry=solr.core.collection1, tag=683451003
[junit4] 2> 48653 INFO (SUITE-DirectSolrConnectionTest-seed#[E448390C8F21B6F2]-worker) [ ] o.a.s.SolrTestCaseJ4 ------------------------------------------------------- Done waiting for tracked resources to be released
[junit4] 2> NOTE: test params are: codec=Lucene70, sim=RandomSimilarity(queryNorm=false): {}, locale=sq, timezone=Asia/Chungking
[junit4] 2> NOTE: Windows 10 10.0 amd64/Oracle Corporation 1.8.0_131 (64-bit)/cpus=3,threads=1,free=42772264,total=108060672
[junit4] 2> NOTE: All tests run in this JVM: [DistributedVersionInfoTest, SoftAutoCommitTest, TestClusterProperties, TestHighFrequencyDictionaryFactory, DirectSolrConnectionTest]
[junit4] 2> NOTE: reproduce with: ant test -Dtestcase=DirectSolrConnectionTest -Dtests.seed=E448390C8F21B6F2 -Dtests.slow=true -Dtests.locale=sq -Dtests.timezone=Asia/Chungking -Dtests.asserts=true -Dtests.file.encoding=ISO-8859-1
[junit4] ERROR 0.00s J0 | DirectSolrConnectionTest (suite) <<<
[junit4] > Throwable #1: java.io.IOException: Could not remove the following files (in the order of attempts):
[junit4] > C:\Users\jenkins\workspace\Lucene-Solr-7.x-Windows\solr\build\solr-core\test\J0\temp\solr.servlet.DirectSolrConnectionTest_E448390C8F21B6F2-001\init-core-data-001: java.nio.file.AccessDeniedException: C:\Users\jenkins\workspace\Lucene-Solr-7.x-Windows\solr\build\solr-core\test\J0\temp\solr.servlet.DirectSolrConnectionTest_E448390C8F21B6F2-001\init-core-data-001
[junit4] > C:\Users\jenkins\workspace\Lucene-Solr-7.x-Windows\solr\build\solr-core\test\J0\temp\solr.servlet.DirectSolrConnectionTest_E448390C8F21B6F2-001: java.nio.file.DirectoryNotEmptyException: C:\Users\jenkins\workspace\Lucene-Solr-7.x-Windows\solr\build\solr-core\test\J0\temp\solr.servlet.DirectSolrConnectionTest_E448390C8F21B6F2-001
[junit4] > at __randomizedtesting.SeedInfo.seed([E448390C8F21B6F2]:0)
[junit4] > at org.apache.lucene.util.IOUtils.rm(IOUtils.java:329)
[junit4] > at java.lang.Thread.run(Thread.java:748)
[junit4] Completed [9/728 (1!)] on J0 in 0.85s, 2 tests, 1 error <<< FAILURES!
[...truncated 45739 lines...]