You are viewing a plain text version of this content. The canonical link for it is here.
Posted to yarn-dev@hadoop.apache.org by Apache Jenkins Server <je...@builds.apache.org> on 2014/08/29 03:16:28 UTC
Failed: YARN-1964 PreCommit Build #4759
Jira: https://issues.apache.org/jira/browse/YARN-1964
Build: https://builds.apache.org/job/PreCommit-YARN-Build/4759/
###################################################################################
########################## LAST 60 LINES OF THE CONSOLE ###########################
[...truncated 3621 lines...]
NOP
{color:red}-1 overall{color}. Here are the results of testing the latest attachment
http://issues.apache.org/jira/secure/attachment/12642267/yarn-1964-docker.patch
against trunk revision ab638e7.
{color:green}+1 @author{color}. The patch does not contain any @author tags.
{color:green}+1 tests included{color}. The patch appears to include 1 new or modified test files.
{color:green}+1 javac{color}. The applied patch does not increase the total number of javac compiler warnings.
{color:green}+1 javadoc{color}. There were no new javadoc warning messages.
{color:green}+1 eclipse:eclipse{color}. The patch built with eclipse:eclipse.
{color:green}+1 findbugs{color}. The patch does not introduce any new Findbugs (version 2.0.3) warnings.
{color:green}+1 release audit{color}. The applied patch does not increase the total number of release audit warnings.
{color:red}-1 core tests{color}. The following test timeouts occurred in hadoop-yarn-project/hadoop-yarn/hadoop-yarn-api hadoop-yarn-project/hadoop-yarn/hadoop-yarn-common hadoop-yarn-project/hadoop-yarn/hadoop-yarn-server/hadoop-yarn-server-nodemanager hadoop-yarn-project/hadoop-yarn/hadoop-yarn-server/hadoop-yarn-server-resourcemanager:
org.apache.hadoop.yarn.server.resourcemanager.TestSubmitApplicationWithRMHA
{color:green}+1 contrib tests{color}. The patch passed contrib unit tests.
Test results: https://builds.apache.org/job/PreCommit-YARN-Build/4759//testReport/
Console output: https://builds.apache.org/job/PreCommit-YARN-Build/4759//console
This message is automatically generated.
======================================================================
======================================================================
Adding comment to Jira.
======================================================================
======================================================================
Comment added.
195a10fed127bb312ec4813c2a308889265b4f27 logged out
======================================================================
======================================================================
Finished build.
======================================================================
======================================================================
Build step 'Execute shell' marked build as failure
Archiving artifacts
[description-setter] Could not determine description.
Recording test results
Email was triggered for: Failure
Sending email for trigger: Failure
###################################################################################
############################## FAILED TESTS (if any) ##############################
No tests ran.
Failed: YARN-2046 PreCommit Build #4762
Posted by Apache Jenkins Server <je...@builds.apache.org>.
Jira: https://issues.apache.org/jira/browse/YARN-2046
Build: https://builds.apache.org/job/PreCommit-YARN-Build/4762/
###################################################################################
########################## LAST 60 LINES OF THE CONSOLE ###########################
[...truncated 6072 lines...]
{color:green}+1 release audit{color}. The applied patch does not increase the total number of release audit warnings.
{color:red}-1 core tests{color}. The patch failed these unit tests in hadoop-mapreduce-project/hadoop-mapreduce-client/hadoop-mapreduce-client-app hadoop-mapreduce-project/hadoop-mapreduce-client/hadoop-mapreduce-client-core hadoop-mapreduce-project/hadoop-mapreduce-client/hadoop-mapreduce-client-hs hadoop-mapreduce-project/hadoop-mapreduce-client/hadoop-mapreduce-client-jobclient:
org.apache.hadoop.mapreduce.v2.app.webapp.TestAMWebServicesAttempts
org.apache.hadoop.mapreduce.v2.app.webapp.TestAMWebServices
org.apache.hadoop.mapreduce.v2.hs.webapp.TestHsWebServices
org.apache.hadoop.mapreduce.v2.hs.webapp.TestHsWebServicesAttempts
org.apache.hadoop.mapreduce.v2.hs.webapp.TestHsWebServicesTasks
org.apache.hadoop.mapreduce.v2.hs.webapp.TestHsWebServicesJobsQuery
org.apache.hadoop.mapred.TestMiniMRClientCluster
org.apache.hadoop.mapred.TestMiniMRChildTask
The following test timeouts occurred in hadoop-mapreduce-project/hadoop-mapreduce-client/hadoop-mapreduce-client-app hadoop-mapreduce-project/hadoop-mapreduce-client/hadoop-mapreduce-client-core hadoop-mapreduce-project/hadoop-mapreduce-client/hadoop-mapreduce-client-hs hadoop-mapreduce-project/hadoop-mapreduce-client/hadoop-mapreduce-client-jobclient:
org.apache.hadoopTests
org.apache.hadoop.mapreducTests
org.apache.hadoop.mapreTests
org.apache.haTests
org.apache.hadoop.maTests
org.apache.hadoop.mapreduce.v2.appTests
org.apache.hadoop.mapred.TestMultipleLevelCaching
org.apache.hadoop.mapred.TestReporter
org.apache.hadoop.mapreduce.TestLargeSort
{color:green}+1 contrib tests{color}. The patch passed contrib unit tests.
Test results: https://builds.apache.org/job/PreCommit-YARN-Build/4762//testReport/
Javac warnings: https://builds.apache.org/job/PreCommit-YARN-Build/4762//artifact/trunk/patchprocess/diffJavacWarnings.txt
Console output: https://builds.apache.org/job/PreCommit-YARN-Build/4762//console
This message is automatically generated.
======================================================================
======================================================================
Adding comment to Jira.
======================================================================
======================================================================
Comment added.
7ab1fe7c4cd5c7284e20aac4ed0f78f855257469 logged out
======================================================================
======================================================================
Finished build.
======================================================================
======================================================================
Build step 'Execute shell' marked build as failure
Archiving artifacts
[description-setter] Could not determine description.
Recording test results
Email was triggered for: Failure
Sending email for trigger: Failure
###################################################################################
############################## FAILED TESTS (if any) ##############################
No tests ran.
Failed: YARN-2468 PreCommit Build #4761
Posted by Apache Jenkins Server <je...@builds.apache.org>.
Jira: https://issues.apache.org/jira/browse/YARN-2468
Build: https://builds.apache.org/job/PreCommit-YARN-Build/4761/
###################################################################################
########################## LAST 60 LINES OF THE CONSOLE ###########################
[...truncated 2835 lines...]
/bin/kill -9 30840
NOP
{color:red}-1 overall{color}. Here are the results of testing the latest attachment
http://issues.apache.org/jira/secure/attachment/12665186/YARN-2468.1.patch
against trunk revision d8774cc.
{color:green}+1 @author{color}. The patch does not contain any @author tags.
{color:green}+1 tests included{color}. The patch appears to include 2 new or modified test files.
{color:green}+1 javac{color}. The applied patch does not increase the total number of javac compiler warnings.
{color:green}+1 javadoc{color}. There were no new javadoc warning messages.
{color:green}+1 eclipse:eclipse{color}. The patch built with eclipse:eclipse.
{color:red}-1 findbugs{color}. The patch appears to cause Findbugs (version 2.0.3) to fail.
{color:green}+1 release audit{color}. The applied patch does not increase the total number of release audit warnings.
{color:green}+1 core tests{color}. The patch passed unit tests in .
{color:green}+1 contrib tests{color}. The patch passed contrib unit tests.
Test results: https://builds.apache.org/job/PreCommit-YARN-Build/4761//testReport/
Console output: https://builds.apache.org/job/PreCommit-YARN-Build/4761//console
This message is automatically generated.
======================================================================
======================================================================
Adding comment to Jira.
======================================================================
======================================================================
Comment added.
bb3ca2eb380bda413d207454eed57531fe0e256f logged out
======================================================================
======================================================================
Finished build.
======================================================================
======================================================================
Build step 'Execute shell' marked build as failure
Archiving artifacts
[description-setter] Could not determine description.
Recording test results
Email was triggered for: Failure
Sending email for trigger: Failure
###################################################################################
############################## FAILED TESTS (if any) ##############################
No tests ran.
Failed: YARN-2405 PreCommit Build #4760
Posted by Apache Jenkins Server <je...@builds.apache.org>.
Jira: https://issues.apache.org/jira/browse/YARN-2405
Build: https://builds.apache.org/job/PreCommit-YARN-Build/4760/
###################################################################################
########################## LAST 60 LINES OF THE CONSOLE ###########################
[...truncated 3043 lines...]
NOP
{color:green}+1 overall{color}. Here are the results of testing the latest attachment
http://issues.apache.org/jira/secure/attachment/12665181/YARN-2405.4.patch
against trunk revision d8774cc.
{color:green}+1 @author{color}. The patch does not contain any @author tags.
{color:green}+1 tests included{color}. The patch appears to include 1 new or modified test files.
{color:green}+1 javac{color}. The applied patch does not increase the total number of javac compiler warnings.
{color:green}+1 javadoc{color}. There were no new javadoc warning messages.
{color:green}+1 eclipse:eclipse{color}. The patch built with eclipse:eclipse.
{color:green}+1 findbugs{color}. The patch does not introduce any new Findbugs (version 2.0.3) warnings.
{color:green}+1 release audit{color}. The applied patch does not increase the total number of release audit warnings.
{color:green}+1 core tests{color}. The patch passed unit tests in hadoop-yarn-project/hadoop-yarn/hadoop-yarn-server/hadoop-yarn-server-resourcemanager.
{color:green}+1 contrib tests{color}. The patch passed contrib unit tests.
Test results: https://builds.apache.org/job/PreCommit-YARN-Build/4760//testReport/
Console output: https://builds.apache.org/job/PreCommit-YARN-Build/4760//console
This message is automatically generated.
======================================================================
======================================================================
Adding comment to Jira.
======================================================================
======================================================================
Comment added.
be863f647e8c1af46762636b53b736cc17cf308f logged out
======================================================================
======================================================================
Finished build.
======================================================================
======================================================================
Archiving artifacts
ERROR: No artifacts found that match the file pattern "../patchprocess/*". Configuration error?
ERROR: ?../patchprocess/*? doesn?t match anything, but ?patchprocess/*? does. Perhaps that?s what you mean?
Build step 'Archive the artifacts' changed build result to FAILURE
[description-setter] Could not determine description.
Recording test results
Email was triggered for: Failure
Sending email for trigger: Failure
###################################################################################
############################## FAILED TESTS (if any) ##############################
No tests ran.