You are viewing a plain text version of this content. The canonical link for it is here.
Posted to dev@tez.apache.org by Apache Jenkins Server <je...@builds.apache.org> on 2016/02/17 23:47:39 UTC
Build failed in Jenkins: Tez-Build #1377
See <https://builds.apache.org/job/Tez-Build/1377/changes>
Changes:
[sseth] TEZ-3029. Add an onError method to service plugin contexts. (sseth)
------------------------------------------
[...truncated 2951 lines...]
[INFO] Executing: /bin/sh -c cd <https://builds.apache.org/job/Tez-Build/ws/hadoop-shim-impls> && git rev-parse --verify HEAD
[INFO] Working directory: <https://builds.apache.org/job/Tez-Build/ws/hadoop-shim-impls>
[INFO] Storing buildScmBranch: UNKNOWN
[INFO]
[INFO] --- build-helper-maven-plugin:1.8:maven-version (maven-version) @ hadoop-shim-impls ---
[INFO]
[INFO] --- maven-jar-plugin:2.4:test-jar (default) @ hadoop-shim-impls ---
[WARNING] JAR will be empty - no content was marked for inclusion!
[INFO]
[INFO] ------------------------------------------------------------------------
[INFO] Building hadoop-shim-2.6 0.8.3-SNAPSHOT
[INFO] ------------------------------------------------------------------------
[INFO]
[INFO] --- maven-clean-plugin:2.5:clean (default-clean) @ hadoop-shim-2.6 ---
[INFO] Deleting <https://builds.apache.org/job/Tez-Build/ws/hadoop-shim-impls/hadoop-shim-2.6/target>
[INFO]
[INFO] --- buildnumber-maven-plugin:1.1:create (default) @ hadoop-shim-2.6 ---
[INFO] Checking for local modifications: skipped.
[INFO] Updating project files from SCM: skipped.
[INFO] Executing: /bin/sh -c cd <https://builds.apache.org/job/Tez-Build/ws/hadoop-shim-impls/hadoop-shim-2.6> && git rev-parse --verify HEAD
[INFO] Working directory: <https://builds.apache.org/job/Tez-Build/ws/hadoop-shim-impls/hadoop-shim-2.6>
[INFO] Storing buildNumber: a812c3462808e73b8a59e1852ff2547dcbafbf84 at timestamp: 1455749237602
[INFO] Executing: /bin/sh -c cd <https://builds.apache.org/job/Tez-Build/ws/hadoop-shim-impls/hadoop-shim-2.6> && git rev-parse --verify HEAD
[INFO] Working directory: <https://builds.apache.org/job/Tez-Build/ws/hadoop-shim-impls/hadoop-shim-2.6>
[INFO] Storing buildScmBranch: UNKNOWN
[INFO]
[INFO] --- build-helper-maven-plugin:1.8:maven-version (maven-version) @ hadoop-shim-2.6 ---
[INFO]
[INFO] --- maven-resources-plugin:2.6:resources (default-resources) @ hadoop-shim-2.6 ---
[INFO] Using 'UTF-8' encoding to copy filtered resources.
[INFO] Copying 1 resource
[INFO]
[INFO] --- maven-compiler-plugin:3.1:compile (default-compile) @ hadoop-shim-2.6 ---
[INFO] Changes detected - recompiling the module!
[INFO] Compiling 2 source files to <https://builds.apache.org/job/Tez-Build/ws/hadoop-shim-impls/hadoop-shim-2.6/target/classes>
[INFO]
[INFO] --- maven-resources-plugin:2.6:testResources (default-testResources) @ hadoop-shim-2.6 ---
[INFO] Using 'UTF-8' encoding to copy filtered resources.
[INFO] skip non existing resourceDirectory <https://builds.apache.org/job/Tez-Build/ws/hadoop-shim-impls/hadoop-shim-2.6/src/test/resources>
[INFO]
[INFO] --- maven-compiler-plugin:3.1:testCompile (default-testCompile) @ hadoop-shim-2.6 ---
[INFO] Changes detected - recompiling the module!
[INFO] Compiling 1 source file to <https://builds.apache.org/job/Tez-Build/ws/hadoop-shim-impls/hadoop-shim-2.6/target/test-classes>
[INFO]
[INFO] --- maven-surefire-plugin:2.14.1:test (default-test) @ hadoop-shim-2.6 ---
[INFO] Surefire report directory: <https://builds.apache.org/job/Tez-Build/ws/hadoop-shim-impls/hadoop-shim-2.6/target/surefire-reports>
-------------------------------------------------------
T E S T S
-------------------------------------------------------
-------------------------------------------------------
T E S T S
-------------------------------------------------------
Running org.apache.tez.hadoop.shim.TestHadoop25_26_27ShimProvider
Tests run: 4, Failures: 0, Errors: 0, Skipped: 0, Time elapsed: 0.268 sec
Results :
Tests run: 4, Failures: 0, Errors: 0, Skipped: 0
[INFO]
[INFO] --- buildnumber-maven-plugin:1.1:create (default) @ hadoop-shim-2.6 ---
[INFO] Checking for local modifications: skipped.
[INFO] Updating project files from SCM: skipped.
[INFO] Executing: /bin/sh -c cd <https://builds.apache.org/job/Tez-Build/ws/hadoop-shim-impls/hadoop-shim-2.6> && git rev-parse --verify HEAD
[INFO] Working directory: <https://builds.apache.org/job/Tez-Build/ws/hadoop-shim-impls/hadoop-shim-2.6>
[INFO] Storing buildNumber: a812c3462808e73b8a59e1852ff2547dcbafbf84 at timestamp: 1455749238381
[INFO] Executing: /bin/sh -c cd <https://builds.apache.org/job/Tez-Build/ws/hadoop-shim-impls/hadoop-shim-2.6> && git rev-parse --verify HEAD
[INFO] Working directory: <https://builds.apache.org/job/Tez-Build/ws/hadoop-shim-impls/hadoop-shim-2.6>
[INFO] Storing buildScmBranch: UNKNOWN
[INFO]
[INFO] --- build-helper-maven-plugin:1.8:maven-version (maven-version) @ hadoop-shim-2.6 ---
[INFO]
[INFO] --- maven-resources-plugin:2.6:resources (default-resources) @ hadoop-shim-2.6 ---
[INFO] Using 'UTF-8' encoding to copy filtered resources.
[INFO] Copying 1 resource
[INFO]
[INFO] --- maven-compiler-plugin:3.1:compile (default-compile) @ hadoop-shim-2.6 ---
[INFO] Nothing to compile - all classes are up to date
[INFO]
[INFO] --- maven-resources-plugin:2.6:testResources (default-testResources) @ hadoop-shim-2.6 ---
[INFO] Using 'UTF-8' encoding to copy filtered resources.
[INFO] skip non existing resourceDirectory <https://builds.apache.org/job/Tez-Build/ws/hadoop-shim-impls/hadoop-shim-2.6/src/test/resources>
[INFO]
[INFO] --- maven-compiler-plugin:3.1:testCompile (default-testCompile) @ hadoop-shim-2.6 ---
[INFO] Nothing to compile - all classes are up to date
[INFO]
[INFO] --- maven-surefire-plugin:2.14.1:test (default-test) @ hadoop-shim-2.6 ---
[INFO] Skipping execution of surefire because it has already been run for this configuration
[INFO]
[INFO] --- maven-jar-plugin:2.4:jar (default-jar) @ hadoop-shim-2.6 ---
[INFO] Building jar: <https://builds.apache.org/job/Tez-Build/ws/hadoop-shim-impls/hadoop-shim-2.6/target/hadoop-shim-2.6-0.8.3-SNAPSHOT.jar>
[INFO]
[INFO] --- maven-jar-plugin:2.4:test-jar (default) @ hadoop-shim-2.6 ---
[INFO] Building jar: <https://builds.apache.org/job/Tez-Build/ws/hadoop-shim-impls/hadoop-shim-2.6/target/hadoop-shim-2.6-0.8.3-SNAPSHOT-tests.jar>
[INFO]
[INFO] --- maven-install-plugin:2.4:install (default-install) @ hadoop-shim-2.6 ---
[INFO] Installing <https://builds.apache.org/job/Tez-Build/ws/hadoop-shim-impls/hadoop-shim-2.6/target/hadoop-shim-2.6-0.8.3-SNAPSHOT.jar> to /home/jenkins/.m2/repository/org/apache/tez/hadoop-shim-2.6/0.8.3-SNAPSHOT/hadoop-shim-2.6-0.8.3-SNAPSHOT.jar
[INFO] Installing <https://builds.apache.org/job/Tez-Build/ws/hadoop-shim-impls/hadoop-shim-2.6/pom.xml> to /home/jenkins/.m2/repository/org/apache/tez/hadoop-shim-2.6/0.8.3-SNAPSHOT/hadoop-shim-2.6-0.8.3-SNAPSHOT.pom
[INFO] Installing <https://builds.apache.org/job/Tez-Build/ws/hadoop-shim-impls/hadoop-shim-2.6/target/hadoop-shim-2.6-0.8.3-SNAPSHOT-tests.jar> to /home/jenkins/.m2/repository/org/apache/tez/hadoop-shim-2.6/0.8.3-SNAPSHOT/hadoop-shim-2.6-0.8.3-SNAPSHOT-tests.jar
[INFO]
[INFO] --- maven-deploy-plugin:2.8.1:deploy (default-deploy) @ hadoop-shim-2.6 ---
[INFO] Deploying org.apache.tez:hadoop-shim-2.6:0.8.3-SNAPSHOT at end
[INFO]
[INFO] --- buildnumber-maven-plugin:1.1:create (default) @ hadoop-shim-2.6 ---
[INFO] Checking for local modifications: skipped.
[INFO] Updating project files from SCM: skipped.
[INFO] Executing: /bin/sh -c cd <https://builds.apache.org/job/Tez-Build/ws/hadoop-shim-impls/hadoop-shim-2.6> && git rev-parse --verify HEAD
[INFO] Working directory: <https://builds.apache.org/job/Tez-Build/ws/hadoop-shim-impls/hadoop-shim-2.6>
[INFO] Storing buildNumber: a812c3462808e73b8a59e1852ff2547dcbafbf84 at timestamp: 1455749238510
[INFO] Executing: /bin/sh -c cd <https://builds.apache.org/job/Tez-Build/ws/hadoop-shim-impls/hadoop-shim-2.6> && git rev-parse --verify HEAD
[INFO] Working directory: <https://builds.apache.org/job/Tez-Build/ws/hadoop-shim-impls/hadoop-shim-2.6>
[INFO] Storing buildScmBranch: UNKNOWN
[INFO]
[INFO] --- build-helper-maven-plugin:1.8:maven-version (maven-version) @ hadoop-shim-2.6 ---
[INFO]
[INFO] --- maven-resources-plugin:2.6:resources (default-resources) @ hadoop-shim-2.6 ---
[INFO] Using 'UTF-8' encoding to copy filtered resources.
[INFO] Copying 1 resource
[INFO]
[INFO] --- maven-compiler-plugin:3.1:compile (default-compile) @ hadoop-shim-2.6 ---
[INFO] Nothing to compile - all classes are up to date
[INFO]
[INFO] --- maven-resources-plugin:2.6:testResources (default-testResources) @ hadoop-shim-2.6 ---
[INFO] Using 'UTF-8' encoding to copy filtered resources.
[INFO] skip non existing resourceDirectory <https://builds.apache.org/job/Tez-Build/ws/hadoop-shim-impls/hadoop-shim-2.6/src/test/resources>
[INFO]
[INFO] --- maven-compiler-plugin:3.1:testCompile (default-testCompile) @ hadoop-shim-2.6 ---
[INFO] Nothing to compile - all classes are up to date
[INFO]
[INFO] --- maven-surefire-plugin:2.14.1:test (default-test) @ hadoop-shim-2.6 ---
[INFO] Skipping execution of surefire because it has already been run for this configuration
[INFO]
[INFO] --- maven-jar-plugin:2.4:jar (default-jar) @ hadoop-shim-2.6 ---
[INFO]
[INFO] --- maven-jar-plugin:2.4:test-jar (default) @ hadoop-shim-2.6 ---
[INFO]
[INFO] ------------------------------------------------------------------------
[INFO] Skipping tez-dist
[INFO] This project has been banned from the build due to previous failures.
[INFO] ------------------------------------------------------------------------
[INFO]
[INFO] ------------------------------------------------------------------------
[INFO] Building Tez 0.8.3-SNAPSHOT
[INFO] ------------------------------------------------------------------------
[INFO]
[INFO] --- maven-clean-plugin:2.5:clean (default-clean) @ tez-docs ---
[INFO] Deleting <https://builds.apache.org/job/Tez-Build/ws/docs/target>
[INFO]
[INFO] --- buildnumber-maven-plugin:1.1:create (default) @ tez-docs ---
[INFO] Checking for local modifications: skipped.
[INFO] Updating project files from SCM: skipped.
[INFO] Executing: /bin/sh -c cd <https://builds.apache.org/job/Tez-Build/ws/docs> && git rev-parse --verify HEAD
[INFO] Working directory: <https://builds.apache.org/job/Tez-Build/ws/docs>
[INFO] Storing buildNumber: a812c3462808e73b8a59e1852ff2547dcbafbf84 at timestamp: 1455749238564
[INFO] Executing: /bin/sh -c cd <https://builds.apache.org/job/Tez-Build/ws/docs> && git rev-parse --verify HEAD
[INFO] Working directory: <https://builds.apache.org/job/Tez-Build/ws/docs>
[INFO] Storing buildScmBranch: UNKNOWN
[INFO]
[INFO] --- build-helper-maven-plugin:1.8:maven-version (maven-version) @ tez-docs ---
[INFO]
[INFO] --- buildnumber-maven-plugin:1.1:create (default) @ tez-docs ---
[INFO] Checking for local modifications: skipped.
[INFO] Updating project files from SCM: skipped.
[INFO] Executing: /bin/sh -c cd <https://builds.apache.org/job/Tez-Build/ws/docs> && git rev-parse --verify HEAD
[INFO] Working directory: <https://builds.apache.org/job/Tez-Build/ws/docs>
[INFO] Storing buildNumber: a812c3462808e73b8a59e1852ff2547dcbafbf84 at timestamp: 1455749238576
[INFO] Executing: /bin/sh -c cd <https://builds.apache.org/job/Tez-Build/ws/docs> && git rev-parse --verify HEAD
[INFO] Working directory: <https://builds.apache.org/job/Tez-Build/ws/docs>
[INFO] Storing buildScmBranch: UNKNOWN
[INFO]
[INFO] --- build-helper-maven-plugin:1.8:maven-version (maven-version) @ tez-docs ---
[INFO]
[INFO] --- maven-jar-plugin:2.4:test-jar (default) @ tez-docs ---
[WARNING] JAR will be empty - no content was marked for inclusion!
[INFO] Building jar: <https://builds.apache.org/job/Tez-Build/ws/docs/target/tez-docs-0.8.3-SNAPSHOT-tests.jar>
[INFO]
[INFO] --- maven-install-plugin:2.4:install (default-install) @ tez-docs ---
[INFO] Installing <https://builds.apache.org/job/Tez-Build/ws/docs/pom.xml> to /home/jenkins/.m2/repository/org/apache/tez/tez-docs/0.8.3-SNAPSHOT/tez-docs-0.8.3-SNAPSHOT.pom
[INFO] Installing <https://builds.apache.org/job/Tez-Build/ws/docs/target/tez-docs-0.8.3-SNAPSHOT-tests.jar> to /home/jenkins/.m2/repository/org/apache/tez/tez-docs/0.8.3-SNAPSHOT/tez-docs-0.8.3-SNAPSHOT-tests.jar
[INFO]
[INFO] --- maven-deploy-plugin:2.8.1:deploy (default-deploy) @ tez-docs ---
[INFO] Skipping artifact deployment
[INFO]
[INFO] --- buildnumber-maven-plugin:1.1:create (default) @ tez-docs ---
[INFO] Checking for local modifications: skipped.
[INFO] Updating project files from SCM: skipped.
[INFO] Executing: /bin/sh -c cd <https://builds.apache.org/job/Tez-Build/ws/docs> && git rev-parse --verify HEAD
[INFO] Working directory: <https://builds.apache.org/job/Tez-Build/ws/docs>
[INFO] Storing buildNumber: a812c3462808e73b8a59e1852ff2547dcbafbf84 at timestamp: 1455749238657
[INFO] Executing: /bin/sh -c cd <https://builds.apache.org/job/Tez-Build/ws/docs> && git rev-parse --verify HEAD
[INFO] Working directory: <https://builds.apache.org/job/Tez-Build/ws/docs>
[INFO] Storing buildScmBranch: UNKNOWN
[INFO]
[INFO] --- build-helper-maven-plugin:1.8:maven-version (maven-version) @ tez-docs ---
[INFO]
[INFO] --- maven-jar-plugin:2.4:test-jar (default) @ tez-docs ---
[WARNING] JAR will be empty - no content was marked for inclusion!
[INFO] ------------------------------------------------------------------------
[INFO] Reactor Summary:
[INFO]
[INFO] tez ............................................... SUCCESS [ 2.757 s]
[INFO] hadoop-shim ....................................... SUCCESS [ 4.258 s]
[INFO] tez-api ........................................... SUCCESS [01:00 min]
[INFO] tez-common ........................................ SUCCESS [ 6.133 s]
[INFO] tez-runtime-internals ............................. SUCCESS [ 16.215 s]
[INFO] tez-runtime-library ............................... SUCCESS [03:19 min]
[INFO] tez-mapreduce ..................................... SUCCESS [ 42.095 s]
[INFO] tez-examples ...................................... SUCCESS [ 0.564 s]
[INFO] tez-dag ........................................... SUCCESS [02:50 min]
[INFO] tez-tests ......................................... FAILURE [40:04 min]
[INFO] tez-ext-service-tests ............................. SKIPPED
[INFO] tez-ui ............................................ SUCCESS [ 57.921 s]
[INFO] tez-plugins ....................................... SUCCESS [ 0.165 s]
[INFO] tez-yarn-timeline-history ......................... SKIPPED
[INFO] tez-yarn-timeline-history-with-acls ............... SKIPPED
[INFO] tez-history-parser ................................ SKIPPED
[INFO] tez-tools ......................................... SUCCESS [ 0.160 s]
[INFO] tez-perf-analyzer ................................. SUCCESS [ 0.145 s]
[INFO] tez-job-analyzer .................................. SKIPPED
[INFO] tez-javadoc-tools ................................. SUCCESS [ 0.436 s]
[INFO] hadoop-shim-impls ................................. SUCCESS [ 0.200 s]
[INFO] hadoop-shim-2.6 ................................... SUCCESS [ 0.995 s]
[INFO] tez-dist .......................................... SKIPPED
[INFO] Tez ............................................... SUCCESS [ 0.122 s]
[INFO] ------------------------------------------------------------------------
[INFO] BUILD FAILURE
[INFO] ------------------------------------------------------------------------
[INFO] Total time: 49:28 min
[INFO] Finished at: 2016-02-17T22:47:18+00:00
[INFO] Final Memory: 44M/847M
[INFO] ------------------------------------------------------------------------
[ERROR] Failed to execute goal org.apache.maven.plugins:maven-surefire-plugin:2.14.1:test (default-test) on project tez-tests: There are test failures.
[ERROR]
[ERROR] Please refer to <https://builds.apache.org/job/Tez-Build/ws/tez-tests/target/surefire-reports> for the individual test results.
[ERROR] -> [Help 1]
[ERROR]
[ERROR] To see the full stack trace of the errors, re-run Maven with the -e switch.
[ERROR] Re-run Maven using the -X switch to enable full debug logging.
[ERROR]
[ERROR] For more information about the errors and possible solutions, please read the following articles:
[ERROR] [Help 1] http://cwiki.apache.org/confluence/display/MAVEN/MojoFailureException
[ERROR]
[ERROR] After correcting the problems, you can resume the build with the command
[ERROR] mvn <goals> -rf :tez-tests
Build step 'Execute shell' marked build as failure
Archiving artifacts
Recording test results
Jenkins build is back to normal : Tez-Build #1382
Posted by Apache Jenkins Server <je...@builds.apache.org>.
See <https://builds.apache.org/job/Tez-Build/1382/changes>
Build failed in Jenkins: Tez-Build #1381
Posted by Apache Jenkins Server <je...@builds.apache.org>.
See <https://builds.apache.org/job/Tez-Build/1381/changes>
Changes:
[hitesh] TEZ-3131. Support a way to override test_root_dir for
------------------------------------------
[...truncated 2965 lines...]
[INFO] Working directory: <https://builds.apache.org/job/Tez-Build/ws/hadoop-shim-impls>
[INFO] Storing buildScmBranch: UNKNOWN
[INFO]
[INFO] --- build-helper-maven-plugin:1.8:maven-version (maven-version) @ hadoop-shim-impls ---
[INFO]
[INFO] --- maven-jar-plugin:2.4:test-jar (default) @ hadoop-shim-impls ---
[WARNING] JAR will be empty - no content was marked for inclusion!
[INFO]
[INFO] ------------------------------------------------------------------------
[INFO] Building hadoop-shim-2.6 0.8.3-SNAPSHOT
[INFO] ------------------------------------------------------------------------
[INFO]
[INFO] --- maven-clean-plugin:2.5:clean (default-clean) @ hadoop-shim-2.6 ---
[INFO] Deleting <https://builds.apache.org/job/Tez-Build/ws/hadoop-shim-impls/hadoop-shim-2.6/target>
[INFO]
[INFO] --- buildnumber-maven-plugin:1.1:create (default) @ hadoop-shim-2.6 ---
[INFO] Checking for local modifications: skipped.
[INFO] Updating project files from SCM: skipped.
[INFO] Executing: /bin/sh -c cd <https://builds.apache.org/job/Tez-Build/ws/hadoop-shim-impls/hadoop-shim-2.6> && git rev-parse --verify HEAD
[INFO] Working directory: <https://builds.apache.org/job/Tez-Build/ws/hadoop-shim-impls/hadoop-shim-2.6>
[INFO] Storing buildNumber: 44ca2295f8209dd83041e426d0dca95721461de6 at timestamp: 1456192815715
[INFO] Executing: /bin/sh -c cd <https://builds.apache.org/job/Tez-Build/ws/hadoop-shim-impls/hadoop-shim-2.6> && git rev-parse --verify HEAD
[INFO] Working directory: <https://builds.apache.org/job/Tez-Build/ws/hadoop-shim-impls/hadoop-shim-2.6>
[INFO] Storing buildScmBranch: UNKNOWN
[INFO]
[INFO] --- build-helper-maven-plugin:1.8:maven-version (maven-version) @ hadoop-shim-2.6 ---
[INFO]
[INFO] --- maven-resources-plugin:2.6:resources (default-resources) @ hadoop-shim-2.6 ---
[INFO] Using 'UTF-8' encoding to copy filtered resources.
[INFO] Copying 1 resource
[INFO]
[INFO] --- maven-compiler-plugin:3.1:compile (default-compile) @ hadoop-shim-2.6 ---
[INFO] Changes detected - recompiling the module!
[INFO] Compiling 2 source files to <https://builds.apache.org/job/Tez-Build/ws/hadoop-shim-impls/hadoop-shim-2.6/target/classes>
[INFO]
[INFO] --- maven-resources-plugin:2.6:testResources (default-testResources) @ hadoop-shim-2.6 ---
[INFO] Using 'UTF-8' encoding to copy filtered resources.
[INFO] skip non existing resourceDirectory <https://builds.apache.org/job/Tez-Build/ws/hadoop-shim-impls/hadoop-shim-2.6/src/test/resources>
[INFO]
[INFO] --- maven-compiler-plugin:3.1:testCompile (default-testCompile) @ hadoop-shim-2.6 ---
[INFO] Changes detected - recompiling the module!
[INFO] Compiling 1 source file to <https://builds.apache.org/job/Tez-Build/ws/hadoop-shim-impls/hadoop-shim-2.6/target/test-classes>
[INFO]
[INFO] --- maven-surefire-plugin:2.14.1:test (default-test) @ hadoop-shim-2.6 ---
[INFO] Surefire report directory: <https://builds.apache.org/job/Tez-Build/ws/hadoop-shim-impls/hadoop-shim-2.6/target/surefire-reports>
-------------------------------------------------------
T E S T S
-------------------------------------------------------
-------------------------------------------------------
T E S T S
-------------------------------------------------------
Running org.apache.tez.hadoop.shim.TestHadoop25_26_27ShimProvider
Tests run: 4, Failures: 0, Errors: 0, Skipped: 0, Time elapsed: 0.234 sec
Results :
Tests run: 4, Failures: 0, Errors: 0, Skipped: 0
[INFO]
[INFO] --- buildnumber-maven-plugin:1.1:create (default) @ hadoop-shim-2.6 ---
[INFO] Checking for local modifications: skipped.
[INFO] Updating project files from SCM: skipped.
[INFO] Executing: /bin/sh -c cd <https://builds.apache.org/job/Tez-Build/ws/hadoop-shim-impls/hadoop-shim-2.6> && git rev-parse --verify HEAD
[INFO] Working directory: <https://builds.apache.org/job/Tez-Build/ws/hadoop-shim-impls/hadoop-shim-2.6>
[INFO] Storing buildNumber: 44ca2295f8209dd83041e426d0dca95721461de6 at timestamp: 1456192816454
[INFO] Executing: /bin/sh -c cd <https://builds.apache.org/job/Tez-Build/ws/hadoop-shim-impls/hadoop-shim-2.6> && git rev-parse --verify HEAD
[INFO] Working directory: <https://builds.apache.org/job/Tez-Build/ws/hadoop-shim-impls/hadoop-shim-2.6>
[INFO] Storing buildScmBranch: UNKNOWN
[INFO]
[INFO] --- build-helper-maven-plugin:1.8:maven-version (maven-version) @ hadoop-shim-2.6 ---
[INFO]
[INFO] --- maven-resources-plugin:2.6:resources (default-resources) @ hadoop-shim-2.6 ---
[INFO] Using 'UTF-8' encoding to copy filtered resources.
[INFO] Copying 1 resource
[INFO]
[INFO] --- maven-compiler-plugin:3.1:compile (default-compile) @ hadoop-shim-2.6 ---
[INFO] Nothing to compile - all classes are up to date
[INFO]
[INFO] --- maven-resources-plugin:2.6:testResources (default-testResources) @ hadoop-shim-2.6 ---
[INFO] Using 'UTF-8' encoding to copy filtered resources.
[INFO] skip non existing resourceDirectory <https://builds.apache.org/job/Tez-Build/ws/hadoop-shim-impls/hadoop-shim-2.6/src/test/resources>
[INFO]
[INFO] --- maven-compiler-plugin:3.1:testCompile (default-testCompile) @ hadoop-shim-2.6 ---
[INFO] Nothing to compile - all classes are up to date
[INFO]
[INFO] --- maven-surefire-plugin:2.14.1:test (default-test) @ hadoop-shim-2.6 ---
[INFO] Skipping execution of surefire because it has already been run for this configuration
[INFO]
[INFO] --- maven-jar-plugin:2.4:jar (default-jar) @ hadoop-shim-2.6 ---
[INFO] Building jar: <https://builds.apache.org/job/Tez-Build/ws/hadoop-shim-impls/hadoop-shim-2.6/target/hadoop-shim-2.6-0.8.3-SNAPSHOT.jar>
[INFO]
[INFO] --- maven-jar-plugin:2.4:test-jar (default) @ hadoop-shim-2.6 ---
[INFO] Building jar: <https://builds.apache.org/job/Tez-Build/ws/hadoop-shim-impls/hadoop-shim-2.6/target/hadoop-shim-2.6-0.8.3-SNAPSHOT-tests.jar>
[INFO]
[INFO] --- maven-install-plugin:2.4:install (default-install) @ hadoop-shim-2.6 ---
[INFO] Installing <https://builds.apache.org/job/Tez-Build/ws/hadoop-shim-impls/hadoop-shim-2.6/target/hadoop-shim-2.6-0.8.3-SNAPSHOT.jar> to /home/jenkins/.m2/repository/org/apache/tez/hadoop-shim-2.6/0.8.3-SNAPSHOT/hadoop-shim-2.6-0.8.3-SNAPSHOT.jar
[INFO] Installing <https://builds.apache.org/job/Tez-Build/ws/hadoop-shim-impls/hadoop-shim-2.6/pom.xml> to /home/jenkins/.m2/repository/org/apache/tez/hadoop-shim-2.6/0.8.3-SNAPSHOT/hadoop-shim-2.6-0.8.3-SNAPSHOT.pom
[INFO] Installing <https://builds.apache.org/job/Tez-Build/ws/hadoop-shim-impls/hadoop-shim-2.6/target/hadoop-shim-2.6-0.8.3-SNAPSHOT-tests.jar> to /home/jenkins/.m2/repository/org/apache/tez/hadoop-shim-2.6/0.8.3-SNAPSHOT/hadoop-shim-2.6-0.8.3-SNAPSHOT-tests.jar
[INFO]
[INFO] --- maven-deploy-plugin:2.8.1:deploy (default-deploy) @ hadoop-shim-2.6 ---
[INFO] Deploying org.apache.tez:hadoop-shim-2.6:0.8.3-SNAPSHOT at end
[INFO]
[INFO] --- buildnumber-maven-plugin:1.1:create (default) @ hadoop-shim-2.6 ---
[INFO] Checking for local modifications: skipped.
[INFO] Updating project files from SCM: skipped.
[INFO] Executing: /bin/sh -c cd <https://builds.apache.org/job/Tez-Build/ws/hadoop-shim-impls/hadoop-shim-2.6> && git rev-parse --verify HEAD
[INFO] Working directory: <https://builds.apache.org/job/Tez-Build/ws/hadoop-shim-impls/hadoop-shim-2.6>
[INFO] Storing buildNumber: 44ca2295f8209dd83041e426d0dca95721461de6 at timestamp: 1456192816501
[INFO] Executing: /bin/sh -c cd <https://builds.apache.org/job/Tez-Build/ws/hadoop-shim-impls/hadoop-shim-2.6> && git rev-parse --verify HEAD
[INFO] Working directory: <https://builds.apache.org/job/Tez-Build/ws/hadoop-shim-impls/hadoop-shim-2.6>
[INFO] Storing buildScmBranch: UNKNOWN
[INFO]
[INFO] --- build-helper-maven-plugin:1.8:maven-version (maven-version) @ hadoop-shim-2.6 ---
[INFO]
[INFO] --- maven-resources-plugin:2.6:resources (default-resources) @ hadoop-shim-2.6 ---
[INFO] Using 'UTF-8' encoding to copy filtered resources.
[INFO] Copying 1 resource
[INFO]
[INFO] --- maven-compiler-plugin:3.1:compile (default-compile) @ hadoop-shim-2.6 ---
[INFO] Nothing to compile - all classes are up to date
[INFO]
[INFO] --- maven-resources-plugin:2.6:testResources (default-testResources) @ hadoop-shim-2.6 ---
[INFO] Using 'UTF-8' encoding to copy filtered resources.
[INFO] skip non existing resourceDirectory <https://builds.apache.org/job/Tez-Build/ws/hadoop-shim-impls/hadoop-shim-2.6/src/test/resources>
[INFO]
[INFO] --- maven-compiler-plugin:3.1:testCompile (default-testCompile) @ hadoop-shim-2.6 ---
[INFO] Nothing to compile - all classes are up to date
[INFO]
[INFO] --- maven-surefire-plugin:2.14.1:test (default-test) @ hadoop-shim-2.6 ---
[INFO] Skipping execution of surefire because it has already been run for this configuration
[INFO]
[INFO] --- maven-jar-plugin:2.4:jar (default-jar) @ hadoop-shim-2.6 ---
[INFO]
[INFO] --- maven-jar-plugin:2.4:test-jar (default) @ hadoop-shim-2.6 ---
[INFO]
[INFO] ------------------------------------------------------------------------
[INFO] Skipping tez-dist
[INFO] This project has been banned from the build due to previous failures.
[INFO] ------------------------------------------------------------------------
[INFO]
[INFO] ------------------------------------------------------------------------
[INFO] Building Tez 0.8.3-SNAPSHOT
[INFO] ------------------------------------------------------------------------
[INFO]
[INFO] --- maven-clean-plugin:2.5:clean (default-clean) @ tez-docs ---
[INFO] Deleting <https://builds.apache.org/job/Tez-Build/ws/docs/target>
[INFO]
[INFO] --- buildnumber-maven-plugin:1.1:create (default) @ tez-docs ---
[INFO] Checking for local modifications: skipped.
[INFO] Updating project files from SCM: skipped.
[INFO] Executing: /bin/sh -c cd <https://builds.apache.org/job/Tez-Build/ws/docs> && git rev-parse --verify HEAD
[INFO] Working directory: <https://builds.apache.org/job/Tez-Build/ws/docs>
[INFO] Storing buildNumber: 44ca2295f8209dd83041e426d0dca95721461de6 at timestamp: 1456192816573
[INFO] Executing: /bin/sh -c cd <https://builds.apache.org/job/Tez-Build/ws/docs> && git rev-parse --verify HEAD
[INFO] Working directory: <https://builds.apache.org/job/Tez-Build/ws/docs>
[INFO] Storing buildScmBranch: UNKNOWN
[INFO]
[INFO] --- build-helper-maven-plugin:1.8:maven-version (maven-version) @ tez-docs ---
[INFO]
[INFO] --- buildnumber-maven-plugin:1.1:create (default) @ tez-docs ---
[INFO] Checking for local modifications: skipped.
[INFO] Updating project files from SCM: skipped.
[INFO] Executing: /bin/sh -c cd <https://builds.apache.org/job/Tez-Build/ws/docs> && git rev-parse --verify HEAD
[INFO] Working directory: <https://builds.apache.org/job/Tez-Build/ws/docs>
[INFO] Storing buildNumber: 44ca2295f8209dd83041e426d0dca95721461de6 at timestamp: 1456192816584
[INFO] Executing: /bin/sh -c cd <https://builds.apache.org/job/Tez-Build/ws/docs> && git rev-parse --verify HEAD
[INFO] Working directory: <https://builds.apache.org/job/Tez-Build/ws/docs>
[INFO] Storing buildScmBranch: UNKNOWN
[INFO]
[INFO] --- build-helper-maven-plugin:1.8:maven-version (maven-version) @ tez-docs ---
[INFO]
[INFO] --- maven-jar-plugin:2.4:test-jar (default) @ tez-docs ---
[WARNING] JAR will be empty - no content was marked for inclusion!
[INFO] Building jar: <https://builds.apache.org/job/Tez-Build/ws/docs/target/tez-docs-0.8.3-SNAPSHOT-tests.jar>
[INFO]
[INFO] --- maven-install-plugin:2.4:install (default-install) @ tez-docs ---
[INFO] Installing <https://builds.apache.org/job/Tez-Build/ws/docs/pom.xml> to /home/jenkins/.m2/repository/org/apache/tez/tez-docs/0.8.3-SNAPSHOT/tez-docs-0.8.3-SNAPSHOT.pom
[INFO] Installing <https://builds.apache.org/job/Tez-Build/ws/docs/target/tez-docs-0.8.3-SNAPSHOT-tests.jar> to /home/jenkins/.m2/repository/org/apache/tez/tez-docs/0.8.3-SNAPSHOT/tez-docs-0.8.3-SNAPSHOT-tests.jar
[INFO]
[INFO] --- maven-deploy-plugin:2.8.1:deploy (default-deploy) @ tez-docs ---
[INFO] Skipping artifact deployment
[INFO]
[INFO] --- buildnumber-maven-plugin:1.1:create (default) @ tez-docs ---
[INFO] Checking for local modifications: skipped.
[INFO] Updating project files from SCM: skipped.
[INFO] Executing: /bin/sh -c cd <https://builds.apache.org/job/Tez-Build/ws/docs> && git rev-parse --verify HEAD
[INFO] Working directory: <https://builds.apache.org/job/Tez-Build/ws/docs>
[INFO] Storing buildNumber: 44ca2295f8209dd83041e426d0dca95721461de6 at timestamp: 1456192816610
[INFO] Executing: /bin/sh -c cd <https://builds.apache.org/job/Tez-Build/ws/docs> && git rev-parse --verify HEAD
[INFO] Working directory: <https://builds.apache.org/job/Tez-Build/ws/docs>
[INFO] Storing buildScmBranch: UNKNOWN
[INFO]
[INFO] --- build-helper-maven-plugin:1.8:maven-version (maven-version) @ tez-docs ---
[INFO]
[INFO] --- maven-jar-plugin:2.4:test-jar (default) @ tez-docs ---
[WARNING] JAR will be empty - no content was marked for inclusion!
[INFO] ------------------------------------------------------------------------
[INFO] Reactor Summary:
[INFO]
[INFO] tez ............................................... SUCCESS [ 1.882 s]
[INFO] hadoop-shim ....................................... SUCCESS [ 3.408 s]
[INFO] tez-api ........................................... SUCCESS [ 55.150 s]
[INFO] tez-common ........................................ SUCCESS [ 5.984 s]
[INFO] tez-runtime-internals ............................. SUCCESS [ 15.323 s]
[INFO] tez-runtime-library ............................... SUCCESS [02:54 min]
[INFO] tez-mapreduce ..................................... SUCCESS [ 41.937 s]
[INFO] tez-examples ...................................... SUCCESS [ 0.432 s]
[INFO] tez-dag ........................................... FAILURE [02:29 min]
[INFO] tez-tests ......................................... SKIPPED
[INFO] tez-ext-service-tests ............................. SKIPPED
[INFO] tez-ui ............................................ SUCCESS [ 48.254 s]
[INFO] tez-plugins ....................................... SUCCESS [ 0.110 s]
[INFO] tez-yarn-timeline-history ......................... SKIPPED
[INFO] tez-yarn-timeline-history-with-acls ............... SKIPPED
[INFO] tez-history-parser ................................ SKIPPED
[INFO] tez-tools ......................................... SUCCESS [ 0.102 s]
[INFO] tez-perf-analyzer ................................. SUCCESS [ 0.064 s]
[INFO] tez-job-analyzer .................................. SKIPPED
[INFO] tez-javadoc-tools ................................. SUCCESS [ 0.464 s]
[INFO] hadoop-shim-impls ................................. SUCCESS [ 0.092 s]
[INFO] hadoop-shim-2.6 ................................... SUCCESS [ 1.150 s]
[INFO] tez-dist .......................................... SKIPPED
[INFO] Tez ............................................... SUCCESS [ 0.088 s]
[INFO] ------------------------------------------------------------------------
[INFO] BUILD FAILURE
[INFO] ------------------------------------------------------------------------
[INFO] Total time: 08:18 min
[INFO] Finished at: 2016-02-23T02:00:16+00:00
[INFO] Final Memory: 71M/989M
[INFO] ------------------------------------------------------------------------
[ERROR] Failed to execute goal org.apache.maven.plugins:maven-surefire-plugin:2.14.1:test (default-test) on project tez-dag: There are test failures.
[ERROR]
[ERROR] Please refer to <https://builds.apache.org/job/Tez-Build/ws/tez-dag/target/surefire-reports> for the individual test results.
[ERROR] -> [Help 1]
[ERROR]
[ERROR] To see the full stack trace of the errors, re-run Maven with the -e switch.
[ERROR] Re-run Maven using the -X switch to enable full debug logging.
[ERROR]
[ERROR] For more information about the errors and possible solutions, please read the following articles:
[ERROR] [Help 1] http://cwiki.apache.org/confluence/display/MAVEN/MojoFailureException
[ERROR]
[ERROR] After correcting the problems, you can resume the build with the command
[ERROR] mvn <goals> -rf :tez-dag
Build step 'Execute shell' marked build as failure
Archiving artifacts
Compressed 52.28 MB of artifacts by 100.0% relative to #1375
Recording test results
Build failed in Jenkins: Tez-Build #1380
Posted by Apache Jenkins Server <je...@builds.apache.org>.
See <https://builds.apache.org/job/Tez-Build/1380/changes>
Changes:
[hitesh] TEZ-3067. Links to tez configs documentation should be bubbled up to
------------------------------------------
[...truncated 2939 lines...]
[INFO] Executing: /bin/sh -c cd <https://builds.apache.org/job/Tez-Build/ws/hadoop-shim-impls> && git rev-parse --verify HEAD
[INFO] Working directory: <https://builds.apache.org/job/Tez-Build/ws/hadoop-shim-impls>
[INFO] Storing buildScmBranch: UNKNOWN
[INFO]
[INFO] --- build-helper-maven-plugin:1.8:maven-version (maven-version) @ hadoop-shim-impls ---
[INFO]
[INFO] --- maven-jar-plugin:2.4:test-jar (default) @ hadoop-shim-impls ---
[WARNING] JAR will be empty - no content was marked for inclusion!
[INFO]
[INFO] ------------------------------------------------------------------------
[INFO] Building hadoop-shim-2.6 0.8.3-SNAPSHOT
[INFO] ------------------------------------------------------------------------
[INFO]
[INFO] --- maven-clean-plugin:2.5:clean (default-clean) @ hadoop-shim-2.6 ---
[INFO] Deleting <https://builds.apache.org/job/Tez-Build/ws/hadoop-shim-impls/hadoop-shim-2.6/target>
[INFO]
[INFO] --- buildnumber-maven-plugin:1.1:create (default) @ hadoop-shim-2.6 ---
[INFO] Checking for local modifications: skipped.
[INFO] Updating project files from SCM: skipped.
[INFO] Executing: /bin/sh -c cd <https://builds.apache.org/job/Tez-Build/ws/hadoop-shim-impls/hadoop-shim-2.6> && git rev-parse --verify HEAD
[INFO] Working directory: <https://builds.apache.org/job/Tez-Build/ws/hadoop-shim-impls/hadoop-shim-2.6>
[INFO] Storing buildNumber: f38e23c48fc87705b5a72984ccf1d0301c3c8db5 at timestamp: 1456126501942
[INFO] Executing: /bin/sh -c cd <https://builds.apache.org/job/Tez-Build/ws/hadoop-shim-impls/hadoop-shim-2.6> && git rev-parse --verify HEAD
[INFO] Working directory: <https://builds.apache.org/job/Tez-Build/ws/hadoop-shim-impls/hadoop-shim-2.6>
[INFO] Storing buildScmBranch: UNKNOWN
[INFO]
[INFO] --- build-helper-maven-plugin:1.8:maven-version (maven-version) @ hadoop-shim-2.6 ---
[INFO]
[INFO] --- maven-resources-plugin:2.6:resources (default-resources) @ hadoop-shim-2.6 ---
[INFO] Using 'UTF-8' encoding to copy filtered resources.
[INFO] Copying 1 resource
[INFO]
[INFO] --- maven-compiler-plugin:3.1:compile (default-compile) @ hadoop-shim-2.6 ---
[INFO] Changes detected - recompiling the module!
[INFO] Compiling 2 source files to <https://builds.apache.org/job/Tez-Build/ws/hadoop-shim-impls/hadoop-shim-2.6/target/classes>
[INFO]
[INFO] --- maven-resources-plugin:2.6:testResources (default-testResources) @ hadoop-shim-2.6 ---
[INFO] Using 'UTF-8' encoding to copy filtered resources.
[INFO] skip non existing resourceDirectory <https://builds.apache.org/job/Tez-Build/ws/hadoop-shim-impls/hadoop-shim-2.6/src/test/resources>
[INFO]
[INFO] --- maven-compiler-plugin:3.1:testCompile (default-testCompile) @ hadoop-shim-2.6 ---
[INFO] Changes detected - recompiling the module!
[INFO] Compiling 1 source file to <https://builds.apache.org/job/Tez-Build/ws/hadoop-shim-impls/hadoop-shim-2.6/target/test-classes>
[INFO]
[INFO] --- maven-surefire-plugin:2.14.1:test (default-test) @ hadoop-shim-2.6 ---
[INFO] Surefire report directory: <https://builds.apache.org/job/Tez-Build/ws/hadoop-shim-impls/hadoop-shim-2.6/target/surefire-reports>
-------------------------------------------------------
T E S T S
-------------------------------------------------------
-------------------------------------------------------
T E S T S
-------------------------------------------------------
Running org.apache.tez.hadoop.shim.TestHadoop25_26_27ShimProvider
Tests run: 4, Failures: 0, Errors: 0, Skipped: 0, Time elapsed: 0.225 sec
Results :
Tests run: 4, Failures: 0, Errors: 0, Skipped: 0
[INFO]
[INFO] --- buildnumber-maven-plugin:1.1:create (default) @ hadoop-shim-2.6 ---
[INFO] Checking for local modifications: skipped.
[INFO] Updating project files from SCM: skipped.
[INFO] Executing: /bin/sh -c cd <https://builds.apache.org/job/Tez-Build/ws/hadoop-shim-impls/hadoop-shim-2.6> && git rev-parse --verify HEAD
[INFO] Working directory: <https://builds.apache.org/job/Tez-Build/ws/hadoop-shim-impls/hadoop-shim-2.6>
[INFO] Storing buildNumber: f38e23c48fc87705b5a72984ccf1d0301c3c8db5 at timestamp: 1456126502548
[INFO] Executing: /bin/sh -c cd <https://builds.apache.org/job/Tez-Build/ws/hadoop-shim-impls/hadoop-shim-2.6> && git rev-parse --verify HEAD
[INFO] Working directory: <https://builds.apache.org/job/Tez-Build/ws/hadoop-shim-impls/hadoop-shim-2.6>
[INFO] Storing buildScmBranch: UNKNOWN
[INFO]
[INFO] --- build-helper-maven-plugin:1.8:maven-version (maven-version) @ hadoop-shim-2.6 ---
[INFO]
[INFO] --- maven-resources-plugin:2.6:resources (default-resources) @ hadoop-shim-2.6 ---
[INFO] Using 'UTF-8' encoding to copy filtered resources.
[INFO] Copying 1 resource
[INFO]
[INFO] --- maven-compiler-plugin:3.1:compile (default-compile) @ hadoop-shim-2.6 ---
[INFO] Nothing to compile - all classes are up to date
[INFO]
[INFO] --- maven-resources-plugin:2.6:testResources (default-testResources) @ hadoop-shim-2.6 ---
[INFO] Using 'UTF-8' encoding to copy filtered resources.
[INFO] skip non existing resourceDirectory <https://builds.apache.org/job/Tez-Build/ws/hadoop-shim-impls/hadoop-shim-2.6/src/test/resources>
[INFO]
[INFO] --- maven-compiler-plugin:3.1:testCompile (default-testCompile) @ hadoop-shim-2.6 ---
[INFO] Nothing to compile - all classes are up to date
[INFO]
[INFO] --- maven-surefire-plugin:2.14.1:test (default-test) @ hadoop-shim-2.6 ---
[INFO] Skipping execution of surefire because it has already been run for this configuration
[INFO]
[INFO] --- maven-jar-plugin:2.4:jar (default-jar) @ hadoop-shim-2.6 ---
[INFO] Building jar: <https://builds.apache.org/job/Tez-Build/ws/hadoop-shim-impls/hadoop-shim-2.6/target/hadoop-shim-2.6-0.8.3-SNAPSHOT.jar>
[INFO]
[INFO] --- maven-jar-plugin:2.4:test-jar (default) @ hadoop-shim-2.6 ---
[INFO] Building jar: <https://builds.apache.org/job/Tez-Build/ws/hadoop-shim-impls/hadoop-shim-2.6/target/hadoop-shim-2.6-0.8.3-SNAPSHOT-tests.jar>
[INFO]
[INFO] --- maven-install-plugin:2.4:install (default-install) @ hadoop-shim-2.6 ---
[INFO] Installing <https://builds.apache.org/job/Tez-Build/ws/hadoop-shim-impls/hadoop-shim-2.6/target/hadoop-shim-2.6-0.8.3-SNAPSHOT.jar> to /home/jenkins/.m2/repository/org/apache/tez/hadoop-shim-2.6/0.8.3-SNAPSHOT/hadoop-shim-2.6-0.8.3-SNAPSHOT.jar
[INFO] Installing <https://builds.apache.org/job/Tez-Build/ws/hadoop-shim-impls/hadoop-shim-2.6/pom.xml> to /home/jenkins/.m2/repository/org/apache/tez/hadoop-shim-2.6/0.8.3-SNAPSHOT/hadoop-shim-2.6-0.8.3-SNAPSHOT.pom
[INFO] Installing <https://builds.apache.org/job/Tez-Build/ws/hadoop-shim-impls/hadoop-shim-2.6/target/hadoop-shim-2.6-0.8.3-SNAPSHOT-tests.jar> to /home/jenkins/.m2/repository/org/apache/tez/hadoop-shim-2.6/0.8.3-SNAPSHOT/hadoop-shim-2.6-0.8.3-SNAPSHOT-tests.jar
[INFO]
[INFO] --- maven-deploy-plugin:2.8.1:deploy (default-deploy) @ hadoop-shim-2.6 ---
[INFO] Deploying org.apache.tez:hadoop-shim-2.6:0.8.3-SNAPSHOT at end
[INFO]
[INFO] --- buildnumber-maven-plugin:1.1:create (default) @ hadoop-shim-2.6 ---
[INFO] Checking for local modifications: skipped.
[INFO] Updating project files from SCM: skipped.
[INFO] Executing: /bin/sh -c cd <https://builds.apache.org/job/Tez-Build/ws/hadoop-shim-impls/hadoop-shim-2.6> && git rev-parse --verify HEAD
[INFO] Working directory: <https://builds.apache.org/job/Tez-Build/ws/hadoop-shim-impls/hadoop-shim-2.6>
[INFO] Storing buildNumber: f38e23c48fc87705b5a72984ccf1d0301c3c8db5 at timestamp: 1456126502612
[INFO] Executing: /bin/sh -c cd <https://builds.apache.org/job/Tez-Build/ws/hadoop-shim-impls/hadoop-shim-2.6> && git rev-parse --verify HEAD
[INFO] Working directory: <https://builds.apache.org/job/Tez-Build/ws/hadoop-shim-impls/hadoop-shim-2.6>
[INFO] Storing buildScmBranch: UNKNOWN
[INFO]
[INFO] --- build-helper-maven-plugin:1.8:maven-version (maven-version) @ hadoop-shim-2.6 ---
[INFO]
[INFO] --- maven-resources-plugin:2.6:resources (default-resources) @ hadoop-shim-2.6 ---
[INFO] Using 'UTF-8' encoding to copy filtered resources.
[INFO] Copying 1 resource
[INFO]
[INFO] --- maven-compiler-plugin:3.1:compile (default-compile) @ hadoop-shim-2.6 ---
[INFO] Nothing to compile - all classes are up to date
[INFO]
[INFO] --- maven-resources-plugin:2.6:testResources (default-testResources) @ hadoop-shim-2.6 ---
[INFO] Using 'UTF-8' encoding to copy filtered resources.
[INFO] skip non existing resourceDirectory <https://builds.apache.org/job/Tez-Build/ws/hadoop-shim-impls/hadoop-shim-2.6/src/test/resources>
[INFO]
[INFO] --- maven-compiler-plugin:3.1:testCompile (default-testCompile) @ hadoop-shim-2.6 ---
[INFO] Nothing to compile - all classes are up to date
[INFO]
[INFO] --- maven-surefire-plugin:2.14.1:test (default-test) @ hadoop-shim-2.6 ---
[INFO] Skipping execution of surefire because it has already been run for this configuration
[INFO]
[INFO] --- maven-jar-plugin:2.4:jar (default-jar) @ hadoop-shim-2.6 ---
[INFO]
[INFO] --- maven-jar-plugin:2.4:test-jar (default) @ hadoop-shim-2.6 ---
[INFO]
[INFO] ------------------------------------------------------------------------
[INFO] Skipping tez-dist
[INFO] This project has been banned from the build due to previous failures.
[INFO] ------------------------------------------------------------------------
[INFO]
[INFO] ------------------------------------------------------------------------
[INFO] Building Tez 0.8.3-SNAPSHOT
[INFO] ------------------------------------------------------------------------
[INFO]
[INFO] --- maven-clean-plugin:2.5:clean (default-clean) @ tez-docs ---
[INFO] Deleting <https://builds.apache.org/job/Tez-Build/ws/docs/target>
[INFO]
[INFO] --- buildnumber-maven-plugin:1.1:create (default) @ tez-docs ---
[INFO] Checking for local modifications: skipped.
[INFO] Updating project files from SCM: skipped.
[INFO] Executing: /bin/sh -c cd <https://builds.apache.org/job/Tez-Build/ws/docs> && git rev-parse --verify HEAD
[INFO] Working directory: <https://builds.apache.org/job/Tez-Build/ws/docs>
[INFO] Storing buildNumber: f38e23c48fc87705b5a72984ccf1d0301c3c8db5 at timestamp: 1456126502646
[INFO] Executing: /bin/sh -c cd <https://builds.apache.org/job/Tez-Build/ws/docs> && git rev-parse --verify HEAD
[INFO] Working directory: <https://builds.apache.org/job/Tez-Build/ws/docs>
[INFO] Storing buildScmBranch: UNKNOWN
[INFO]
[INFO] --- build-helper-maven-plugin:1.8:maven-version (maven-version) @ tez-docs ---
[INFO]
[INFO] --- buildnumber-maven-plugin:1.1:create (default) @ tez-docs ---
[INFO] Checking for local modifications: skipped.
[INFO] Updating project files from SCM: skipped.
[INFO] Executing: /bin/sh -c cd <https://builds.apache.org/job/Tez-Build/ws/docs> && git rev-parse --verify HEAD
[INFO] Working directory: <https://builds.apache.org/job/Tez-Build/ws/docs>
[INFO] Storing buildNumber: f38e23c48fc87705b5a72984ccf1d0301c3c8db5 at timestamp: 1456126502656
[INFO] Executing: /bin/sh -c cd <https://builds.apache.org/job/Tez-Build/ws/docs> && git rev-parse --verify HEAD
[INFO] Working directory: <https://builds.apache.org/job/Tez-Build/ws/docs>
[INFO] Storing buildScmBranch: UNKNOWN
[INFO]
[INFO] --- build-helper-maven-plugin:1.8:maven-version (maven-version) @ tez-docs ---
[INFO]
[INFO] --- maven-jar-plugin:2.4:test-jar (default) @ tez-docs ---
[WARNING] JAR will be empty - no content was marked for inclusion!
[INFO] Building jar: <https://builds.apache.org/job/Tez-Build/ws/docs/target/tez-docs-0.8.3-SNAPSHOT-tests.jar>
[INFO]
[INFO] --- maven-install-plugin:2.4:install (default-install) @ tez-docs ---
[INFO] Installing <https://builds.apache.org/job/Tez-Build/ws/docs/pom.xml> to /home/jenkins/.m2/repository/org/apache/tez/tez-docs/0.8.3-SNAPSHOT/tez-docs-0.8.3-SNAPSHOT.pom
[INFO] Installing <https://builds.apache.org/job/Tez-Build/ws/docs/target/tez-docs-0.8.3-SNAPSHOT-tests.jar> to /home/jenkins/.m2/repository/org/apache/tez/tez-docs/0.8.3-SNAPSHOT/tez-docs-0.8.3-SNAPSHOT-tests.jar
[INFO]
[INFO] --- maven-deploy-plugin:2.8.1:deploy (default-deploy) @ tez-docs ---
[INFO] Skipping artifact deployment
[INFO]
[INFO] --- buildnumber-maven-plugin:1.1:create (default) @ tez-docs ---
[INFO] Checking for local modifications: skipped.
[INFO] Updating project files from SCM: skipped.
[INFO] Executing: /bin/sh -c cd <https://builds.apache.org/job/Tez-Build/ws/docs> && git rev-parse --verify HEAD
[INFO] Working directory: <https://builds.apache.org/job/Tez-Build/ws/docs>
[INFO] Storing buildNumber: f38e23c48fc87705b5a72984ccf1d0301c3c8db5 at timestamp: 1456126502684
[INFO] Executing: /bin/sh -c cd <https://builds.apache.org/job/Tez-Build/ws/docs> && git rev-parse --verify HEAD
[INFO] Working directory: <https://builds.apache.org/job/Tez-Build/ws/docs>
[INFO] Storing buildScmBranch: UNKNOWN
[INFO]
[INFO] --- build-helper-maven-plugin:1.8:maven-version (maven-version) @ tez-docs ---
[INFO]
[INFO] --- maven-jar-plugin:2.4:test-jar (default) @ tez-docs ---
[WARNING] JAR will be empty - no content was marked for inclusion!
[INFO] ------------------------------------------------------------------------
[INFO] Reactor Summary:
[INFO]
[INFO] tez ............................................... SUCCESS [ 1.859 s]
[INFO] hadoop-shim ....................................... SUCCESS [ 2.555 s]
[INFO] tez-api ........................................... SUCCESS [ 52.069 s]
[INFO] tez-common ........................................ SUCCESS [ 5.197 s]
[INFO] tez-runtime-internals ............................. SUCCESS [ 14.265 s]
[INFO] tez-runtime-library ............................... SUCCESS [02:50 min]
[INFO] tez-mapreduce ..................................... SUCCESS [ 35.855 s]
[INFO] tez-examples ...................................... SUCCESS [ 0.373 s]
[INFO] tez-dag ........................................... SUCCESS [02:34 min]
[INFO] tez-tests ......................................... FAILURE [36:54 min]
[INFO] tez-ext-service-tests ............................. SKIPPED
[INFO] tez-ui ............................................ SUCCESS [ 43.074 s]
[INFO] tez-plugins ....................................... SUCCESS [ 0.064 s]
[INFO] tez-yarn-timeline-history ......................... SKIPPED
[INFO] tez-yarn-timeline-history-with-acls ............... SKIPPED
[INFO] tez-history-parser ................................ SKIPPED
[INFO] tez-tools ......................................... SUCCESS [ 0.087 s]
[INFO] tez-perf-analyzer ................................. SUCCESS [ 0.068 s]
[INFO] tez-job-analyzer .................................. SKIPPED
[INFO] tez-javadoc-tools ................................. SUCCESS [ 0.268 s]
[INFO] hadoop-shim-impls ................................. SUCCESS [ 0.071 s]
[INFO] hadoop-shim-2.6 ................................... SUCCESS [ 0.750 s]
[INFO] tez-dist .......................................... SKIPPED
[INFO] Tez ............................................... SUCCESS [ 0.058 s]
[INFO] ------------------------------------------------------------------------
[INFO] BUILD FAILURE
[INFO] ------------------------------------------------------------------------
[INFO] Total time: 44:56 min
[INFO] Finished at: 2016-02-22T07:35:02+00:00
[INFO] Final Memory: 42M/841M
[INFO] ------------------------------------------------------------------------
[ERROR] Failed to execute goal org.apache.maven.plugins:maven-surefire-plugin:2.14.1:test (default-test) on project tez-tests: There are test failures.
[ERROR]
[ERROR] Please refer to <https://builds.apache.org/job/Tez-Build/ws/tez-tests/target/surefire-reports> for the individual test results.
[ERROR] -> [Help 1]
[ERROR]
[ERROR] To see the full stack trace of the errors, re-run Maven with the -e switch.
[ERROR] Re-run Maven using the -X switch to enable full debug logging.
[ERROR]
[ERROR] For more information about the errors and possible solutions, please read the following articles:
[ERROR] [Help 1] http://cwiki.apache.org/confluence/display/MAVEN/MojoFailureException
[ERROR]
[ERROR] After correcting the problems, you can resume the build with the command
[ERROR] mvn <goals> -rf :tez-tests
Build step 'Execute shell' marked build as failure
Archiving artifacts
Recording test results
Build failed in Jenkins: Tez-Build #1379
Posted by Apache Jenkins Server <je...@builds.apache.org>.
See <https://builds.apache.org/job/Tez-Build/1379/changes>
Changes:
[hitesh] TEZ-3123. Containers can get re-used even with conflicting local
------------------------------------------
[...truncated 3002 lines...]
[INFO] Executing: /bin/sh -c cd <https://builds.apache.org/job/Tez-Build/ws/hadoop-shim-impls> && git rev-parse --verify HEAD
[INFO] Working directory: <https://builds.apache.org/job/Tez-Build/ws/hadoop-shim-impls>
[INFO] Storing buildScmBranch: UNKNOWN
[INFO]
[INFO] --- build-helper-maven-plugin:1.8:maven-version (maven-version) @ hadoop-shim-impls ---
[INFO]
[INFO] --- maven-jar-plugin:2.4:test-jar (default) @ hadoop-shim-impls ---
[WARNING] JAR will be empty - no content was marked for inclusion!
[INFO]
[INFO] ------------------------------------------------------------------------
[INFO] Building hadoop-shim-2.6 0.8.3-SNAPSHOT
[INFO] ------------------------------------------------------------------------
[INFO]
[INFO] --- maven-clean-plugin:2.5:clean (default-clean) @ hadoop-shim-2.6 ---
[INFO] Deleting <https://builds.apache.org/job/Tez-Build/ws/hadoop-shim-impls/hadoop-shim-2.6/target>
[INFO]
[INFO] --- buildnumber-maven-plugin:1.1:create (default) @ hadoop-shim-2.6 ---
[INFO] Checking for local modifications: skipped.
[INFO] Updating project files from SCM: skipped.
[INFO] Executing: /bin/sh -c cd <https://builds.apache.org/job/Tez-Build/ws/hadoop-shim-impls/hadoop-shim-2.6> && git rev-parse --verify HEAD
[INFO] Working directory: <https://builds.apache.org/job/Tez-Build/ws/hadoop-shim-impls/hadoop-shim-2.6>
[INFO] Storing buildNumber: 941d1990f68e8a98b4ab2cd25688a117e29dd697 at timestamp: 1455925087737
[INFO] Executing: /bin/sh -c cd <https://builds.apache.org/job/Tez-Build/ws/hadoop-shim-impls/hadoop-shim-2.6> && git rev-parse --verify HEAD
[INFO] Working directory: <https://builds.apache.org/job/Tez-Build/ws/hadoop-shim-impls/hadoop-shim-2.6>
[INFO] Storing buildScmBranch: UNKNOWN
[INFO]
[INFO] --- build-helper-maven-plugin:1.8:maven-version (maven-version) @ hadoop-shim-2.6 ---
[INFO]
[INFO] --- maven-resources-plugin:2.6:resources (default-resources) @ hadoop-shim-2.6 ---
[INFO] Using 'UTF-8' encoding to copy filtered resources.
[INFO] Copying 1 resource
[INFO]
[INFO] --- maven-compiler-plugin:3.1:compile (default-compile) @ hadoop-shim-2.6 ---
[INFO] Changes detected - recompiling the module!
[INFO] Compiling 2 source files to <https://builds.apache.org/job/Tez-Build/ws/hadoop-shim-impls/hadoop-shim-2.6/target/classes>
[INFO]
[INFO] --- maven-resources-plugin:2.6:testResources (default-testResources) @ hadoop-shim-2.6 ---
[INFO] Using 'UTF-8' encoding to copy filtered resources.
[INFO] skip non existing resourceDirectory <https://builds.apache.org/job/Tez-Build/ws/hadoop-shim-impls/hadoop-shim-2.6/src/test/resources>
[INFO]
[INFO] --- maven-compiler-plugin:3.1:testCompile (default-testCompile) @ hadoop-shim-2.6 ---
[INFO] Changes detected - recompiling the module!
[INFO] Compiling 1 source file to <https://builds.apache.org/job/Tez-Build/ws/hadoop-shim-impls/hadoop-shim-2.6/target/test-classes>
[INFO]
[INFO] --- maven-surefire-plugin:2.14.1:test (default-test) @ hadoop-shim-2.6 ---
[INFO] Surefire report directory: <https://builds.apache.org/job/Tez-Build/ws/hadoop-shim-impls/hadoop-shim-2.6/target/surefire-reports>
-------------------------------------------------------
T E S T S
-------------------------------------------------------
-------------------------------------------------------
T E S T S
-------------------------------------------------------
Running org.apache.tez.hadoop.shim.TestHadoop25_26_27ShimProvider
Tests run: 4, Failures: 0, Errors: 0, Skipped: 0, Time elapsed: 0.222 sec
Results :
Tests run: 4, Failures: 0, Errors: 0, Skipped: 0
[INFO]
[INFO] --- buildnumber-maven-plugin:1.1:create (default) @ hadoop-shim-2.6 ---
[INFO] Checking for local modifications: skipped.
[INFO] Updating project files from SCM: skipped.
[INFO] Executing: /bin/sh -c cd <https://builds.apache.org/job/Tez-Build/ws/hadoop-shim-impls/hadoop-shim-2.6> && git rev-parse --verify HEAD
[INFO] Working directory: <https://builds.apache.org/job/Tez-Build/ws/hadoop-shim-impls/hadoop-shim-2.6>
[INFO] Storing buildNumber: 941d1990f68e8a98b4ab2cd25688a117e29dd697 at timestamp: 1455925088356
[INFO] Executing: /bin/sh -c cd <https://builds.apache.org/job/Tez-Build/ws/hadoop-shim-impls/hadoop-shim-2.6> && git rev-parse --verify HEAD
[INFO] Working directory: <https://builds.apache.org/job/Tez-Build/ws/hadoop-shim-impls/hadoop-shim-2.6>
[INFO] Storing buildScmBranch: UNKNOWN
[INFO]
[INFO] --- build-helper-maven-plugin:1.8:maven-version (maven-version) @ hadoop-shim-2.6 ---
[INFO]
[INFO] --- maven-resources-plugin:2.6:resources (default-resources) @ hadoop-shim-2.6 ---
[INFO] Using 'UTF-8' encoding to copy filtered resources.
[INFO] Copying 1 resource
[INFO]
[INFO] --- maven-compiler-plugin:3.1:compile (default-compile) @ hadoop-shim-2.6 ---
[INFO] Nothing to compile - all classes are up to date
[INFO]
[INFO] --- maven-resources-plugin:2.6:testResources (default-testResources) @ hadoop-shim-2.6 ---
[INFO] Using 'UTF-8' encoding to copy filtered resources.
[INFO] skip non existing resourceDirectory <https://builds.apache.org/job/Tez-Build/ws/hadoop-shim-impls/hadoop-shim-2.6/src/test/resources>
[INFO]
[INFO] --- maven-compiler-plugin:3.1:testCompile (default-testCompile) @ hadoop-shim-2.6 ---
[INFO] Nothing to compile - all classes are up to date
[INFO]
[INFO] --- maven-surefire-plugin:2.14.1:test (default-test) @ hadoop-shim-2.6 ---
[INFO] Skipping execution of surefire because it has already been run for this configuration
[INFO]
[INFO] --- maven-jar-plugin:2.4:jar (default-jar) @ hadoop-shim-2.6 ---
[INFO] Building jar: <https://builds.apache.org/job/Tez-Build/ws/hadoop-shim-impls/hadoop-shim-2.6/target/hadoop-shim-2.6-0.8.3-SNAPSHOT.jar>
[INFO]
[INFO] --- maven-jar-plugin:2.4:test-jar (default) @ hadoop-shim-2.6 ---
[INFO] Building jar: <https://builds.apache.org/job/Tez-Build/ws/hadoop-shim-impls/hadoop-shim-2.6/target/hadoop-shim-2.6-0.8.3-SNAPSHOT-tests.jar>
[INFO]
[INFO] --- maven-install-plugin:2.4:install (default-install) @ hadoop-shim-2.6 ---
[INFO] Installing <https://builds.apache.org/job/Tez-Build/ws/hadoop-shim-impls/hadoop-shim-2.6/target/hadoop-shim-2.6-0.8.3-SNAPSHOT.jar> to /home/jenkins/.m2/repository/org/apache/tez/hadoop-shim-2.6/0.8.3-SNAPSHOT/hadoop-shim-2.6-0.8.3-SNAPSHOT.jar
[INFO] Installing <https://builds.apache.org/job/Tez-Build/ws/hadoop-shim-impls/hadoop-shim-2.6/pom.xml> to /home/jenkins/.m2/repository/org/apache/tez/hadoop-shim-2.6/0.8.3-SNAPSHOT/hadoop-shim-2.6-0.8.3-SNAPSHOT.pom
[INFO] Installing <https://builds.apache.org/job/Tez-Build/ws/hadoop-shim-impls/hadoop-shim-2.6/target/hadoop-shim-2.6-0.8.3-SNAPSHOT-tests.jar> to /home/jenkins/.m2/repository/org/apache/tez/hadoop-shim-2.6/0.8.3-SNAPSHOT/hadoop-shim-2.6-0.8.3-SNAPSHOT-tests.jar
[INFO]
[INFO] --- maven-deploy-plugin:2.8.1:deploy (default-deploy) @ hadoop-shim-2.6 ---
[INFO] Deploying org.apache.tez:hadoop-shim-2.6:0.8.3-SNAPSHOT at end
[INFO]
[INFO] --- buildnumber-maven-plugin:1.1:create (default) @ hadoop-shim-2.6 ---
[INFO] Checking for local modifications: skipped.
[INFO] Updating project files from SCM: skipped.
[INFO] Executing: /bin/sh -c cd <https://builds.apache.org/job/Tez-Build/ws/hadoop-shim-impls/hadoop-shim-2.6> && git rev-parse --verify HEAD
[INFO] Working directory: <https://builds.apache.org/job/Tez-Build/ws/hadoop-shim-impls/hadoop-shim-2.6>
[INFO] Storing buildNumber: 941d1990f68e8a98b4ab2cd25688a117e29dd697 at timestamp: 1455925088480
[INFO] Executing: /bin/sh -c cd <https://builds.apache.org/job/Tez-Build/ws/hadoop-shim-impls/hadoop-shim-2.6> && git rev-parse --verify HEAD
[INFO] Working directory: <https://builds.apache.org/job/Tez-Build/ws/hadoop-shim-impls/hadoop-shim-2.6>
[INFO] Storing buildScmBranch: UNKNOWN
[INFO]
[INFO] --- build-helper-maven-plugin:1.8:maven-version (maven-version) @ hadoop-shim-2.6 ---
[INFO]
[INFO] --- maven-resources-plugin:2.6:resources (default-resources) @ hadoop-shim-2.6 ---
[INFO] Using 'UTF-8' encoding to copy filtered resources.
[INFO] Copying 1 resource
[INFO]
[INFO] --- maven-compiler-plugin:3.1:compile (default-compile) @ hadoop-shim-2.6 ---
[INFO] Nothing to compile - all classes are up to date
[INFO]
[INFO] --- maven-resources-plugin:2.6:testResources (default-testResources) @ hadoop-shim-2.6 ---
[INFO] Using 'UTF-8' encoding to copy filtered resources.
[INFO] skip non existing resourceDirectory <https://builds.apache.org/job/Tez-Build/ws/hadoop-shim-impls/hadoop-shim-2.6/src/test/resources>
[INFO]
[INFO] --- maven-compiler-plugin:3.1:testCompile (default-testCompile) @ hadoop-shim-2.6 ---
[INFO] Nothing to compile - all classes are up to date
[INFO]
[INFO] --- maven-surefire-plugin:2.14.1:test (default-test) @ hadoop-shim-2.6 ---
[INFO] Skipping execution of surefire because it has already been run for this configuration
[INFO]
[INFO] --- maven-jar-plugin:2.4:jar (default-jar) @ hadoop-shim-2.6 ---
[INFO]
[INFO] --- maven-jar-plugin:2.4:test-jar (default) @ hadoop-shim-2.6 ---
[INFO]
[INFO] ------------------------------------------------------------------------
[INFO] Skipping tez-dist
[INFO] This project has been banned from the build due to previous failures.
[INFO] ------------------------------------------------------------------------
[INFO]
[INFO] ------------------------------------------------------------------------
[INFO] Building Tez 0.8.3-SNAPSHOT
[INFO] ------------------------------------------------------------------------
[INFO]
[INFO] --- maven-clean-plugin:2.5:clean (default-clean) @ tez-docs ---
[INFO] Deleting <https://builds.apache.org/job/Tez-Build/ws/docs/target>
[INFO]
[INFO] --- buildnumber-maven-plugin:1.1:create (default) @ tez-docs ---
[INFO] Checking for local modifications: skipped.
[INFO] Updating project files from SCM: skipped.
[INFO] Executing: /bin/sh -c cd <https://builds.apache.org/job/Tez-Build/ws/docs> && git rev-parse --verify HEAD
[INFO] Working directory: <https://builds.apache.org/job/Tez-Build/ws/docs>
[INFO] Storing buildNumber: 941d1990f68e8a98b4ab2cd25688a117e29dd697 at timestamp: 1455925088525
[INFO] Executing: /bin/sh -c cd <https://builds.apache.org/job/Tez-Build/ws/docs> && git rev-parse --verify HEAD
[INFO] Working directory: <https://builds.apache.org/job/Tez-Build/ws/docs>
[INFO] Storing buildScmBranch: UNKNOWN
[INFO]
[INFO] --- build-helper-maven-plugin:1.8:maven-version (maven-version) @ tez-docs ---
[INFO]
[INFO] --- buildnumber-maven-plugin:1.1:create (default) @ tez-docs ---
[INFO] Checking for local modifications: skipped.
[INFO] Updating project files from SCM: skipped.
[INFO] Executing: /bin/sh -c cd <https://builds.apache.org/job/Tez-Build/ws/docs> && git rev-parse --verify HEAD
[INFO] Working directory: <https://builds.apache.org/job/Tez-Build/ws/docs>
[INFO] Storing buildNumber: 941d1990f68e8a98b4ab2cd25688a117e29dd697 at timestamp: 1455925088535
[INFO] Executing: /bin/sh -c cd <https://builds.apache.org/job/Tez-Build/ws/docs> && git rev-parse --verify HEAD
[INFO] Working directory: <https://builds.apache.org/job/Tez-Build/ws/docs>
[INFO] Storing buildScmBranch: UNKNOWN
[INFO]
[INFO] --- build-helper-maven-plugin:1.8:maven-version (maven-version) @ tez-docs ---
[INFO]
[INFO] --- maven-jar-plugin:2.4:test-jar (default) @ tez-docs ---
[WARNING] JAR will be empty - no content was marked for inclusion!
[INFO] Building jar: <https://builds.apache.org/job/Tez-Build/ws/docs/target/tez-docs-0.8.3-SNAPSHOT-tests.jar>
[INFO]
[INFO] --- maven-install-plugin:2.4:install (default-install) @ tez-docs ---
[INFO] Installing <https://builds.apache.org/job/Tez-Build/ws/docs/pom.xml> to /home/jenkins/.m2/repository/org/apache/tez/tez-docs/0.8.3-SNAPSHOT/tez-docs-0.8.3-SNAPSHOT.pom
[INFO] Installing <https://builds.apache.org/job/Tez-Build/ws/docs/target/tez-docs-0.8.3-SNAPSHOT-tests.jar> to /home/jenkins/.m2/repository/org/apache/tez/tez-docs/0.8.3-SNAPSHOT/tez-docs-0.8.3-SNAPSHOT-tests.jar
[INFO]
[INFO] --- maven-deploy-plugin:2.8.1:deploy (default-deploy) @ tez-docs ---
[INFO] Skipping artifact deployment
[INFO]
[INFO] --- buildnumber-maven-plugin:1.1:create (default) @ tez-docs ---
[INFO] Checking for local modifications: skipped.
[INFO] Updating project files from SCM: skipped.
[INFO] Executing: /bin/sh -c cd <https://builds.apache.org/job/Tez-Build/ws/docs> && git rev-parse --verify HEAD
[INFO] Working directory: <https://builds.apache.org/job/Tez-Build/ws/docs>
[INFO] Storing buildNumber: 941d1990f68e8a98b4ab2cd25688a117e29dd697 at timestamp: 1455925088594
[INFO] Executing: /bin/sh -c cd <https://builds.apache.org/job/Tez-Build/ws/docs> && git rev-parse --verify HEAD
[INFO] Working directory: <https://builds.apache.org/job/Tez-Build/ws/docs>
[INFO] Storing buildScmBranch: UNKNOWN
[INFO]
[INFO] --- build-helper-maven-plugin:1.8:maven-version (maven-version) @ tez-docs ---
[INFO]
[INFO] --- maven-jar-plugin:2.4:test-jar (default) @ tez-docs ---
[WARNING] JAR will be empty - no content was marked for inclusion!
[INFO] ------------------------------------------------------------------------
[INFO] Reactor Summary:
[INFO]
[INFO] tez ............................................... SUCCESS [ 2.317 s]
[INFO] hadoop-shim ....................................... SUCCESS [ 3.128 s]
[INFO] tez-api ........................................... SUCCESS [ 55.075 s]
[INFO] tez-common ........................................ SUCCESS [ 5.873 s]
[INFO] tez-runtime-internals ............................. SUCCESS [ 15.248 s]
[INFO] tez-runtime-library ............................... SUCCESS [03:04 min]
[INFO] tez-mapreduce ..................................... SUCCESS [ 35.566 s]
[INFO] tez-examples ...................................... SUCCESS [ 0.453 s]
[INFO] tez-dag ........................................... SUCCESS [02:36 min]
[INFO] tez-tests ......................................... FAILURE [39:33 min]
[INFO] tez-ext-service-tests ............................. SKIPPED
[INFO] tez-ui ............................................ SUCCESS [ 49.561 s]
[INFO] tez-plugins ....................................... SUCCESS [ 0.204 s]
[INFO] tez-yarn-timeline-history ......................... SKIPPED
[INFO] tez-yarn-timeline-history-with-acls ............... SKIPPED
[INFO] tez-history-parser ................................ SKIPPED
[INFO] tez-tools ......................................... SUCCESS [ 0.245 s]
[INFO] tez-perf-analyzer ................................. SUCCESS [ 0.137 s]
[INFO] tez-job-analyzer .................................. SKIPPED
[INFO] tez-javadoc-tools ................................. SUCCESS [ 0.390 s]
[INFO] hadoop-shim-impls ................................. SUCCESS [ 0.183 s]
[INFO] hadoop-shim-2.6 ................................... SUCCESS [ 0.841 s]
[INFO] tez-dist .......................................... SKIPPED
[INFO] Tez ............................................... SUCCESS [ 0.099 s]
[INFO] ------------------------------------------------------------------------
[INFO] BUILD FAILURE
[INFO] ------------------------------------------------------------------------
[INFO] Total time: 48:04 min
[INFO] Finished at: 2016-02-19T23:38:08+00:00
[INFO] Final Memory: 43M/869M
[INFO] ------------------------------------------------------------------------
[ERROR] Failed to execute goal org.apache.maven.plugins:maven-surefire-plugin:2.14.1:test (default-test) on project tez-tests: There are test failures.
[ERROR]
[ERROR] Please refer to <https://builds.apache.org/job/Tez-Build/ws/tez-tests/target/surefire-reports> for the individual test results.
[ERROR] -> [Help 1]
[ERROR]
[ERROR] To see the full stack trace of the errors, re-run Maven with the -e switch.
[ERROR] Re-run Maven using the -X switch to enable full debug logging.
[ERROR]
[ERROR] For more information about the errors and possible solutions, please read the following articles:
[ERROR] [Help 1] http://cwiki.apache.org/confluence/display/MAVEN/MojoFailureException
[ERROR]
[ERROR] After correcting the problems, you can resume the build with the command
[ERROR] mvn <goals> -rf :tez-tests
Build step 'Execute shell' marked build as failure
Archiving artifacts
Recording test results
Build failed in Jenkins: Tez-Build #1378
Posted by Apache Jenkins Server <je...@builds.apache.org>.
See <https://builds.apache.org/job/Tez-Build/1378/changes>
Changes:
[bikas] TEZ-3117. Deadlock in Edge and Vertex code (bikas)
------------------------------------------
[...truncated 2950 lines...]
[INFO] Executing: /bin/sh -c cd <https://builds.apache.org/job/Tez-Build/ws/hadoop-shim-impls> && git rev-parse --verify HEAD
[INFO] Working directory: <https://builds.apache.org/job/Tez-Build/ws/hadoop-shim-impls>
[INFO] Storing buildScmBranch: UNKNOWN
[INFO]
[INFO] --- build-helper-maven-plugin:1.8:maven-version (maven-version) @ hadoop-shim-impls ---
[INFO]
[INFO] --- maven-jar-plugin:2.4:test-jar (default) @ hadoop-shim-impls ---
[WARNING] JAR will be empty - no content was marked for inclusion!
[INFO]
[INFO] ------------------------------------------------------------------------
[INFO] Building hadoop-shim-2.6 0.8.3-SNAPSHOT
[INFO] ------------------------------------------------------------------------
[INFO]
[INFO] --- maven-clean-plugin:2.5:clean (default-clean) @ hadoop-shim-2.6 ---
[INFO] Deleting <https://builds.apache.org/job/Tez-Build/ws/hadoop-shim-impls/hadoop-shim-2.6/target>
[INFO]
[INFO] --- buildnumber-maven-plugin:1.1:create (default) @ hadoop-shim-2.6 ---
[INFO] Checking for local modifications: skipped.
[INFO] Updating project files from SCM: skipped.
[INFO] Executing: /bin/sh -c cd <https://builds.apache.org/job/Tez-Build/ws/hadoop-shim-impls/hadoop-shim-2.6> && git rev-parse --verify HEAD
[INFO] Working directory: <https://builds.apache.org/job/Tez-Build/ws/hadoop-shim-impls/hadoop-shim-2.6>
[INFO] Storing buildNumber: de3a0748ff19b5ced87050596d088bdb573cae05 at timestamp: 1455763893505
[INFO] Executing: /bin/sh -c cd <https://builds.apache.org/job/Tez-Build/ws/hadoop-shim-impls/hadoop-shim-2.6> && git rev-parse --verify HEAD
[INFO] Working directory: <https://builds.apache.org/job/Tez-Build/ws/hadoop-shim-impls/hadoop-shim-2.6>
[INFO] Storing buildScmBranch: UNKNOWN
[INFO]
[INFO] --- build-helper-maven-plugin:1.8:maven-version (maven-version) @ hadoop-shim-2.6 ---
[INFO]
[INFO] --- maven-resources-plugin:2.6:resources (default-resources) @ hadoop-shim-2.6 ---
[INFO] Using 'UTF-8' encoding to copy filtered resources.
[INFO] Copying 1 resource
[INFO]
[INFO] --- maven-compiler-plugin:3.1:compile (default-compile) @ hadoop-shim-2.6 ---
[INFO] Changes detected - recompiling the module!
[INFO] Compiling 2 source files to <https://builds.apache.org/job/Tez-Build/ws/hadoop-shim-impls/hadoop-shim-2.6/target/classes>
[INFO]
[INFO] --- maven-resources-plugin:2.6:testResources (default-testResources) @ hadoop-shim-2.6 ---
[INFO] Using 'UTF-8' encoding to copy filtered resources.
[INFO] skip non existing resourceDirectory <https://builds.apache.org/job/Tez-Build/ws/hadoop-shim-impls/hadoop-shim-2.6/src/test/resources>
[INFO]
[INFO] --- maven-compiler-plugin:3.1:testCompile (default-testCompile) @ hadoop-shim-2.6 ---
[INFO] Changes detected - recompiling the module!
[INFO] Compiling 1 source file to <https://builds.apache.org/job/Tez-Build/ws/hadoop-shim-impls/hadoop-shim-2.6/target/test-classes>
[INFO]
[INFO] --- maven-surefire-plugin:2.14.1:test (default-test) @ hadoop-shim-2.6 ---
[INFO] Surefire report directory: <https://builds.apache.org/job/Tez-Build/ws/hadoop-shim-impls/hadoop-shim-2.6/target/surefire-reports>
-------------------------------------------------------
T E S T S
-------------------------------------------------------
-------------------------------------------------------
T E S T S
-------------------------------------------------------
Running org.apache.tez.hadoop.shim.TestHadoop25_26_27ShimProvider
Tests run: 4, Failures: 0, Errors: 0, Skipped: 0, Time elapsed: 0.228 sec
Results :
Tests run: 4, Failures: 0, Errors: 0, Skipped: 0
[INFO]
[INFO] --- buildnumber-maven-plugin:1.1:create (default) @ hadoop-shim-2.6 ---
[INFO] Checking for local modifications: skipped.
[INFO] Updating project files from SCM: skipped.
[INFO] Executing: /bin/sh -c cd <https://builds.apache.org/job/Tez-Build/ws/hadoop-shim-impls/hadoop-shim-2.6> && git rev-parse --verify HEAD
[INFO] Working directory: <https://builds.apache.org/job/Tez-Build/ws/hadoop-shim-impls/hadoop-shim-2.6>
[INFO] Storing buildNumber: de3a0748ff19b5ced87050596d088bdb573cae05 at timestamp: 1455763894107
[INFO] Executing: /bin/sh -c cd <https://builds.apache.org/job/Tez-Build/ws/hadoop-shim-impls/hadoop-shim-2.6> && git rev-parse --verify HEAD
[INFO] Working directory: <https://builds.apache.org/job/Tez-Build/ws/hadoop-shim-impls/hadoop-shim-2.6>
[INFO] Storing buildScmBranch: UNKNOWN
[INFO]
[INFO] --- build-helper-maven-plugin:1.8:maven-version (maven-version) @ hadoop-shim-2.6 ---
[INFO]
[INFO] --- maven-resources-plugin:2.6:resources (default-resources) @ hadoop-shim-2.6 ---
[INFO] Using 'UTF-8' encoding to copy filtered resources.
[INFO] Copying 1 resource
[INFO]
[INFO] --- maven-compiler-plugin:3.1:compile (default-compile) @ hadoop-shim-2.6 ---
[INFO] Nothing to compile - all classes are up to date
[INFO]
[INFO] --- maven-resources-plugin:2.6:testResources (default-testResources) @ hadoop-shim-2.6 ---
[INFO] Using 'UTF-8' encoding to copy filtered resources.
[INFO] skip non existing resourceDirectory <https://builds.apache.org/job/Tez-Build/ws/hadoop-shim-impls/hadoop-shim-2.6/src/test/resources>
[INFO]
[INFO] --- maven-compiler-plugin:3.1:testCompile (default-testCompile) @ hadoop-shim-2.6 ---
[INFO] Nothing to compile - all classes are up to date
[INFO]
[INFO] --- maven-surefire-plugin:2.14.1:test (default-test) @ hadoop-shim-2.6 ---
[INFO] Skipping execution of surefire because it has already been run for this configuration
[INFO]
[INFO] --- maven-jar-plugin:2.4:jar (default-jar) @ hadoop-shim-2.6 ---
[INFO] Building jar: <https://builds.apache.org/job/Tez-Build/ws/hadoop-shim-impls/hadoop-shim-2.6/target/hadoop-shim-2.6-0.8.3-SNAPSHOT.jar>
[INFO]
[INFO] --- maven-jar-plugin:2.4:test-jar (default) @ hadoop-shim-2.6 ---
[INFO] Building jar: <https://builds.apache.org/job/Tez-Build/ws/hadoop-shim-impls/hadoop-shim-2.6/target/hadoop-shim-2.6-0.8.3-SNAPSHOT-tests.jar>
[INFO]
[INFO] --- maven-install-plugin:2.4:install (default-install) @ hadoop-shim-2.6 ---
[INFO] Installing <https://builds.apache.org/job/Tez-Build/ws/hadoop-shim-impls/hadoop-shim-2.6/target/hadoop-shim-2.6-0.8.3-SNAPSHOT.jar> to /home/jenkins/.m2/repository/org/apache/tez/hadoop-shim-2.6/0.8.3-SNAPSHOT/hadoop-shim-2.6-0.8.3-SNAPSHOT.jar
[INFO] Installing <https://builds.apache.org/job/Tez-Build/ws/hadoop-shim-impls/hadoop-shim-2.6/pom.xml> to /home/jenkins/.m2/repository/org/apache/tez/hadoop-shim-2.6/0.8.3-SNAPSHOT/hadoop-shim-2.6-0.8.3-SNAPSHOT.pom
[INFO] Installing <https://builds.apache.org/job/Tez-Build/ws/hadoop-shim-impls/hadoop-shim-2.6/target/hadoop-shim-2.6-0.8.3-SNAPSHOT-tests.jar> to /home/jenkins/.m2/repository/org/apache/tez/hadoop-shim-2.6/0.8.3-SNAPSHOT/hadoop-shim-2.6-0.8.3-SNAPSHOT-tests.jar
[INFO]
[INFO] --- maven-deploy-plugin:2.8.1:deploy (default-deploy) @ hadoop-shim-2.6 ---
[INFO] Deploying org.apache.tez:hadoop-shim-2.6:0.8.3-SNAPSHOT at end
[INFO]
[INFO] --- buildnumber-maven-plugin:1.1:create (default) @ hadoop-shim-2.6 ---
[INFO] Checking for local modifications: skipped.
[INFO] Updating project files from SCM: skipped.
[INFO] Executing: /bin/sh -c cd <https://builds.apache.org/job/Tez-Build/ws/hadoop-shim-impls/hadoop-shim-2.6> && git rev-parse --verify HEAD
[INFO] Working directory: <https://builds.apache.org/job/Tez-Build/ws/hadoop-shim-impls/hadoop-shim-2.6>
[INFO] Storing buildNumber: de3a0748ff19b5ced87050596d088bdb573cae05 at timestamp: 1455763894204
[INFO] Executing: /bin/sh -c cd <https://builds.apache.org/job/Tez-Build/ws/hadoop-shim-impls/hadoop-shim-2.6> && git rev-parse --verify HEAD
[INFO] Working directory: <https://builds.apache.org/job/Tez-Build/ws/hadoop-shim-impls/hadoop-shim-2.6>
[INFO] Storing buildScmBranch: UNKNOWN
[INFO]
[INFO] --- build-helper-maven-plugin:1.8:maven-version (maven-version) @ hadoop-shim-2.6 ---
[INFO]
[INFO] --- maven-resources-plugin:2.6:resources (default-resources) @ hadoop-shim-2.6 ---
[INFO] Using 'UTF-8' encoding to copy filtered resources.
[INFO] Copying 1 resource
[INFO]
[INFO] --- maven-compiler-plugin:3.1:compile (default-compile) @ hadoop-shim-2.6 ---
[INFO] Nothing to compile - all classes are up to date
[INFO]
[INFO] --- maven-resources-plugin:2.6:testResources (default-testResources) @ hadoop-shim-2.6 ---
[INFO] Using 'UTF-8' encoding to copy filtered resources.
[INFO] skip non existing resourceDirectory <https://builds.apache.org/job/Tez-Build/ws/hadoop-shim-impls/hadoop-shim-2.6/src/test/resources>
[INFO]
[INFO] --- maven-compiler-plugin:3.1:testCompile (default-testCompile) @ hadoop-shim-2.6 ---
[INFO] Nothing to compile - all classes are up to date
[INFO]
[INFO] --- maven-surefire-plugin:2.14.1:test (default-test) @ hadoop-shim-2.6 ---
[INFO] Skipping execution of surefire because it has already been run for this configuration
[INFO]
[INFO] --- maven-jar-plugin:2.4:jar (default-jar) @ hadoop-shim-2.6 ---
[INFO]
[INFO] --- maven-jar-plugin:2.4:test-jar (default) @ hadoop-shim-2.6 ---
[INFO]
[INFO] ------------------------------------------------------------------------
[INFO] Skipping tez-dist
[INFO] This project has been banned from the build due to previous failures.
[INFO] ------------------------------------------------------------------------
[INFO]
[INFO] ------------------------------------------------------------------------
[INFO] Building Tez 0.8.3-SNAPSHOT
[INFO] ------------------------------------------------------------------------
[INFO]
[INFO] --- maven-clean-plugin:2.5:clean (default-clean) @ tez-docs ---
[INFO] Deleting <https://builds.apache.org/job/Tez-Build/ws/docs/target>
[INFO]
[INFO] --- buildnumber-maven-plugin:1.1:create (default) @ tez-docs ---
[INFO] Checking for local modifications: skipped.
[INFO] Updating project files from SCM: skipped.
[INFO] Executing: /bin/sh -c cd <https://builds.apache.org/job/Tez-Build/ws/docs> && git rev-parse --verify HEAD
[INFO] Working directory: <https://builds.apache.org/job/Tez-Build/ws/docs>
[INFO] Storing buildNumber: de3a0748ff19b5ced87050596d088bdb573cae05 at timestamp: 1455763894240
[INFO] Executing: /bin/sh -c cd <https://builds.apache.org/job/Tez-Build/ws/docs> && git rev-parse --verify HEAD
[INFO] Working directory: <https://builds.apache.org/job/Tez-Build/ws/docs>
[INFO] Storing buildScmBranch: UNKNOWN
[INFO]
[INFO] --- build-helper-maven-plugin:1.8:maven-version (maven-version) @ tez-docs ---
[INFO]
[INFO] --- buildnumber-maven-plugin:1.1:create (default) @ tez-docs ---
[INFO] Checking for local modifications: skipped.
[INFO] Updating project files from SCM: skipped.
[INFO] Executing: /bin/sh -c cd <https://builds.apache.org/job/Tez-Build/ws/docs> && git rev-parse --verify HEAD
[INFO] Working directory: <https://builds.apache.org/job/Tez-Build/ws/docs>
[INFO] Storing buildNumber: de3a0748ff19b5ced87050596d088bdb573cae05 at timestamp: 1455763894250
[INFO] Executing: /bin/sh -c cd <https://builds.apache.org/job/Tez-Build/ws/docs> && git rev-parse --verify HEAD
[INFO] Working directory: <https://builds.apache.org/job/Tez-Build/ws/docs>
[INFO] Storing buildScmBranch: UNKNOWN
[INFO]
[INFO] --- build-helper-maven-plugin:1.8:maven-version (maven-version) @ tez-docs ---
[INFO]
[INFO] --- maven-jar-plugin:2.4:test-jar (default) @ tez-docs ---
[WARNING] JAR will be empty - no content was marked for inclusion!
[INFO] Building jar: <https://builds.apache.org/job/Tez-Build/ws/docs/target/tez-docs-0.8.3-SNAPSHOT-tests.jar>
[INFO]
[INFO] --- maven-install-plugin:2.4:install (default-install) @ tez-docs ---
[INFO] Installing <https://builds.apache.org/job/Tez-Build/ws/docs/pom.xml> to /home/jenkins/.m2/repository/org/apache/tez/tez-docs/0.8.3-SNAPSHOT/tez-docs-0.8.3-SNAPSHOT.pom
[INFO] Installing <https://builds.apache.org/job/Tez-Build/ws/docs/target/tez-docs-0.8.3-SNAPSHOT-tests.jar> to /home/jenkins/.m2/repository/org/apache/tez/tez-docs/0.8.3-SNAPSHOT/tez-docs-0.8.3-SNAPSHOT-tests.jar
[INFO]
[INFO] --- maven-deploy-plugin:2.8.1:deploy (default-deploy) @ tez-docs ---
[INFO] Skipping artifact deployment
[INFO]
[INFO] --- buildnumber-maven-plugin:1.1:create (default) @ tez-docs ---
[INFO] Checking for local modifications: skipped.
[INFO] Updating project files from SCM: skipped.
[INFO] Executing: /bin/sh -c cd <https://builds.apache.org/job/Tez-Build/ws/docs> && git rev-parse --verify HEAD
[INFO] Working directory: <https://builds.apache.org/job/Tez-Build/ws/docs>
[INFO] Storing buildNumber: de3a0748ff19b5ced87050596d088bdb573cae05 at timestamp: 1455763894282
[INFO] Executing: /bin/sh -c cd <https://builds.apache.org/job/Tez-Build/ws/docs> && git rev-parse --verify HEAD
[INFO] Working directory: <https://builds.apache.org/job/Tez-Build/ws/docs>
[INFO] Storing buildScmBranch: UNKNOWN
[INFO]
[INFO] --- build-helper-maven-plugin:1.8:maven-version (maven-version) @ tez-docs ---
[INFO]
[INFO] --- maven-jar-plugin:2.4:test-jar (default) @ tez-docs ---
[WARNING] JAR will be empty - no content was marked for inclusion!
[INFO] ------------------------------------------------------------------------
[INFO] Reactor Summary:
[INFO]
[INFO] tez ............................................... SUCCESS [ 1.917 s]
[INFO] hadoop-shim ....................................... SUCCESS [ 3.357 s]
[INFO] tez-api ........................................... SUCCESS [ 59.116 s]
[INFO] tez-common ........................................ SUCCESS [ 6.080 s]
[INFO] tez-runtime-internals ............................. SUCCESS [ 15.778 s]
[INFO] tez-runtime-library ............................... SUCCESS [03:10 min]
[INFO] tez-mapreduce ..................................... SUCCESS [ 38.611 s]
[INFO] tez-examples ...................................... SUCCESS [ 0.407 s]
[INFO] tez-dag ........................................... SUCCESS [02:32 min]
[INFO] tez-tests ......................................... FAILURE [34:28 min]
[INFO] tez-ext-service-tests ............................. SKIPPED
[INFO] tez-ui ............................................ SUCCESS [ 42.692 s]
[INFO] tez-plugins ....................................... SUCCESS [ 0.100 s]
[INFO] tez-yarn-timeline-history ......................... SKIPPED
[INFO] tez-yarn-timeline-history-with-acls ............... SKIPPED
[INFO] tez-history-parser ................................ SKIPPED
[INFO] tez-tools ......................................... SUCCESS [ 0.118 s]
[INFO] tez-perf-analyzer ................................. SUCCESS [ 0.080 s]
[INFO] tez-job-analyzer .................................. SKIPPED
[INFO] tez-javadoc-tools ................................. SUCCESS [ 0.322 s]
[INFO] hadoop-shim-impls ................................. SUCCESS [ 0.117 s]
[INFO] hadoop-shim-2.6 ................................... SUCCESS [ 0.814 s]
[INFO] tez-dist .......................................... SKIPPED
[INFO] Tez ............................................... SUCCESS [ 0.061 s]
[INFO] ------------------------------------------------------------------------
[INFO] BUILD FAILURE
[INFO] ------------------------------------------------------------------------
[INFO] Total time: 43:01 min
[INFO] Finished at: 2016-02-18T02:51:34+00:00
[INFO] Final Memory: 45M/899M
[INFO] ------------------------------------------------------------------------
[ERROR] Failed to execute goal org.apache.maven.plugins:maven-surefire-plugin:2.14.1:test (default-test) on project tez-tests: There are test failures.
[ERROR]
[ERROR] Please refer to <https://builds.apache.org/job/Tez-Build/ws/tez-tests/target/surefire-reports> for the individual test results.
[ERROR] -> [Help 1]
[ERROR]
[ERROR] To see the full stack trace of the errors, re-run Maven with the -e switch.
[ERROR] Re-run Maven using the -X switch to enable full debug logging.
[ERROR]
[ERROR] For more information about the errors and possible solutions, please read the following articles:
[ERROR] [Help 1] http://cwiki.apache.org/confluence/display/MAVEN/MojoFailureException
[ERROR]
[ERROR] After correcting the problems, you can resume the build with the command
[ERROR] mvn <goals> -rf :tez-tests
Build step 'Execute shell' marked build as failure
Archiving artifacts
Recording test results