You are viewing a plain text version of this content. The canonical link for it is here.
Posted to dev@zookeeper.apache.org by Apache Jenkins Server <je...@builds.apache.org> on 2016/05/26 10:48:54 UTC
ZooKeeper_branch35_openjdk7 - Build # 95 - Still Failing
See https://builds.apache.org/job/ZooKeeper_branch35_openjdk7/95/
###################################################################################
########################## LAST 60 LINES OF THE CONSOLE ###########################
[...truncated 381430 lines...]
[exec] Log Message Received: [2016-05-26 10:46:34,091:13951(0x2b292db5a540):ZOO_INFO@testLogCallbackInit@993: testLogCallbackInit #8]
[exec] Log Message Received: [2016-05-26 10:46:34,091:13951(0x2b292db5a540):ZOO_INFO@testLogCallbackInit@993: testLogCallbackInit #9]
[exec] Log Message Received: [2016-05-26 10:46:34,092:13951(0x2b292db5a540):ZOO_INFO@zookeeper_close@3257: Closing zookeeper sessionId=0x101a4d6c76b000e to [127.0.0.1:22181]
[exec] ]
[exec] : elapsed 1003 : OK
[exec] Zookeeper_simpleSystem::testLogCallbackClearLog Message Received: [2016-05-26 10:46:34,092:13951(0x2b292db5a540):ZOO_INFO@log_env@1027: Client environment:zookeeper.version=zookeeper C client 3.5.1]
[exec] Log Message Received: [2016-05-26 10:46:34,092:13951(0x2b292db5a540):ZOO_INFO@log_env@1031: Client environment:host.name=jenkins-ubuntu1]
[exec] Log Message Received: [2016-05-26 10:46:34,092:13951(0x2b292db5a540):ZOO_INFO@log_env@1038: Client environment:os.name=Linux]
[exec] Log Message Received: [2016-05-26 10:46:34,092:13951(0x2b292db5a540):ZOO_INFO@log_env@1039: Client environment:os.arch=3.19.0-25-generic]
[exec] Log Message Received: [2016-05-26 10:46:34,092:13951(0x2b292db5a540):ZOO_INFO@log_env@1040: Client environment:os.version=#26~14.04.1-Ubuntu SMP Fri Jul 24 21:16:20 UTC 2015]
[exec] Log Message Received: [2016-05-26 10:46:34,092:13951(0x2b292db5a540):ZOO_INFO@log_env@1048: Client environment:user.name=jenkins]
[exec] Log Message Received: [2016-05-26 10:46:34,095:13951(0x2b292db5a540):ZOO_INFO@log_env@1056: Client environment:user.home=/home/jenkins]
[exec] Log Message Received: [2016-05-26 10:46:34,095:13951(0x2b292db5a540):ZOO_INFO@log_env@1068: Client environment:user.dir=/home/jenkins/jenkins-slave/workspace/ZooKeeper_branch35_openjdk7/branch-3.5/build/test/test-cppunit]
[exec] Log Message Received: [2016-05-26 10:46:34,095:13951(0x2b292db5a540):ZOO_INFO@zookeeper_init_internal@1111: Initiating client connection, host=127.0.0.1:22181 sessionTimeout=10000 watcher=0x45d2a0 sessionId=0 sessionPasswd=<null> context=0x7ffe21429a30 flags=0]
[exec] Log Message Received: [2016-05-26 10:46:34,096:13951(0x2b292fbb8700):ZOO_INFO@check_events@2357: initiated connection to server [127.0.0.1:22181]]
[exec] Log Message Received: [2016-05-26 10:46:34,102:13951(0x2b292fbb8700):ZOO_INFO@check_events@2409: session establishment complete on server [127.0.0.1:22181], sessionId=0x101a4d6c76b000f, negotiated timeout=10000 ]
[exec] : elapsed 1004 : OK
[exec] Zookeeper_simpleSystem::testAsyncWatcherAutoReset ZooKeeper server started : elapsed 11079 : OK
[exec] Zookeeper_simpleSystem::testDeserializeString : elapsed 0 : OK
[exec] Zookeeper_simpleSystem::testFirstServerDown : elapsed 1003 : OK
[exec] Zookeeper_simpleSystem::testNullData : elapsed 1038 : OK
[exec] Zookeeper_simpleSystem::testIPV6 : elapsed 1008 : OK
[exec] Zookeeper_simpleSystem::testCreate : elapsed 1013 : OK
[exec] Zookeeper_simpleSystem::testPath : elapsed 1027 : OK
[exec] Zookeeper_simpleSystem::testPathValidation : elapsed 1072 : OK
[exec] Zookeeper_simpleSystem::testPing : elapsed 17344 : OK
[exec] Zookeeper_simpleSystem::testAcl : elapsed 1024 : OK
[exec] Zookeeper_simpleSystem::testChroot : elapsed 3063 : OK
[exec] Zookeeper_simpleSystem::testAuth ZooKeeper server started ZooKeeper server started : elapsed 31900 : OK
[exec] Zookeeper_simpleSystem::testHangingClient : elapsed 1045 : OK
[exec] Zookeeper_simpleSystem::testWatcherAutoResetWithGlobal ZooKeeper server started ZooKeeper server started ZooKeeper server started : elapsed 16701 : OK
[exec] Zookeeper_simpleSystem::testWatcherAutoResetWithLocal ZooKeeper server started ZooKeeper server started ZooKeeper server started : elapsed 14517 : OK
[exec] Zookeeper_simpleSystem::testGetChildren2 : elapsed 1040 : OK
[exec] Zookeeper_simpleSystem::testLastZxid : elapsed 4516 : OK
[exec] Zookeeper_simpleSystem::testRemoveWatchers ZooKeeper server started : elapsed 4348 : OK
[exec] Zookeeper_readOnly::testReadOnly : elapsed 4119 : OK
[exec] /home/jenkins/jenkins-slave/workspace/ZooKeeper_branch35_openjdk7/branch-3.5/src/c/tests/TestReconfig.cc:183: Assertion: equality assertion failed [Expected: 1, Actual : 0]
[exec] Failures !!!
[exec] Run: 72 Failure total: 1 Failures: 1 Errors: 0
[exec] FAIL: zktest-mt
[exec] ==========================================
[exec] 1 of 2 tests failed
[exec] Please report to user@zookeeper.apache.org
[exec] ==========================================
[exec] make[1]: Leaving directory `/home/jenkins/jenkins-slave/workspace/ZooKeeper_branch35_openjdk7/branch-3.5/build/test/test-cppunit'
[exec] make[1]: *** [check-TESTS] Error 1
[exec] make: *** [check-am] Error 2
BUILD FAILED
/home/jenkins/jenkins-slave/workspace/ZooKeeper_branch35_openjdk7/branch-3.5/build.xml:1322: The following error occurred while executing this line:
/home/jenkins/jenkins-slave/workspace/ZooKeeper_branch35_openjdk7/branch-3.5/build.xml:1282: The following error occurred while executing this line:
/home/jenkins/jenkins-slave/workspace/ZooKeeper_branch35_openjdk7/branch-3.5/build.xml:1292: exec returned: 2
Total time: 12 minutes 6 seconds
Build step 'Invoke Ant' marked build as failure
Archiving artifacts
Recording test results
Email was triggered for: Failure - Any
Sending email for trigger: Failure - Any
###################################################################################
############################## FAILED TESTS (if any) ##############################
All tests passed
ZooKeeper_branch35_openjdk7 - Build # 96 - Still Failing
Posted by Apache Jenkins Server <je...@builds.apache.org>.
See https://builds.apache.org/job/ZooKeeper_branch35_openjdk7/96/
###################################################################################
########################## LAST 60 LINES OF THE CONSOLE ###########################
[...truncated 376343 lines...]
[junit] java.lang.InterruptedException
[junit] at java.util.concurrent.locks.AbstractQueuedSynchronizer.acquireInterruptibly(AbstractQueuedSynchronizer.java:1219)
[junit] at java.util.concurrent.locks.ReentrantLock.lockInterruptibly(ReentrantLock.java:340)
[junit] at java.util.concurrent.LinkedBlockingQueue.put(LinkedBlockingQueue.java:338)
[junit] at org.apache.zookeeper.server.quorum.LearnerHandler.shutdown(LearnerHandler.java:901)
[junit] at org.apache.zookeeper.server.quorum.LearnerHandler.run(LearnerHandler.java:622)
[junit] 2016-05-26 14:27:21,718 [myid:] - INFO [NIOServerCxnFactory.SelectorThread-0:NIOServerCnxnFactory$SelectorThread@420] - selector thread exitted run method
[junit] 2016-05-26 14:27:21,721 [myid:] - INFO [NIOServerCxnFactory.AcceptThread:/127.0.0.1:14056:NIOServerCnxnFactory$AcceptThread@219] - accept thread exitted run method
[junit] 2016-05-26 14:27:21,722 [myid:] - INFO [QuorumPeer[myid=5](plain=/127.0.0.1:14056)(secure=disabled):MBeanRegistry@128] - Unregister MBean [org.apache.ZooKeeperService:name0=ReplicatedServer_id5,name1=replica.5,name2=Leader]
[junit] 2016-05-26 14:27:21,722 [myid:] - WARN [QuorumPeer[myid=5](plain=/127.0.0.1:14056)(secure=disabled):QuorumPeer@1126] - Unexpected exception
[junit] java.lang.InterruptedException
[junit] at java.lang.Object.wait(Native Method)
[junit] at org.apache.zookeeper.server.quorum.Leader.lead(Leader.java:559)
[junit] at org.apache.zookeeper.server.quorum.QuorumPeer.run(QuorumPeer.java:1123)
[junit] 2016-05-26 14:27:21,722 [myid:] - INFO [QuorumPeer[myid=5](plain=/127.0.0.1:14056)(secure=disabled):Leader@613] - Shutting down
[junit] 2016-05-26 14:27:21,722 [myid:] - WARN [QuorumPeer[myid=5](plain=/127.0.0.1:14056)(secure=disabled):QuorumPeer@1157] - PeerState set to LOOKING
[junit] 2016-05-26 14:27:21,722 [myid:] - WARN [QuorumPeer[myid=5](plain=/127.0.0.1:14056)(secure=disabled):QuorumPeer@1139] - QuorumPeer main thread exited
[junit] 2016-05-26 14:27:21,722 [myid:] - INFO [QuorumPeer[myid=5](plain=/127.0.0.1:14056)(secure=disabled):MBeanRegistry@128] - Unregister MBean [org.apache.ZooKeeperService:name0=ReplicatedServer_id5]
[junit] 2016-05-26 14:27:21,722 [myid:] - INFO [QuorumPeer[myid=5](plain=/127.0.0.1:14056)(secure=disabled):MBeanRegistry@128] - Unregister MBean [org.apache.ZooKeeperService:name0=ReplicatedServer_id5,name1=replica.5]
[junit] 2016-05-26 14:27:21,723 [myid:] - INFO [QuorumPeer[myid=5](plain=/127.0.0.1:14056)(secure=disabled):MBeanRegistry@128] - Unregister MBean [org.apache.ZooKeeperService:name0=ReplicatedServer_id5,name1=replica.1]
[junit] 2016-05-26 14:27:21,723 [myid:] - INFO [QuorumPeer[myid=5](plain=/127.0.0.1:14056)(secure=disabled):MBeanRegistry@128] - Unregister MBean [org.apache.ZooKeeperService:name0=ReplicatedServer_id5,name1=replica.2]
[junit] 2016-05-26 14:27:21,723 [myid:] - INFO [QuorumPeer[myid=5](plain=/127.0.0.1:14056)(secure=disabled):MBeanRegistry@128] - Unregister MBean [org.apache.ZooKeeperService:name0=ReplicatedServer_id5,name1=replica.3]
[junit] 2016-05-26 14:27:21,722 [myid:] - INFO [/127.0.0.1:14058:QuorumCnxManager$Listener@659] - Leaving listener
[junit] 2016-05-26 14:27:21,723 [myid:] - INFO [main:QuorumUtil@254] - Shutting down leader election QuorumPeer[myid=5](plain=/127.0.0.1:14056)(secure=disabled)
[junit] 2016-05-26 14:27:21,723 [myid:] - INFO [main:QuorumUtil@259] - Waiting for QuorumPeer[myid=5](plain=/127.0.0.1:14056)(secure=disabled) to exit thread
[junit] 2016-05-26 14:27:21,723 [myid:] - INFO [main:FourLetterWordMain@85] - connecting to 127.0.0.1 14044
[junit] 2016-05-26 14:27:21,724 [myid:] - INFO [main:QuorumUtil@243] - 127.0.0.1:14044 is no longer accepting client connections
[junit] 2016-05-26 14:27:21,724 [myid:] - INFO [main:FourLetterWordMain@85] - connecting to 127.0.0.1 14047
[junit] 2016-05-26 14:27:21,724 [myid:] - INFO [main:QuorumUtil@243] - 127.0.0.1:14047 is no longer accepting client connections
[junit] 2016-05-26 14:27:21,724 [myid:] - INFO [main:FourLetterWordMain@85] - connecting to 127.0.0.1 14050
[junit] 2016-05-26 14:27:21,724 [myid:] - INFO [main:QuorumUtil@243] - 127.0.0.1:14050 is no longer accepting client connections
[junit] 2016-05-26 14:27:21,724 [myid:] - INFO [main:FourLetterWordMain@85] - connecting to 127.0.0.1 14053
[junit] 2016-05-26 14:27:21,725 [myid:] - INFO [main:QuorumUtil@243] - 127.0.0.1:14053 is no longer accepting client connections
[junit] 2016-05-26 14:27:21,725 [myid:] - INFO [main:FourLetterWordMain@85] - connecting to 127.0.0.1 14056
[junit] 2016-05-26 14:27:21,725 [myid:] - INFO [main:QuorumUtil@243] - 127.0.0.1:14056 is no longer accepting client connections
[junit] 2016-05-26 14:27:21,726 [myid:] - INFO [main:ZKTestCase$1@65] - SUCCEEDED testRemoveOneAsynchronous
[junit] 2016-05-26 14:27:21,726 [myid:] - INFO [main:ZKTestCase$1@60] - FINISHED testRemoveOneAsynchronous
[junit] Tests run: 11, Failures: 0, Errors: 0, Skipped: 0, Time elapsed: 121.432 sec, Thread: 2, Class: org.apache.zookeeper.test.ReconfigTest
[junit] 2016-05-26 14:27:21,793 [myid:] - INFO [WorkerSender[myid=5]:FastLeaderElection$Messenger$WorkerSender@470] - WorkerSender is down
[junit] 2016-05-26 14:27:21,793 [myid:] - INFO [WorkerReceiver[myid=5]:FastLeaderElection$Messenger$WorkerReceiver@440] - WorkerReceiver is down
[junit] 2016-05-26 14:27:21,811 [myid:] - INFO [WorkerReceiver[myid=4]:FastLeaderElection$Messenger$WorkerReceiver@440] - WorkerReceiver is down
[junit] 2016-05-26 14:27:21,811 [myid:] - INFO [WorkerSender[myid=4]:FastLeaderElection$Messenger$WorkerSender@470] - WorkerSender is down
[junit] 2016-05-26 14:27:21,813 [myid:] - INFO [WorkerSender[myid=3]:FastLeaderElection$Messenger$WorkerSender@470] - WorkerSender is down
[junit] 2016-05-26 14:27:21,819 [myid:] - INFO [WorkerSender[myid=2]:FastLeaderElection$Messenger$WorkerSender@470] - WorkerSender is down
[junit] 2016-05-26 14:27:21,820 [myid:] - INFO [WorkerReceiver[myid=3]:FastLeaderElection$Messenger$WorkerReceiver@440] - WorkerReceiver is down
[junit] 2016-05-26 14:27:21,820 [myid:] - INFO [WorkerReceiver[myid=2]:FastLeaderElection$Messenger$WorkerReceiver@440] - WorkerReceiver is down
[junit] 2016-05-26 14:27:21,822 [myid:] - INFO [WorkerSender[myid=1]:FastLeaderElection$Messenger$WorkerSender@470] - WorkerSender is down
[junit] 2016-05-26 14:27:21,823 [myid:] - INFO [WorkerReceiver[myid=1]:FastLeaderElection$Messenger$WorkerReceiver@440] - WorkerReceiver is down
BUILD FAILED
/home/jenkins/jenkins-slave/workspace/ZooKeeper_branch35_openjdk7/branch-3.5/build.xml:1322: The following error occurred while executing this line:
/home/jenkins/jenkins-slave/workspace/ZooKeeper_branch35_openjdk7/branch-3.5/build.xml:1207: Tests failed!
Total time: 6 minutes 54 seconds
Build step 'Invoke Ant' marked build as failure
Archiving artifacts
Recording test results
Email was triggered for: Failure - Any
Sending email for trigger: Failure - Any
###################################################################################
############################## FAILED TESTS (if any) ##############################
1 tests failed.
FAILED: org.apache.zookeeper.server.quorum.ReconfigRecoveryTest.testCurrentServersAreObserversInNextConfig
Error Message:
waiting for server 3 being up
Stack Trace:
junit.framework.AssertionFailedError: waiting for server 3 being up
at org.apache.zookeeper.server.quorum.ReconfigRecoveryTest.testCurrentServersAreObserversInNextConfig(ReconfigRecoveryTest.java:217)
at org.apache.zookeeper.JUnit4ZKTestRunner$LoggedInvokeMethod.evaluate(JUnit4ZKTestRunner.java:79)