You are viewing a plain text version of this content. The canonical link for it is here.
Posted to builds@solr.apache.org by Apache Jenkins Server <je...@builds.apache.org> on 2026/01/17 09:22:14 UTC

[JENKINS] Solr » Solr-Test-10.x - Build # 892 - Still Failing!

Build: https://ci-builds.apache.org/job/Solr/job/Solr-Test-10.x/892/

All tests passed

Build Log:
[...truncated 1355 lines...]
BUILD FAILED in 36m 54s
147 actionable tasks: 147 executed

Publishing build scan...
https://develocity.apache.org/s/qeommeijaweiu

Build step 'Invoke Gradle script' changed build result to FAILURE
Build step 'Invoke Gradle script' marked build as failure
Archiving artifacts
Recording test results
[Checks API] No suitable checks publisher found.
Email was triggered for: Failure - Any
Sending email for trigger: Failure - Any

[JENKINS] Solr » Solr-Test-10.x - Build # 896 - Still Failing!

Posted by Apache Jenkins Server <je...@builds.apache.org>.
Build: https://ci-builds.apache.org/job/Solr/job/Solr-Test-10.x/896/

All tests passed

Build Log:
[...truncated 1354 lines...]
BUILD FAILED in 35m 16s
147 actionable tasks: 147 executed

Publishing build scan...
https://develocity.apache.org/s/446ybscritbqm

Build step 'Invoke Gradle script' changed build result to FAILURE
Build step 'Invoke Gradle script' marked build as failure
Archiving artifacts
Recording test results
[Checks API] No suitable checks publisher found.
Email was triggered for: Failure - Any
Sending email for trigger: Failure - Any

[JENKINS] Solr » Solr-Test-10.x - Build # 895 - Still Failing!

Posted by Apache Jenkins Server <je...@builds.apache.org>.
Build: https://ci-builds.apache.org/job/Solr/job/Solr-Test-10.x/895/

All tests passed

Build Log:
[...truncated 1357 lines...]
BUILD FAILED in 36m 48s
147 actionable tasks: 147 executed

Publishing build scan...
https://develocity.apache.org/s/5ak5ev5djme3e

Build step 'Invoke Gradle script' changed build result to FAILURE
Build step 'Invoke Gradle script' marked build as failure
Archiving artifacts
Recording test results
[Checks API] No suitable checks publisher found.
Email was triggered for: Failure - Any
Sending email for trigger: Failure - Any

[JENKINS] Solr » Solr-Test-10.x - Build # 894 - Still Failing!

Posted by Apache Jenkins Server <je...@builds.apache.org>.
Build: https://ci-builds.apache.org/job/Solr/job/Solr-Test-10.x/894/

All tests passed

Build Log:
[...truncated 1357 lines...]
BUILD FAILED in 36m 15s
147 actionable tasks: 147 executed

Publishing build scan...
https://develocity.apache.org/s/wo6uqthm5pwcw

Build step 'Invoke Gradle script' changed build result to FAILURE
Build step 'Invoke Gradle script' marked build as failure
Archiving artifacts
Recording test results
[Checks API] No suitable checks publisher found.
Email was triggered for: Failure - Any
Sending email for trigger: Failure - Any

[JENKINS] Solr » Solr-Test-10.x - Build # 893 - Still Failing!

Posted by Apache Jenkins Server <je...@builds.apache.org>.
Build: https://ci-builds.apache.org/job/Solr/job/Solr-Test-10.x/893/

All tests passed

Build Log:
[...truncated 1355 lines...]
BUILD FAILED in 35m 58s
147 actionable tasks: 147 executed

Publishing build scan...
https://develocity.apache.org/s/2jsdv3lgull6a

Build step 'Invoke Gradle script' changed build result to FAILURE
Build step 'Invoke Gradle script' marked build as failure
Archiving artifacts
Recording test results
[Checks API] No suitable checks publisher found.
Email was triggered for: Failure - Any
Sending email for trigger: Failure - Any