You are viewing a plain text version of this content. The canonical link for it is here.
Posted to dev@hama.apache.org by Apache Jenkins Server <je...@builds.apache.org> on 2012/02/03 00:00:53 UTC
Build failed in Jenkins: Hama-Nightly #444
See <https://builds.apache.org/job/Hama-Nightly/444/changes>
Changes:
[edwardyoon] Add license header and localhost as a default
[edwardyoon] Version up
------------------------------------------
Started by timer
Building remotely on ubuntu2
Reverting <https://builds.apache.org/job/Hama-Nightly/ws/trunk>
Updating http://svn.apache.org/repos/asf/incubator/hama/trunk
U graph/pom.xml
A dist
A dist/pom.xml
A conf
A conf/hama-env.sh
A conf/hama-default.xml
A conf/hama-site.xml
A conf/log4j.properties
A conf/groomservers
U CHANGES.txt
U src/site/resources/files/KEYS
U src/site/xdoc/index.xml
A src/assemble
A src/assemble/core.xml
A bin
A bin/grooms.sh
A bin/zookeepers.sh
A bin/hama-daemon.sh
A bin/hama-config.sh
A bin/hama-daemons.sh
A bin/stop-bspd.sh
A bin/hama
A bin/start-bspd.sh
D core/conf
D core/bin
U core/src/main/java/org/apache/hama/http/HttpServer.java
U core/src/main/java/org/apache/hama/bsp/GroomServer.java
U core/src/main/java/org/apache/hama/bsp/JobInProgress.java
U core/src/main/java/org/apache/hama/bsp/BSPJobClient.java
U core/src/main/java/org/apache/hama/bsp/LocalBSPRunner.java
U core/src/main/java/org/apache/hama/bsp/FileInputFormat.java
U core/pom.xml
U yarn/pom.xml
U pom.xml
U examples/src/test/java/org/apache/hama/examples/PageRankTest.java
U examples/src/test/java/org/apache/hama/examples/ShortestPathsTest.java
A examples/src/test/java/org/apache/hama/examples/util
AU examples/src/test/java/org/apache/hama/examples/util/PagerankTextToSeqTest.java
AU examples/src/test/java/org/apache/hama/examples/util/SSSPTextToSeqTest.java
U examples/src/main/java/org/apache/hama/examples/ExampleDriver.java
A examples/src/main/java/org/apache/hama/examples/util
AU examples/src/main/java/org/apache/hama/examples/util/TextToSequenceFile.java
AU examples/src/main/java/org/apache/hama/examples/util/PagerankTextToSeq.java
AU examples/src/main/java/org/apache/hama/examples/util/SSSPTextToSeq.java
U examples/pom.xml
At revision 1239909
[Hama-Nightly] $ /bin/bash -xe /tmp/hudson2632911406237453409.sh
+ echo /home/hudson/tools/java/latest1.6/bin:/usr/local/bin:/usr/bin:/bin:/usr/bin/X11:/usr/games:/home/hudson/.rvm/bin:/usr/ucb:/usr/sfw/bin:/usr/ccs/bin:/usr/ucb:/usr/sfw/bin:/usr/ccs/bin:/usr/ucb:/usr/sfw/bin:/usr/ccs/bin:/usr/ucb:/usr/sfw/bin:/usr/ccs/bin
/home/hudson/tools/java/latest1.6/bin:/usr/local/bin:/usr/bin:/bin:/usr/bin/X11:/usr/games:/home/hudson/.rvm/bin:/usr/ucb:/usr/sfw/bin:/usr/ccs/bin:/usr/ucb:/usr/sfw/bin:/usr/ccs/bin:/usr/ucb:/usr/sfw/bin:/usr/ccs/bin:/usr/ucb:/usr/sfw/bin:/usr/ccs/bin
+ whoami
hudson
+ ulimit -a
core file size (blocks, -c) 0
data seg size (kbytes, -d) unlimited
scheduling priority (-e) 20
file size (blocks, -f) unlimited
pending signals (-i) 16382
max locked memory (kbytes, -l) 64
max memory size (kbytes, -m) unlimited
open files (-n) 40000
pipe size (512 bytes, -p) 8
POSIX message queues (bytes, -q) 819200
real-time priority (-r) 0
stack size (kbytes, -s) 8192
cpu time (seconds, -t) unlimited
max user processes (-u) unlimited
virtual memory (kbytes, -v) unlimited
file locks (-x) unlimited
[trunk] $ /home/hudson/tools/maven/latest3/bin/mvn -Dmaven.repo.local=<https://builds.apache.org/job/Hama-Nightly/ws/.repository> clean install package
[INFO] Scanning for projects...
[ERROR] The build could not read 1 project -> [Help 1]
[ERROR]
[ERROR] The project (<https://builds.apache.org/job/Hama-Nightly/ws/trunk/dist/pom.xml)> has 1 error
[ERROR] Non-parseable POM <https://builds.apache.org/job/Hama-Nightly/ws/trunk/dist/pom.xml>: processing instruction can not have PITarget with reserveld xml name (position: START_DOCUMENT seen ...rning permissions and\n limitations under the License.\n-->\n<?xml ... @17:7) @ line 17, column 7 -> [Help 2]
[ERROR]
[ERROR] To see the full stack trace of the errors, re-run Maven with the -e switch.
[ERROR] Re-run Maven using the -X switch to enable full debug logging.
[ERROR]
[ERROR] For more information about the errors and possible solutions, please read the following articles:
[ERROR] [Help 1] http://cwiki.apache.org/confluence/display/MAVEN/ProjectBuildingException
[ERROR] [Help 2] http://cwiki.apache.org/confluence/display/MAVEN/ModelParseException
Build step 'Invoke top-level Maven targets' marked build as failure
Archiving artifacts
Recording test results
Jenkins build is back to normal : Hama-Nightly #445
Posted by Apache Jenkins Server <je...@builds.apache.org>.
See <https://builds.apache.org/job/Hama-Nightly/445/changes>