You are viewing a plain text version of this content. The canonical link for it is here.
Posted to dev@lucene.apache.org by Apache Jenkins Server <je...@builds.apache.org> on 2016/01/27 02:58:50 UTC
[JENKINS] Lucene-Solr-NightlyTests-5.x - Build # 1084 - Still
Failing
Build: https://builds.apache.org/job/Lucene-Solr-NightlyTests-5.x/1084/
1 tests failed.
FAILED: junit.framework.TestSuite.org.apache.solr.handler.TestSolrConfigHandlerCloud
Error Message:
ObjectTracker found 3 object(s) that were not released!!! [RawDirectoryWrapper, MDCAwareThreadPoolExecutor, RawDirectoryWrapper]
Stack Trace:
java.lang.AssertionError: ObjectTracker found 3 object(s) that were not released!!! [RawDirectoryWrapper, MDCAwareThreadPoolExecutor, RawDirectoryWrapper]
at __randomizedtesting.SeedInfo.seed([6046A6E442C2D55F]:0)
at org.junit.Assert.fail(Assert.java:93)
at org.junit.Assert.assertTrue(Assert.java:43)
at org.junit.Assert.assertNull(Assert.java:551)
at org.apache.solr.SolrTestCaseJ4.afterClass(SolrTestCaseJ4.java:229)
at sun.reflect.GeneratedMethodAccessor52.invoke(Unknown Source)
at sun.reflect.DelegatingMethodAccessorImpl.invoke(DelegatingMethodAccessorImpl.java:43)
at java.lang.reflect.Method.invoke(Method.java:606)
at com.carrotsearch.randomizedtesting.RandomizedRunner.invoke(RandomizedRunner.java:1764)
at com.carrotsearch.randomizedtesting.RandomizedRunner$7.evaluate(RandomizedRunner.java:834)
at com.carrotsearch.randomizedtesting.rules.StatementAdapter.evaluate(StatementAdapter.java:36)
at com.carrotsearch.randomizedtesting.rules.SystemPropertiesRestoreRule$1.evaluate(SystemPropertiesRestoreRule.java:57)
at org.apache.lucene.util.AbstractBeforeAfterRule$1.evaluate(AbstractBeforeAfterRule.java:46)
at com.carrotsearch.randomizedtesting.rules.StatementAdapter.evaluate(StatementAdapter.java:36)
at org.apache.lucene.util.TestRuleStoreClassName$1.evaluate(TestRuleStoreClassName.java:42)
at com.carrotsearch.randomizedtesting.rules.NoShadowingOrOverridesOnMethodsRule$1.evaluate(NoShadowingOrOverridesOnMethodsRule.java:40)
at com.carrotsearch.randomizedtesting.rules.NoShadowingOrOverridesOnMethodsRule$1.evaluate(NoShadowingOrOverridesOnMethodsRule.java:40)
at com.carrotsearch.randomizedtesting.rules.StatementAdapter.evaluate(StatementAdapter.java:36)
at com.carrotsearch.randomizedtesting.rules.StatementAdapter.evaluate(StatementAdapter.java:36)
at com.carrotsearch.randomizedtesting.rules.StatementAdapter.evaluate(StatementAdapter.java:36)
at org.apache.lucene.util.TestRuleAssertionsRequired$1.evaluate(TestRuleAssertionsRequired.java:54)
at org.apache.lucene.util.TestRuleMarkFailure$1.evaluate(TestRuleMarkFailure.java:48)
at org.apache.lucene.util.TestRuleIgnoreAfterMaxFailures$1.evaluate(TestRuleIgnoreAfterMaxFailures.java:65)
at org.apache.lucene.util.TestRuleIgnoreTestSuites$1.evaluate(TestRuleIgnoreTestSuites.java:55)
at com.carrotsearch.randomizedtesting.rules.StatementAdapter.evaluate(StatementAdapter.java:36)
at com.carrotsearch.randomizedtesting.ThreadLeakControl$StatementRunner.run(ThreadLeakControl.java:367)
at java.lang.Thread.run(Thread.java:745)
Build Log:
[...truncated 11275 lines...]
[junit4] Suite: org.apache.solr.handler.TestSolrConfigHandlerCloud
[junit4] 2> Creating dataDir: /x1/jenkins/jenkins-slave/workspace/Lucene-Solr-NightlyTests-5.x/solr/build/solr-core/test/J1/temp/solr.handler.TestSolrConfigHandlerCloud_6046A6E442C2D55F-001/init-core-data-001
[junit4] 2> 2586624 INFO (SUITE-TestSolrConfigHandlerCloud-seed#[6046A6E442C2D55F]-worker) [ ] o.a.s.SolrTestCaseJ4 Randomized ssl (false) and clientAuth (false)
[junit4] 2> 2586624 INFO (SUITE-TestSolrConfigHandlerCloud-seed#[6046A6E442C2D55F]-worker) [ ] o.a.s.BaseDistributedSearchTestCase Setting hostContext system property: /igmp/a
[junit4] 2> 2586627 INFO (TEST-TestSolrConfigHandlerCloud.test-seed#[6046A6E442C2D55F]) [ ] o.a.s.c.ZkTestServer STARTING ZK TEST SERVER
[junit4] 2> 2586627 INFO (Thread-6790) [ ] o.a.s.c.ZkTestServer client port:0.0.0.0/0.0.0.0:0
[junit4] 2> 2586627 INFO (Thread-6790) [ ] o.a.s.c.ZkTestServer Starting server
[junit4] 2> 2586727 INFO (TEST-TestSolrConfigHandlerCloud.test-seed#[6046A6E442C2D55F]) [ ] o.a.s.c.ZkTestServer start zk server on port:50958
[junit4] 2> 2586728 INFO (TEST-TestSolrConfigHandlerCloud.test-seed#[6046A6E442C2D55F]) [ ] o.a.s.c.c.SolrZkClient Using default ZkCredentialsProvider
[junit4] 2> 2586728 INFO (TEST-TestSolrConfigHandlerCloud.test-seed#[6046A6E442C2D55F]) [ ] o.a.s.c.c.ConnectionManager Waiting for client to connect to ZooKeeper
[junit4] 2> 2586731 INFO (zkCallback-944-thread-1) [ ] o.a.s.c.c.ConnectionManager Watcher org.apache.solr.common.cloud.ConnectionManager@6aa32f17 name:ZooKeeperConnection Watcher:127.0.0.1:50958 got event WatchedEvent state:SyncConnected type:None path:null path:null type:None
[junit4] 2> 2586731 INFO (TEST-TestSolrConfigHandlerCloud.test-seed#[6046A6E442C2D55F]) [ ] o.a.s.c.c.ConnectionManager Client is connected to ZooKeeper
[junit4] 2> 2586731 INFO (TEST-TestSolrConfigHandlerCloud.test-seed#[6046A6E442C2D55F]) [ ] o.a.s.c.c.SolrZkClient Using default ZkACLProvider
[junit4] 2> 2586731 INFO (TEST-TestSolrConfigHandlerCloud.test-seed#[6046A6E442C2D55F]) [ ] o.a.s.c.c.SolrZkClient makePath: /solr
[junit4] 2> 2586734 INFO (TEST-TestSolrConfigHandlerCloud.test-seed#[6046A6E442C2D55F]) [ ] o.a.s.c.c.SolrZkClient Using default ZkCredentialsProvider
[junit4] 2> 2586735 INFO (TEST-TestSolrConfigHandlerCloud.test-seed#[6046A6E442C2D55F]) [ ] o.a.s.c.c.ConnectionManager Waiting for client to connect to ZooKeeper
[junit4] 2> 2586736 INFO (zkCallback-945-thread-1) [ ] o.a.s.c.c.ConnectionManager Watcher org.apache.solr.common.cloud.ConnectionManager@1547626e name:ZooKeeperConnection Watcher:127.0.0.1:50958/solr got event WatchedEvent state:SyncConnected type:None path:null path:null type:None
[junit4] 2> 2586736 INFO (TEST-TestSolrConfigHandlerCloud.test-seed#[6046A6E442C2D55F]) [ ] o.a.s.c.c.ConnectionManager Client is connected to ZooKeeper
[junit4] 2> 2586736 INFO (TEST-TestSolrConfigHandlerCloud.test-seed#[6046A6E442C2D55F]) [ ] o.a.s.c.c.SolrZkClient Using default ZkACLProvider
[junit4] 2> 2586736 INFO (TEST-TestSolrConfigHandlerCloud.test-seed#[6046A6E442C2D55F]) [ ] o.a.s.c.c.SolrZkClient makePath: /collections/collection1
[junit4] 2> 2586738 INFO (TEST-TestSolrConfigHandlerCloud.test-seed#[6046A6E442C2D55F]) [ ] o.a.s.c.c.SolrZkClient makePath: /collections/collection1/shards
[junit4] 2> 2586740 INFO (TEST-TestSolrConfigHandlerCloud.test-seed#[6046A6E442C2D55F]) [ ] o.a.s.c.c.SolrZkClient makePath: /collections/control_collection
[junit4] 2> 2586741 INFO (TEST-TestSolrConfigHandlerCloud.test-seed#[6046A6E442C2D55F]) [ ] o.a.s.c.c.SolrZkClient makePath: /collections/control_collection/shards
[junit4] 2> 2586743 INFO (TEST-TestSolrConfigHandlerCloud.test-seed#[6046A6E442C2D55F]) [ ] o.a.s.c.AbstractZkTestCase put /x1/jenkins/jenkins-slave/workspace/Lucene-Solr-NightlyTests-5.x/solr/core/src/test-files/solr/collection1/conf/solrconfig-tlog.xml to /configs/conf1/solrconfig.xml
[junit4] 2> 2586743 INFO (TEST-TestSolrConfigHandlerCloud.test-seed#[6046A6E442C2D55F]) [ ] o.a.s.c.c.SolrZkClient makePath: /configs/conf1/solrconfig.xml
[junit4] 2> 2586746 INFO (TEST-TestSolrConfigHandlerCloud.test-seed#[6046A6E442C2D55F]) [ ] o.a.s.c.AbstractZkTestCase put /x1/jenkins/jenkins-slave/workspace/Lucene-Solr-NightlyTests-5.x/solr/core/src/test-files/solr/collection1/conf/schema.xml to /configs/conf1/schema.xml
[junit4] 2> 2586746 INFO (TEST-TestSolrConfigHandlerCloud.test-seed#[6046A6E442C2D55F]) [ ] o.a.s.c.c.SolrZkClient makePath: /configs/conf1/schema.xml
[junit4] 2> 2586748 INFO (TEST-TestSolrConfigHandlerCloud.test-seed#[6046A6E442C2D55F]) [ ] o.a.s.c.AbstractZkTestCase put /x1/jenkins/jenkins-slave/workspace/Lucene-Solr-NightlyTests-5.x/solr/core/src/test-files/solr/collection1/conf/solrconfig.snippet.randomindexconfig.xml to /configs/conf1/solrconfig.snippet.randomindexconfig.xml
[junit4] 2> 2586748 INFO (TEST-TestSolrConfigHandlerCloud.test-seed#[6046A6E442C2D55F]) [ ] o.a.s.c.c.SolrZkClient makePath: /configs/conf1/solrconfig.snippet.randomindexconfig.xml
[junit4] 2> 2586750 INFO (TEST-TestSolrConfigHandlerCloud.test-seed#[6046A6E442C2D55F]) [ ] o.a.s.c.AbstractZkTestCase put /x1/jenkins/jenkins-slave/workspace/Lucene-Solr-NightlyTests-5.x/solr/core/src/test-files/solr/collection1/conf/stopwords.txt to /configs/conf1/stopwords.txt
[junit4] 2> 2586750 INFO (TEST-TestSolrConfigHandlerCloud.test-seed#[6046A6E442C2D55F]) [ ] o.a.s.c.c.SolrZkClient makePath: /configs/conf1/stopwords.txt
[junit4] 2> 2586752 INFO (TEST-TestSolrConfigHandlerCloud.test-seed#[6046A6E442C2D55F]) [ ] o.a.s.c.AbstractZkTestCase put /x1/jenkins/jenkins-slave/workspace/Lucene-Solr-NightlyTests-5.x/solr/core/src/test-files/solr/collection1/conf/protwords.txt to /configs/conf1/protwords.txt
[junit4] 2> 2586752 INFO (TEST-TestSolrConfigHandlerCloud.test-seed#[6046A6E442C2D55F]) [ ] o.a.s.c.c.SolrZkClient makePath: /configs/conf1/protwords.txt
[junit4] 2> 2586754 INFO (TEST-TestSolrConfigHandlerCloud.test-seed#[6046A6E442C2D55F]) [ ] o.a.s.c.AbstractZkTestCase put /x1/jenkins/jenkins-slave/workspace/Lucene-Solr-NightlyTests-5.x/solr/core/src/test-files/solr/collection1/conf/currency.xml to /configs/conf1/currency.xml
[junit4] 2> 2586754 INFO (TEST-TestSolrConfigHandlerCloud.test-seed#[6046A6E442C2D55F]) [ ] o.a.s.c.c.SolrZkClient makePath: /configs/conf1/currency.xml
[junit4] 2> 2586756 INFO (TEST-TestSolrConfigHandlerCloud.test-seed#[6046A6E442C2D55F]) [ ] o.a.s.c.AbstractZkTestCase put /x1/jenkins/jenkins-slave/workspace/Lucene-Solr-NightlyTests-5.x/solr/core/src/test-files/solr/collection1/conf/enumsConfig.xml to /configs/conf1/enumsConfig.xml
[junit4] 2> 2586756 INFO (TEST-TestSolrConfigHandlerCloud.test-seed#[6046A6E442C2D55F]) [ ] o.a.s.c.c.SolrZkClient makePath: /configs/conf1/enumsConfig.xml
[junit4] 2> 2586758 INFO (TEST-TestSolrConfigHandlerCloud.test-seed#[6046A6E442C2D55F]) [ ] o.a.s.c.AbstractZkTestCase put /x1/jenkins/jenkins-slave/workspace/Lucene-Solr-NightlyTests-5.x/solr/core/src/test-files/solr/collection1/conf/open-exchange-rates.json to /configs/conf1/open-exchange-rates.json
[junit4] 2> 2586759 INFO (TEST-TestSolrConfigHandlerCloud.test-seed#[6046A6E442C2D55F]) [ ] o.a.s.c.c.SolrZkClient makePath: /configs/conf1/open-exchange-rates.json
[junit4] 2> 2586760 INFO (TEST-TestSolrConfigHandlerCloud.test-seed#[6046A6E442C2D55F]) [ ] o.a.s.c.AbstractZkTestCase put /x1/jenkins/jenkins-slave/workspace/Lucene-Solr-NightlyTests-5.x/solr/core/src/test-files/solr/collection1/conf/mapping-ISOLatin1Accent.txt to /configs/conf1/mapping-ISOLatin1Accent.txt
[junit4] 2> 2586761 INFO (TEST-TestSolrConfigHandlerCloud.test-seed#[6046A6E442C2D55F]) [ ] o.a.s.c.c.SolrZkClient makePath: /configs/conf1/mapping-ISOLatin1Accent.txt
[junit4] 2> 2586762 INFO (TEST-TestSolrConfigHandlerCloud.test-seed#[6046A6E442C2D55F]) [ ] o.a.s.c.AbstractZkTestCase put /x1/jenkins/jenkins-slave/workspace/Lucene-Solr-NightlyTests-5.x/solr/core/src/test-files/solr/collection1/conf/old_synonyms.txt to /configs/conf1/old_synonyms.txt
[junit4] 2> 2586763 INFO (TEST-TestSolrConfigHandlerCloud.test-seed#[6046A6E442C2D55F]) [ ] o.a.s.c.c.SolrZkClient makePath: /configs/conf1/old_synonyms.txt
[junit4] 2> 2586764 INFO (TEST-TestSolrConfigHandlerCloud.test-seed#[6046A6E442C2D55F]) [ ] o.a.s.c.AbstractZkTestCase put /x1/jenkins/jenkins-slave/workspace/Lucene-Solr-NightlyTests-5.x/solr/core/src/test-files/solr/collection1/conf/synonyms.txt to /configs/conf1/synonyms.txt
[junit4] 2> 2586764 INFO (TEST-TestSolrConfigHandlerCloud.test-seed#[6046A6E442C2D55F]) [ ] o.a.s.c.c.SolrZkClient makePath: /configs/conf1/synonyms.txt
[junit4] 2> 2586854 INFO (TEST-TestSolrConfigHandlerCloud.test-seed#[6046A6E442C2D55F]) [ ] o.a.s.SolrTestCaseJ4 Writing core.properties file to /x1/jenkins/jenkins-slave/workspace/Lucene-Solr-NightlyTests-5.x/solr/build/solr-core/test/J1/temp/solr.handler.TestSolrConfigHandlerCloud_6046A6E442C2D55F-001/control-001/cores/collection1
[junit4] 2> 2586856 INFO (TEST-TestSolrConfigHandlerCloud.test-seed#[6046A6E442C2D55F]) [ ] o.e.j.s.Server jetty-9.2.13.v20150730
[junit4] 2> 2586858 INFO (TEST-TestSolrConfigHandlerCloud.test-seed#[6046A6E442C2D55F]) [ ] o.e.j.s.h.ContextHandler Started o.e.j.s.ServletContextHandler@78bb697c{/igmp/a,null,AVAILABLE}
[junit4] 2> 2586860 INFO (TEST-TestSolrConfigHandlerCloud.test-seed#[6046A6E442C2D55F]) [ ] o.e.j.s.ServerConnector Started ServerConnector@1bdde3d8{HTTP/1.1}{127.0.0.1:45781}
[junit4] 2> 2586860 INFO (TEST-TestSolrConfigHandlerCloud.test-seed#[6046A6E442C2D55F]) [ ] o.e.j.s.Server Started @2589742ms
[junit4] 2> 2586860 INFO (TEST-TestSolrConfigHandlerCloud.test-seed#[6046A6E442C2D55F]) [ ] o.a.s.c.s.e.JettySolrRunner Jetty properties: {solr.data.dir=/x1/jenkins/jenkins-slave/workspace/Lucene-Solr-NightlyTests-5.x/solr/build/solr-core/test/J1/temp/solr.handler.TestSolrConfigHandlerCloud_6046A6E442C2D55F-001/tempDir-001/control/data, hostPort=45781, coreRootDirectory=/x1/jenkins/jenkins-slave/workspace/Lucene-Solr-NightlyTests-5.x/solr/build/solr-core/test/J1/../../../../../../../../../../x1/jenkins/jenkins-slave/workspace/Lucene-Solr-NightlyTests-5.x/solr/build/solr-core/test/J1/temp/solr.handler.TestSolrConfigHandlerCloud_6046A6E442C2D55F-001/control-001/cores, hostContext=/igmp/a}
[junit4] 2> 2586860 INFO (TEST-TestSolrConfigHandlerCloud.test-seed#[6046A6E442C2D55F]) [ ] o.a.s.s.SolrDispatchFilter SolrDispatchFilter.init(): sun.misc.Launcher$AppClassLoader@3827de24
[junit4] 2> 2586860 INFO (TEST-TestSolrConfigHandlerCloud.test-seed#[6046A6E442C2D55F]) [ ] o.a.s.c.SolrResourceLoader new SolrResourceLoader for directory: '/x1/jenkins/jenkins-slave/workspace/Lucene-Solr-NightlyTests-5.x/solr/build/solr-core/test/J1/temp/solr.handler.TestSolrConfigHandlerCloud_6046A6E442C2D55F-001/control-001'
[junit4] 2> 2586860 INFO (TEST-TestSolrConfigHandlerCloud.test-seed#[6046A6E442C2D55F]) [ ] o.a.s.c.SolrResourceLoader JNDI not configured for solr (NoInitialContextEx)
[junit4] 2> 2586861 INFO (TEST-TestSolrConfigHandlerCloud.test-seed#[6046A6E442C2D55F]) [ ] o.a.s.c.SolrResourceLoader solr home defaulted to 'solr/' (could not find system property or JNDI)
[junit4] 2> 2586861 INFO (TEST-TestSolrConfigHandlerCloud.test-seed#[6046A6E442C2D55F]) [ ] o.a.s.c.c.SolrZkClient Using default ZkCredentialsProvider
[junit4] 2> 2586864 INFO (TEST-TestSolrConfigHandlerCloud.test-seed#[6046A6E442C2D55F]) [ ] o.a.s.c.c.ConnectionManager Waiting for client to connect to ZooKeeper
[junit4] 2> 2586865 INFO (zkCallback-946-thread-1) [ ] o.a.s.c.c.ConnectionManager Watcher org.apache.solr.common.cloud.ConnectionManager@6556ea59 name:ZooKeeperConnection Watcher:127.0.0.1:50958/solr got event WatchedEvent state:SyncConnected type:None path:null path:null type:None
[junit4] 2> 2586865 INFO (TEST-TestSolrConfigHandlerCloud.test-seed#[6046A6E442C2D55F]) [ ] o.a.s.c.c.ConnectionManager Client is connected to ZooKeeper
[junit4] 2> 2586865 INFO (TEST-TestSolrConfigHandlerCloud.test-seed#[6046A6E442C2D55F]) [ ] o.a.s.c.c.SolrZkClient Using default ZkACLProvider
[junit4] 2> 2586866 INFO (TEST-TestSolrConfigHandlerCloud.test-seed#[6046A6E442C2D55F]) [ ] o.a.s.s.SolrDispatchFilter Loading solr.xml from SolrHome (not found in ZooKeeper)
[junit4] 2> 2586866 INFO (TEST-TestSolrConfigHandlerCloud.test-seed#[6046A6E442C2D55F]) [ ] o.a.s.c.SolrXmlConfig Loading container configuration from /x1/jenkins/jenkins-slave/workspace/Lucene-Solr-NightlyTests-5.x/solr/build/solr-core/test/J1/temp/solr.handler.TestSolrConfigHandlerCloud_6046A6E442C2D55F-001/control-001/solr.xml
[junit4] 2> 2586881 INFO (TEST-TestSolrConfigHandlerCloud.test-seed#[6046A6E442C2D55F]) [ ] o.a.s.c.CorePropertiesLocator Config-defined core root directory: /x1/jenkins/jenkins-slave/workspace/Lucene-Solr-NightlyTests-5.x/solr/build/solr-core/test/J1/../../../../../../../../../../x1/jenkins/jenkins-slave/workspace/Lucene-Solr-NightlyTests-5.x/solr/build/solr-core/test/J1/temp/solr.handler.TestSolrConfigHandlerCloud_6046A6E442C2D55F-001/control-001/cores
[junit4] 2> 2586881 INFO (TEST-TestSolrConfigHandlerCloud.test-seed#[6046A6E442C2D55F]) [ ] o.a.s.c.CoreContainer New CoreContainer 780654682
[junit4] 2> 2586881 INFO (TEST-TestSolrConfigHandlerCloud.test-seed#[6046A6E442C2D55F]) [ ] o.a.s.c.CoreContainer Loading cores into CoreContainer [instanceDir=/x1/jenkins/jenkins-slave/workspace/Lucene-Solr-NightlyTests-5.x/solr/build/solr-core/test/J1/temp/solr.handler.TestSolrConfigHandlerCloud_6046A6E442C2D55F-001/control-001]
[junit4] 2> 2586881 WARN (TEST-TestSolrConfigHandlerCloud.test-seed#[6046A6E442C2D55F]) [ ] o.a.s.c.CoreContainer Couldn't add files from /x1/jenkins/jenkins-slave/workspace/Lucene-Solr-NightlyTests-5.x/solr/build/solr-core/test/J1/temp/solr.handler.TestSolrConfigHandlerCloud_6046A6E442C2D55F-001/control-001/lib to classpath: /x1/jenkins/jenkins-slave/workspace/Lucene-Solr-NightlyTests-5.x/solr/build/solr-core/test/J1/temp/solr.handler.TestSolrConfigHandlerCloud_6046A6E442C2D55F-001/control-001/lib
[junit4] 2> 2586881 INFO (TEST-TestSolrConfigHandlerCloud.test-seed#[6046A6E442C2D55F]) [ ] o.a.s.h.c.HttpShardHandlerFactory created with socketTimeout : 90000,urlScheme : ,connTimeout : 15000,maxConnectionsPerHost : 20,maxConnections : 10000,corePoolSize : 0,maximumPoolSize : 2147483647,maxThreadIdleTime : 5,sizeOfQueue : -1,fairnessPolicy : false,useRetries : false,
[junit4] 2> 2586883 INFO (TEST-TestSolrConfigHandlerCloud.test-seed#[6046A6E442C2D55F]) [ ] o.a.s.u.UpdateShardHandler Creating UpdateShardHandler HTTP client with params: socketTimeout=340000&connTimeout=45000&retry=true
[junit4] 2> 2586883 INFO (TEST-TestSolrConfigHandlerCloud.test-seed#[6046A6E442C2D55F]) [ ] o.a.s.l.LogWatcher SLF4J impl is org.slf4j.impl.Log4jLoggerFactory
[junit4] 2> 2586883 INFO (TEST-TestSolrConfigHandlerCloud.test-seed#[6046A6E442C2D55F]) [ ] o.a.s.l.LogWatcher Registering Log Listener [Log4j (org.slf4j.impl.Log4jLoggerFactory)]
[junit4] 2> 2586883 INFO (TEST-TestSolrConfigHandlerCloud.test-seed#[6046A6E442C2D55F]) [ ] o.a.s.c.ZkContainer Zookeeper client=127.0.0.1:50958/solr
[junit4] 2> 2586884 INFO (TEST-TestSolrConfigHandlerCloud.test-seed#[6046A6E442C2D55F]) [ ] o.a.s.c.ZkController zkHost includes chroot
[junit4] 2> 2586884 INFO (TEST-TestSolrConfigHandlerCloud.test-seed#[6046A6E442C2D55F]) [ ] o.a.s.c.c.SolrZkClient Using default ZkCredentialsProvider
[junit4] 2> 2586884 INFO (TEST-TestSolrConfigHandlerCloud.test-seed#[6046A6E442C2D55F]) [ ] o.a.s.c.c.ConnectionManager Waiting for client to connect to ZooKeeper
[junit4] 2> 2586885 INFO (zkCallback-949-thread-1) [ ] o.a.s.c.c.ConnectionManager Watcher org.apache.solr.common.cloud.ConnectionManager@7de00bdd name:ZooKeeperConnection Watcher:127.0.0.1:50958 got event WatchedEvent state:SyncConnected type:None path:null path:null type:None
[junit4] 2> 2586886 INFO (TEST-TestSolrConfigHandlerCloud.test-seed#[6046A6E442C2D55F]) [ ] o.a.s.c.c.ConnectionManager Client is connected to ZooKeeper
[junit4] 2> 2586886 INFO (TEST-TestSolrConfigHandlerCloud.test-seed#[6046A6E442C2D55F]) [ ] o.a.s.c.c.SolrZkClient Using default ZkACLProvider
[junit4] 2> 2586888 INFO (TEST-TestSolrConfigHandlerCloud.test-seed#[6046A6E442C2D55F]) [n:127.0.0.1:45781_igmp%2Fa ] o.a.s.c.c.ConnectionManager Waiting for client to connect to ZooKeeper
[junit4] 2> 2586889 INFO (zkCallback-950-thread-1-processing-n:127.0.0.1:45781_igmp%2Fa) [n:127.0.0.1:45781_igmp%2Fa ] o.a.s.c.c.ConnectionManager Watcher org.apache.solr.common.cloud.ConnectionManager@438695be name:ZooKeeperConnection Watcher:127.0.0.1:50958/solr got event WatchedEvent state:SyncConnected type:None path:null path:null type:None
[junit4] 2> 2586890 INFO (TEST-TestSolrConfigHandlerCloud.test-seed#[6046A6E442C2D55F]) [n:127.0.0.1:45781_igmp%2Fa ] o.a.s.c.c.ConnectionManager Client is connected to ZooKeeper
[junit4] 2> 2586891 INFO (TEST-TestSolrConfigHandlerCloud.test-seed#[6046A6E442C2D55F]) [n:127.0.0.1:45781_igmp%2Fa ] o.a.s.c.c.SolrZkClient makePath: /overseer/queue
[junit4] 2> 2586893 INFO (TEST-TestSolrConfigHandlerCloud.test-seed#[6046A6E442C2D55F]) [n:127.0.0.1:45781_igmp%2Fa ] o.a.s.c.c.SolrZkClient makePath: /overseer/collection-queue-work
[junit4] 2> 2586896 INFO (TEST-TestSolrConfigHandlerCloud.test-seed#[6046A6E442C2D55F]) [n:127.0.0.1:45781_igmp%2Fa ] o.a.s.c.c.SolrZkClient makePath: /overseer/collection-map-running
[junit4] 2> 2586898 INFO (TEST-TestSolrConfigHandlerCloud.test-seed#[6046A6E442C2D55F]) [n:127.0.0.1:45781_igmp%2Fa ] o.a.s.c.c.SolrZkClient makePath: /overseer/collection-map-completed
[junit4] 2> 2586900 INFO (TEST-TestSolrConfigHandlerCloud.test-seed#[6046A6E442C2D55F]) [n:127.0.0.1:45781_igmp%2Fa ] o.a.s.c.c.SolrZkClient makePath: /overseer/collection-map-failure
[junit4] 2> 2586902 INFO (TEST-TestSolrConfigHandlerCloud.test-seed#[6046A6E442C2D55F]) [n:127.0.0.1:45781_igmp%2Fa ] o.a.s.c.c.SolrZkClient makePath: /live_nodes
[junit4] 2> 2586903 INFO (TEST-TestSolrConfigHandlerCloud.test-seed#[6046A6E442C2D55F]) [n:127.0.0.1:45781_igmp%2Fa ] o.a.s.c.c.SolrZkClient makePath: /aliases.json
[junit4] 2> 2586905 INFO (TEST-TestSolrConfigHandlerCloud.test-seed#[6046A6E442C2D55F]) [n:127.0.0.1:45781_igmp%2Fa ] o.a.s.c.c.SolrZkClient makePath: /clusterstate.json
[junit4] 2> 2586906 INFO (TEST-TestSolrConfigHandlerCloud.test-seed#[6046A6E442C2D55F]) [n:127.0.0.1:45781_igmp%2Fa ] o.a.s.c.c.SolrZkClient makePath: /security.json
[junit4] 2> 2586907 INFO (TEST-TestSolrConfigHandlerCloud.test-seed#[6046A6E442C2D55F]) [n:127.0.0.1:45781_igmp%2Fa ] o.a.s.c.ZkController Register node as live in ZooKeeper:/live_nodes/127.0.0.1:45781_igmp%2Fa
[junit4] 2> 2586907 INFO (TEST-TestSolrConfigHandlerCloud.test-seed#[6046A6E442C2D55F]) [n:127.0.0.1:45781_igmp%2Fa ] o.a.s.c.c.SolrZkClient makePath: /live_nodes/127.0.0.1:45781_igmp%2Fa
[junit4] 2> 2586909 INFO (TEST-TestSolrConfigHandlerCloud.test-seed#[6046A6E442C2D55F]) [n:127.0.0.1:45781_igmp%2Fa ] o.a.s.c.c.SolrZkClient makePath: /overseer_elect
[junit4] 2> 2586910 INFO (TEST-TestSolrConfigHandlerCloud.test-seed#[6046A6E442C2D55F]) [n:127.0.0.1:45781_igmp%2Fa ] o.a.s.c.c.SolrZkClient makePath: /overseer_elect/election
[junit4] 2> 2586912 INFO (TEST-TestSolrConfigHandlerCloud.test-seed#[6046A6E442C2D55F]) [n:127.0.0.1:45781_igmp%2Fa ] o.a.s.c.Overseer Overseer (id=null) closing
[junit4] 2> 2586913 INFO (TEST-TestSolrConfigHandlerCloud.test-seed#[6046A6E442C2D55F]) [n:127.0.0.1:45781_igmp%2Fa ] o.a.s.c.LeaderElector Joined leadership election with path: /overseer_elect/election/95280051139575812-127.0.0.1:45781_igmp%2Fa-n_0000000000
[junit4] 2> 2586913 INFO (TEST-TestSolrConfigHandlerCloud.test-seed#[6046A6E442C2D55F]) [n:127.0.0.1:45781_igmp%2Fa ] o.a.s.c.OverseerElectionContext I am going to be the leader 127.0.0.1:45781_igmp%2Fa
[junit4] 2> 2586913 INFO (TEST-TestSolrConfigHandlerCloud.test-seed#[6046A6E442C2D55F]) [n:127.0.0.1:45781_igmp%2Fa ] o.a.s.c.c.SolrZkClient makePath: /overseer_elect/leader
[junit4] 2> 2586914 INFO (TEST-TestSolrConfigHandlerCloud.test-seed#[6046A6E442C2D55F]) [n:127.0.0.1:45781_igmp%2Fa ] o.a.s.c.Overseer Overseer (id=95280051139575812-127.0.0.1:45781_igmp%2Fa-n_0000000000) starting
[junit4] 2> 2586916 INFO (TEST-TestSolrConfigHandlerCloud.test-seed#[6046A6E442C2D55F]) [n:127.0.0.1:45781_igmp%2Fa ] o.a.s.c.c.SolrZkClient makePath: /overseer/queue-work
[junit4] 2> 2586927 INFO (TEST-TestSolrConfigHandlerCloud.test-seed#[6046A6E442C2D55F]) [n:127.0.0.1:45781_igmp%2Fa ] o.a.s.c.OverseerAutoReplicaFailoverThread Starting OverseerAutoReplicaFailoverThread autoReplicaFailoverWorkLoopDelay=10000 autoReplicaFailoverWaitAfterExpiration=30000 autoReplicaFailoverBadNodeExpiration=60000
[junit4] 2> 2586929 INFO (OverseerStateUpdate-95280051139575812-127.0.0.1:45781_igmp%2Fa-n_0000000000) [n:127.0.0.1:45781_igmp%2Fa ] o.a.s.c.Overseer Starting to work on the main queue
[junit4] 2> 2586929 INFO (OverseerStateUpdate-95280051139575812-127.0.0.1:45781_igmp%2Fa-n_0000000000) [n:127.0.0.1:45781_igmp%2Fa ] o.a.s.c.c.ZkStateReader Updating cluster state from ZooKeeper...
[junit4] 2> 2586933 INFO (OverseerCollectionConfigSetProcessor-95280051139575812-127.0.0.1:45781_igmp%2Fa-n_0000000000) [n:127.0.0.1:45781_igmp%2Fa ] o.a.s.c.OverseerTaskProcessor Process current queue of overseer operations
[junit4] 2> 2586936 INFO (TEST-TestSolrConfigHandlerCloud.test-seed#[6046A6E442C2D55F]) [n:127.0.0.1:45781_igmp%2Fa ] o.a.s.c.c.ZkStateReader Updating cluster state from ZooKeeper...
[junit4] 2> 2586953 INFO (TEST-TestSolrConfigHandlerCloud.test-seed#[6046A6E442C2D55F]) [n:127.0.0.1:45781_igmp%2Fa ] o.a.s.c.CoreContainer Security conf doesn't exist. Skipping setup for authorization module.
[junit4] 2> 2586953 INFO (TEST-TestSolrConfigHandlerCloud.test-seed#[6046A6E442C2D55F]) [n:127.0.0.1:45781_igmp%2Fa ] o.a.s.c.CoreContainer No authentication plugin used.
[junit4] 2> 2586955 INFO (TEST-TestSolrConfigHandlerCloud.test-seed#[6046A6E442C2D55F]) [n:127.0.0.1:45781_igmp%2Fa ] o.a.s.c.CorePropertiesLocator Looking for core definitions underneath /x1/jenkins/jenkins-slave/workspace/Lucene-Solr-NightlyTests-5.x/solr/build/solr-core/test/J1/../../../../../../../../../../x1/jenkins/jenkins-slave/workspace/Lucene-Solr-NightlyTests-5.x/solr/build/solr-core/test/J1/temp/solr.handler.TestSolrConfigHandlerCloud_6046A6E442C2D55F-001/control-001/cores
[junit4] 2> 2586956 INFO (TEST-TestSolrConfigHandlerCloud.test-seed#[6046A6E442C2D55F]) [n:127.0.0.1:45781_igmp%2Fa ] o.a.s.c.CoreDescriptor Created CoreDescriptor: {collection=control_collection, configSetProperties=configsetprops.json, name=collection1, config=solrconfig.xml, dataDir=data/, coreNodeName=, schema=schema.xml, transient=false, loadOnStartup=true, shard=}
[junit4] 2> 2586956 INFO (TEST-TestSolrConfigHandlerCloud.test-seed#[6046A6E442C2D55F]) [n:127.0.0.1:45781_igmp%2Fa ] o.a.s.c.CorePropertiesLocator Found core collection1 in /x1/jenkins/jenkins-slave/workspace/Lucene-Solr-NightlyTests-5.x/solr/build/solr-core/test/J1/../../../../../../../../../../x1/jenkins/jenkins-slave/workspace/Lucene-Solr-NightlyTests-5.x/solr/build/solr-core/test/J1/temp/solr.handler.TestSolrConfigHandlerCloud_6046A6E442C2D55F-001/control-001/cores/collection1
[junit4] 2> 2586956 INFO (TEST-TestSolrConfigHandlerCloud.test-seed#[6046A6E442C2D55F]) [n:127.0.0.1:45781_igmp%2Fa ] o.a.s.c.CorePropertiesLocator Found 1 core definitions
[junit4] 2> 2586958 INFO (coreLoadExecutor-2778-thread-1-processing-n:127.0.0.1:45781_igmp%2Fa) [n:127.0.0.1:45781_igmp%2Fa c:control_collection x:collection1] o.a.s.c.ZkController publishing state=down
[junit4] 2> 2586958 INFO (coreLoadExecutor-2778-thread-1-processing-n:127.0.0.1:45781_igmp%2Fa) [n:127.0.0.1:45781_igmp%2Fa c:control_collection x:collection1] o.a.s.c.ZkController numShards not found on descriptor - reading it from system property
[junit4] 2> 2586959 INFO (TEST-TestSolrConfigHandlerCloud.test-seed#[6046A6E442C2D55F]) [n:127.0.0.1:45781_igmp%2Fa ] o.a.s.s.SolrDispatchFilter user.dir=/x1/jenkins/jenkins-slave/workspace/Lucene-Solr-NightlyTests-5.x/solr/build/solr-core/test/J1
[junit4] 2> 2586959 INFO (TEST-TestSolrConfigHandlerCloud.test-seed#[6046A6E442C2D55F]) [n:127.0.0.1:45781_igmp%2Fa ] o.a.s.s.SolrDispatchFilter SolrDispatchFilter.init() done
[junit4] 2> 2586960 INFO (OverseerStateUpdate-95280051139575812-127.0.0.1:45781_igmp%2Fa-n_0000000000) [n:127.0.0.1:45781_igmp%2Fa ] o.a.s.c.Overseer processMessage: queueSize: 1, message = {
[junit4] 2> "numShards":"1",
[junit4] 2> "state":"down",
[junit4] 2> "shard":null,
[junit4] 2> "core":"collection1",
[junit4] 2> "node_name":"127.0.0.1:45781_igmp%2Fa",
[junit4] 2> "collection":"control_collection",
[junit4] 2> "base_url":"http://127.0.0.1:45781/igmp/a",
[junit4] 2> "operation":"state",
[junit4] 2> "roles":null} current state version: 0
[junit4] 2> 2586961 INFO (OverseerStateUpdate-95280051139575812-127.0.0.1:45781_igmp%2Fa-n_0000000000) [n:127.0.0.1:45781_igmp%2Fa ] o.a.s.c.o.ReplicaMutator Update state numShards=1 message={
[junit4] 2> "numShards":"1",
[junit4] 2> "state":"down",
[junit4] 2> "shard":null,
[junit4] 2> "core":"collection1",
[junit4] 2> "node_name":"127.0.0.1:45781_igmp%2Fa",
[junit4] 2> "collection":"control_collection",
[junit4] 2> "base_url":"http://127.0.0.1:45781/igmp/a",
[junit4] 2> "operation":"state",
[junit4] 2> "roles":null}
[junit4] 2> 2586961 INFO (coreLoadExecutor-2778-thread-1-processing-n:127.0.0.1:45781_igmp%2Fa) [n:127.0.0.1:45781_igmp%2Fa c:control_collection x:collection1] o.a.s.c.ZkController look for our core node name
[junit4] 2> 2586961 INFO (OverseerStateUpdate-95280051139575812-127.0.0.1:45781_igmp%2Fa-n_0000000000) [n:127.0.0.1:45781_igmp%2Fa ] o.a.s.c.o.ClusterStateMutator building a new cName: control_collection
[junit4] 2> 2586962 INFO (OverseerStateUpdate-95280051139575812-127.0.0.1:45781_igmp%2Fa-n_0000000000) [n:127.0.0.1:45781_igmp%2Fa ] o.a.s.c.o.ReplicaMutator Assigning new node to shard shard=shard1
[junit4] 2> 2586963 INFO (zkCallback-950-thread-1-processing-n:127.0.0.1:45781_igmp%2Fa) [n:127.0.0.1:45781_igmp%2Fa ] o.a.s.c.c.ZkStateReader A cluster state change: [WatchedEvent state:SyncConnected type:NodeDataChanged path:/clusterstate.json], has occurred - updating... (live nodes size: [1])
[junit4] 2> 2586964 INFO (zkCallback-950-thread-2-processing-n:127.0.0.1:45781_igmp%2Fa) [n:127.0.0.1:45781_igmp%2Fa ] o.a.s.c.c.ZkStateReader A cluster state change: [WatchedEvent state:SyncConnected type:NodeDataChanged path:/clusterstate.json], has occurred - updating... (live nodes size: [1])
[junit4] 2> 2587962 INFO (coreLoadExecutor-2778-thread-1-processing-n:127.0.0.1:45781_igmp%2Fa) [n:127.0.0.1:45781_igmp%2Fa c:control_collection x:collection1] o.a.s.c.ZkController waiting to find shard id in clusterstate for collection1
[junit4] 2> 2587962 INFO (coreLoadExecutor-2778-thread-1-processing-n:127.0.0.1:45781_igmp%2Fa) [n:127.0.0.1:45781_igmp%2Fa c:control_collection x:collection1] o.a.s.c.ZkController Check for collection zkNode:control_collection
[junit4] 2> 2587963 INFO (coreLoadExecutor-2778-thread-1-processing-n:127.0.0.1:45781_igmp%2Fa) [n:127.0.0.1:45781_igmp%2Fa c:control_collection x:collection1] o.a.s.c.ZkController Collection zkNode exists
[junit4] 2> 2587963 INFO (coreLoadExecutor-2778-thread-1-processing-n:127.0.0.1:45781_igmp%2Fa) [n:127.0.0.1:45781_igmp%2Fa c:control_collection x:collection1] o.a.s.c.c.ZkStateReader Load collection config from: [/collections/control_collection]
[junit4] 2> 2587964 INFO (coreLoadExecutor-2778-thread-1-processing-n:127.0.0.1:45781_igmp%2Fa) [n:127.0.0.1:45781_igmp%2Fa c:control_collection x:collection1] o.a.s.c.c.ZkStateReader path=[/collections/control_collection] [configName]=[conf1] specified config exists in ZooKeeper
[junit4] 2> 2587964 INFO (coreLoadExecutor-2778-thread-1-processing-n:127.0.0.1:45781_igmp%2Fa) [n:127.0.0.1:45781_igmp%2Fa c:control_collection x:collection1] o.a.s.c.SolrResourceLoader new SolrResourceLoader for directory: '/x1/jenkins/jenkins-slave/workspace/Lucene-Solr-NightlyTests-5.x/solr/build/solr-core/test/J1/temp/solr.handler.TestSolrConfigHandlerCloud_6046A6E442C2D55F-001/control-001/cores/collection1'
[junit4] 2> 2587964 INFO (coreLoadExecutor-2778-thread-1-processing-n:127.0.0.1:45781_igmp%2Fa) [n:127.0.0.1:45781_igmp%2Fa c:control_collection x:collection1] o.a.s.c.SolrResourceLoader JNDI not configured for solr (NoInitialContextEx)
[junit4] 2> 2587964 INFO (coreLoadExecutor-2778-thread-1-processing-n:127.0.0.1:45781_igmp%2Fa) [n:127.0.0.1:45781_igmp%2Fa c:control_collection x:collection1] o.a.s.c.SolrResourceLoader solr home defaulted to 'solr/' (could not find system property or JNDI)
[junit4] 2> 2587966 INFO (coreLoadExecutor-2778-thread-1-processing-n:127.0.0.1:45781_igmp%2Fa) [n:127.0.0.1:45781_igmp%2Fa c:control_collection x:collection1] o.a.s.c.Config loaded config solrconfig.xml with version 0
[junit4] 2> 2587973 INFO (coreLoadExecutor-2778-thread-1-processing-n:127.0.0.1:45781_igmp%2Fa) [n:127.0.0.1:45781_igmp%2Fa c:control_collection x:collection1] o.a.s.c.SolrConfig current version of requestparams : -1
[junit4] 2> 2587989 INFO (coreLoadExecutor-2778-thread-1-processing-n:127.0.0.1:45781_igmp%2Fa) [n:127.0.0.1:45781_igmp%2Fa c:control_collection x:collection1] o.a.s.c.SolrConfig Using Lucene MatchVersion: 5.5.0
[junit4] 2> 2588033 INFO (coreLoadExecutor-2778-thread-1-processing-n:127.0.0.1:45781_igmp%2Fa) [n:127.0.0.1:45781_igmp%2Fa c:control_collection x:collection1] o.a.s.c.SolrConfig Loaded SolrConfig: solrconfig.xml
[junit4] 2> 2588041 INFO (coreLoadExecutor-2778-thread-1-processing-n:127.0.0.1:45781_igmp%2Fa) [n:127.0.0.1:45781_igmp%2Fa c:control_collection x:collection1] o.a.s.s.IndexSchema [collection1] Schema name=test
[junit4] 2> 2588293 INFO (coreLoadExecutor-2778-thread-1-processing-n:127.0.0.1:45781_igmp%2Fa) [n:127.0.0.1:45781_igmp%2Fa c:control_collection x:collection1] o.a.s.s.OpenExchangeRatesOrgProvider Initialized with rates=open-exchange-rates.json, refreshInterval=1440.
[junit4] 2> 2588302 INFO (coreLoadExecutor-2778-thread-1-processing-n:127.0.0.1:45781_igmp%2Fa) [n:127.0.0.1:45781_igmp%2Fa c:control_collection x:collection1] o.a.s.s.IndexSchema default search field in schema is text
[junit4] 2> 2588304 INFO (coreLoadExecutor-2778-thread-1-processing-n:127.0.0.1:45781_igmp%2Fa) [n:127.0.0.1:45781_igmp%2Fa c:control_collection x:collection1] o.a.s.s.IndexSchema unique key field: id
[junit4] 2> 2588313 INFO (coreLoadExecutor-2778-thread-1-processing-n:127.0.0.1:45781_igmp%2Fa) [n:127.0.0.1:45781_igmp%2Fa c:control_collection x:collection1] o.a.s.s.FileExchangeRateProvider Reloading exchange rates from file currency.xml
[junit4] 2> 2588317 INFO (coreLoadExecutor-2778-thread-1-processing-n:127.0.0.1:45781_igmp%2Fa) [n:127.0.0.1:45781_igmp%2Fa c:control_collection x:collection1] o.a.s.s.FileExchangeRateProvider Reloading exchange rates from file currency.xml
[junit4] 2> 2588320 INFO (coreLoadExecutor-2778-thread-1-processing-n:127.0.0.1:45781_igmp%2Fa) [n:127.0.0.1:45781_igmp%2Fa c:control_collection x:collection1] o.a.s.s.OpenExchangeRatesOrgProvider Reloading exchange rates from open-exchange-rates.json
[junit4] 2> 2588320 INFO (coreLoadExecutor-2778-thread-1-processing-n:127.0.0.1:45781_igmp%2Fa) [n:127.0.0.1:45781_igmp%2Fa c:control_collection x:collection1] o.a.s.s.OpenExchangeRatesOrgProvider Reloading exchange rates from open-exchange-rates.json
[junit4] 2> 2588322 INFO (coreLoadExecutor-2778-thread-1-processing-n:127.0.0.1:45781_igmp%2Fa) [n:127.0.0.1:45781_igmp%2Fa c:control_collection x:collection1] o.a.s.c.ConfigSetProperties Did not find ConfigSet properties, assuming default properties: Can't find resource 'configsetprops.json' in classpath or '/configs/conf1', cwd=/x1/jenkins/jenkins-slave/workspace/Lucene-Solr-NightlyTests-5.x/solr/build/solr-core/test/J1
[junit4] 2> 2588322 INFO (coreLoadExecutor-2778-thread-1-processing-n:127.0.0.1:45781_igmp%2Fa) [n:127.0.0.1:45781_igmp%2Fa c:control_collection x:collection1] o.a.s.c.CoreContainer Creating SolrCore 'collection1' using configuration from collection control_collection
[junit4] 2> 2588322 INFO (coreLoadExecutor-2778-thread-1-processing-n:127.0.0.1:45781_igmp%2Fa) [n:127.0.0.1:45781_igmp%2Fa c:control_collection s:shard1 r:core_node1 x:collection1] o.a.s.c.SolrCore org.apache.solr.core.MockDirectoryFactory
[junit4] 2> 2588323 INFO (coreLoadExecutor-2778-thread-1-processing-n:127.0.0.1:45781_igmp%2Fa) [n:127.0.0.1:45781_igmp%2Fa c:control_collection s:shard1 r:core_node1 x:collection1] o.a.s.c.SolrCore [[collection1] ] Opening new SolrCore at [/x1/jenkins/jenkins-slave/workspace/Lucene-Solr-NightlyTests-5.x/solr/build/solr-core/test/J1/temp/solr.handler.TestSolrConfigHandlerCloud_6046A6E442C2D55F-001/control-001/cores/collection1], dataDir=[/x1/jenkins/jenkins-slave/workspace/Lucene-Solr-NightlyTests-5.x/solr/build/solr-core/test/J1/../../../../../../../../../../x1/jenkins/jenkins-slave/workspace/Lucene-Solr-NightlyTests-5.x/solr/build/solr-core/test/J1/temp/solr.handler.TestSolrConfigHandlerCloud_6046A6E442C2D55F-001/control-001/cores/collection1/data/]
[junit4] 2> 2588323 INFO (coreLoadExecutor-2778-thread-1-processing-n:127.0.0.1:45781_igmp%2Fa) [n:127.0.0.1:45781_igmp%2Fa c:control_collection s:shard1 r:core_node1 x:collection1] o.a.s.c.JmxMonitoredMap JMX monitoring is enabled. Adding Solr mbeans to JMX Server: com.sun.jmx.mbeanserver.JmxMBeanServer@516bedc1
[junit4] 2> 2588323 INFO (coreLoadExecutor-2778-thread-1-processing-n:127.0.0.1:45781_igmp%2Fa) [n:127.0.0.1:45781_igmp%2Fa c:control_collection s:shard1 r:core_node1 x:collection1] o.a.s.c.CachingDirectoryFactory return new directory for /x1/jenkins/jenkins-slave/workspace/Lucene-Solr-NightlyTests-5.x/solr/build/solr-core/test/J1/../../../../../../../../../../x1/jenkins/jenkins-slave/workspace/Lucene-Solr-NightlyTests-5.x/solr/build/solr-core/test/J1/temp/solr.handler.TestSolrConfigHandlerCloud_6046A6E442C2D55F-001/control-001/cores/collection1/data
[junit4] 2> 2588323 INFO (coreLoadExecutor-2778-thread-1-processing-n:127.0.0.1:45781_igmp%2Fa) [n:127.0.0.1:45781_igmp%2Fa c:control_collection s:shard1 r:core_node1 x:collection1] o.a.s.c.SolrCore New index directory detected: old=null new=/x1/jenkins/jenkins-slave/workspace/Lucene-Solr-NightlyTests-5.x/solr/build/solr-core/test/J1/../../../../../../../../../../x1/jenkins/jenkins-slave/workspace/Lucene-Solr-NightlyTests-5.x/solr/build/solr-core/test/J1/temp/solr.handler.TestSolrConfigHandlerCloud_6046A6E442C2D55F-001/control-001/cores/collection1/data/index/
[junit4] 2> 2588324 WARN (coreLoadExecutor-2778-thread-1-processing-n:127.0.0.1:45781_igmp%2Fa) [n:127.0.0.1:45781_igmp%2Fa c:control_collection s:shard1 r:core_node1 x:collection1] o.a.s.c.SolrCore [collection1] Solr index directory '/x1/jenkins/jenkins-slave/workspace/Lucene-Solr-NightlyTests-5.x/solr/build/solr-core/test/J1/../../../../../../../../../../x1/jenkins/jenkins-slave/workspace/Lucene-Solr-NightlyTests-5.x/solr/build/solr-core/test/J1/temp/solr.handler.TestSolrConfigHandlerCloud_6046A6E442C2D55F-001/control-001/cores/collection1/data/index' doesn't exist. Creating new index...
[junit4] 2> 2588324 INFO (coreLoadExecutor-2778-thread-1-processing-n:127.0.0.1:45781_igmp%2Fa) [n:127.0.0.1:45781_igmp%2Fa c:control_collection s:shard1 r:core_node1 x:collection1] o.a.s.c.CachingDirectoryFactory return new directory for /x1/jenkins/jenkins-slave/workspace/Lucene-Solr-NightlyTests-5.x/solr/build/solr-core/test/J1/../../../../../../../../../../x1/jenkins/jenkins-slave/workspace/Lucene-Solr-NightlyTests-5.x/solr/build/solr-core/test/J1/temp/solr.handler.TestSolrConfigHandlerCloud_6046A6E442C2D55F-001/control-001/cores/collection1/data/index
[junit4] 2> 2588324 INFO (coreLoadExecutor-2778-thread-1-processing-n:127.0.0.1:45781_igmp%2Fa) [n:127.0.0.1:45781_igmp%2Fa c:control_collection s:shard1 r:core_node1 x:collection1] o.a.s.u.RandomMergePolicy RandomMergePolicy wrapping class org.apache.lucene.index.LogByteSizeMergePolicy: [LogByteSizeMergePolicy: minMergeSize=1677721, mergeFactor=20, maxMergeSize=2147483648, maxMergeSizeForForcedMerge=9223372036854775807, calibrateSizeByDeletes=false, maxMergeDocs=2147483647, maxCFSSegmentSizeMB=8.796093022207999E12, noCFSRatio=0.8496589261226591]
[junit4] 2> 2588325 INFO (coreLoadExecutor-2778-thread-1-processing-n:127.0.0.1:45781_igmp%2Fa) [n:127.0.0.1:45781_igmp%2Fa c:control_collection s:shard1 r:core_node1 x:collection1] o.a.s.c.SolrDeletionPolicy SolrDeletionPolicy.onCommit: commits: num=1
[junit4] 2> commit{dir=RawDirectoryWrapper(RAMDirectory@4fd9038c lockFactory=org.apache.lucene.store.SingleInstanceLockFactory@30780548),segFN=segments_1,generation=1}
[junit4] 2> 2588325 INFO (coreLoadExecutor-2778-thread-1-processing-n:127.0.0.1:45781_igmp%2Fa) [n:127.0.0.1:45781_igmp%2Fa c:control_collection s:shard1 r:core_node1 x:collection1] o.a.s.c.SolrDeletionPolicy newest commit generation = 1
[junit4] 2> 2588325 INFO (OldIndexDirectoryCleanupThreadForCore-collection1) [n:127.0.0.1:45781_igmp%2Fa c:control_collection s:shard1 r:core_node1 x:collection1] o.a.s.c.SolrCore Looking for old index directories to cleanup for core collection1 in /x1/jenkins/jenkins-slave/workspace/Lucene-Solr-NightlyTests-5.x/solr/build/solr-core/test/J1/../../../../../../../../../../x1/jenkins/jenkins-slave/workspace/Lucene-Solr-NightlyTests-5.x/solr/build/solr-core/test/J1/temp/solr.handler.TestSolrConfigHandlerCloud_6046A6E442C2D55F-001/control-001/cores/collection1/data/
[junit4] 2> 2588325 WARN (OldIndexDirectoryCleanupThreadForCore-collection1) [n:127.0.0.1:45781_igmp%2Fa c:control_collection s:shard1 r:core_node1 x:collection1] o.a.s.c.DirectoryFactory /x1/jenkins/jenkins-slave/workspace/Lucene-Solr-NightlyTests-5.x/solr/build/solr-core/test/J1/../../../../../../../../../../x1/jenkins/jenkins-slave/workspace/Lucene-Solr-NightlyTests-5.x/solr/build/solr-core/test/J1/temp/solr.handler.TestSolrConfigHandlerCloud_6046A6E442C2D55F-001/control-001/cores/collection1/data/ does not point to a valid data directory; skipping clean-up of old index directories.
[junit4] 2> 2588329 INFO (coreLoadExecutor-2778-thread-1-processing-n:127.0.0.1:45781_igmp%2Fa) [n:127.0.0.1:45781_igmp%2Fa c:control_collection s:shard1 r:core_node1 x:collection1] o.a.s.u.p.UpdateRequestProcessorChain creating updateRequestProcessorChain "nodistrib"
[junit4] 2> 2588329 INFO (coreLoadExecutor-2778-thread-1-processing-n:127.0.0.1:45781_igmp%2Fa) [n:127.0.0.1:45781_igmp%2Fa c:control_collection s:shard1 r:core_node1 x:collection1] o.a.s.u.p.UpdateRequestProcessorChain creating updateRequestProcessorChain "dedupe"
[junit4] 2> 2588330 INFO (coreLoadExecutor-2778-thread-1-processing-n:127.0.0.1:45781_igmp%2Fa) [n:127.0.0.1:45781_igmp%2Fa c:control_collection s:shard1 r:core_node1 x:collection1] o.a.s.u.p.UpdateRequestProcessorChain inserting DistributedUpdateProcessorFactory into updateRequestProcessorChain "dedupe"
[junit4] 2> 2588330 INFO (coreLoadExecutor-2778-thread-1-processing-n:127.0.0.1:45781_igmp%2Fa) [n:127.0.0.1:45781_igmp%2Fa c:control_collection s:shard1 r:core_node1 x:collection1] o.a.s.u.p.UpdateRequestProcessorChain creating updateRequestProcessorChain "stored_sig"
[junit4] 2> 2588330 INFO (coreLoadExecutor-2778-thread-1-processing-n:127.0.0.1:45781_igmp%2Fa) [n:127.0.0.1:45781_igmp%2Fa c:control_collection s:shard1 r:core_node1 x:collection1] o.a.s.u.p.UpdateRequestProcessorChain inserting DistributedUpdateProcessorFactory into updateRequestProcessorChain "stored_sig"
[junit4] 2> 2588330 INFO (coreLoadExecutor-2778-thread-1-processing-n:127.0.0.1:45781_igmp%2Fa) [n:127.0.0.1:45781_igmp%2Fa c:control_collection s:shard1 r:core_node1 x:collection1] o.a.s.u.p.UpdateRequestProcessorChain creating updateRequestProcessorChain "distrib-dup-test-chain-explicit"
[junit4] 2> 2588330 INFO (coreLoadExecutor-2778-thread-1-processing-n:127.0.0.1:45781_igmp%2Fa) [n:127.0.0.1:45781_igmp%2Fa c:control_collection s:shard1 r:core_node1 x:collection1] o.a.s.u.p.UpdateRequestProcessorChain creating updateRequestProcessorChain "distrib-dup-test-chain-implicit"
[junit4] 2> 2588330 INFO (coreLoadExecutor-2778-thread-1-processing-n:127.0.0.1:45781_igmp%2Fa) [n:127.0.0.1:45781_igmp%2Fa c:control_collection s:shard1 r:core_node1 x:collection1] o.a.s.u.p.UpdateRequestProcessorChain inserting DistributedUpdateProcessorFactory into updateRequestProcessorChain "distrib-dup-test-chain-implicit"
[junit4] 2> 2588330 INFO (coreLoadExecutor-2778-thread-1-processing-n:127.0.0.1:45781_igmp%2Fa) [n:127.0.0.1:45781_igmp%2Fa c:control_collection s:shard1 r:core_node1 x:collection1] o.a.s.c.SolrCore no updateRequestProcessorChain defined as default, creating implicit default
[junit4] 2> 2588330 WARN (coreLoadExecutor-2778-thread-1-processing-n:127.0.0.1:45781_igmp%2Fa) [n:127.0.0.1:45781_igmp%2Fa c:control_collection s:shard1 r:core_node1 x:collection1] o.a.s.c.RequestHandlers INVALID paramSet a in requestHandler {type = requestHandler,name = /dump,class = DumpRequestHandler,args = {defaults={a=A,b=B}}}
[junit4] 2> 2588334 INFO (coreLoadExecutor-2778-thread-1-processing-n:127.0.0.1:45781_igmp%2Fa) [n:127.0.0.1:45781_igmp%2Fa c:control_collection s:shard1 r:core_node1 x:collection1] o.a.s.h.l.XMLLoader xsltCacheLifetimeSeconds=60
[junit4] 2> 2588335 INFO (coreLoadExecutor-2778-thread-1-processing-n:127.0.0.1:45781_igmp%2Fa) [n:127.0.0.1:45781_igmp%2Fa c:control_collection s:shard1 r:core_node1 x:collection1] o.a.s.h.l.XMLLoader xsltCacheLifetimeSeconds=60
[junit4] 2> 2588336 INFO (coreLoadExecutor-2778-thread-1-processing-n:127.0.0.1:45781_igmp%2Fa) [n:127.0.0.1:45781_igmp%2Fa c:control_collection s:shard1 r:core_node1 x:collection1] o.a.s.h.l.XMLLoader xsltCacheLifetimeSeconds=60
[junit4] 2> 2588338 INFO (coreLoadExecutor-2778-thread-1-processing-n:127.0.0.1:45781_igmp%2Fa) [n:127.0.0.1:45781_igmp%2Fa c:control_collection s:shard1 r:core_node1 x:collection1] o.a.s.h.l.XMLLoader xsltCacheLifetimeSeconds=60
[junit4] 2> 2588342 INFO (coreLoadExecutor-2778-thread-1-processing-n:127.0.0.1:45781_igmp%2Fa) [n:127.0.0.1:45781_igmp%2Fa c:control_collection s:shard1 r:core_node1 x:collection1] o.a.s.c.RequestHandlers Registered paths: /admin/properties,/admin/file,/admin/logging,/admin/segments,/update,/config,/admin/threads,/schema,/admin/mbeans,/admin/ping,/admin/luke,/dump,/admin/plugins,standard,/admin/system,/replication,/update/json,/update/json/docs,/get,/update/csv
[junit4] 2> 2588343 INFO (coreLoadExecutor-2778-thread-1-processing-n:127.0.0.1:45781_igmp%2Fa) [n:127.0.0.1:45781_igmp%2Fa c:control_collection s:shard1 r:core_node1 x:collection1] o.a.s.c.SolrCore Using default statsCache cache: org.apache.solr.search.stats.LocalStatsCache
[junit4] 2> 2588343 INFO (coreLoadExecutor-2778-thread-1-processing-n:127.0.0.1:45781_igmp%2Fa) [n:127.0.0.1:45781_igmp%2Fa c:control_collection s:shard1 r:core_node1 x:collection1] o.a.s.u.UpdateHandler Using UpdateLog implementation: org.apache.solr.update.UpdateLog
[junit4] 2> 2588344 INFO (coreLoadExecutor-2778-thread-1-processing-n:127.0.0.1:45781_igmp%2Fa) [n:127.0.0.1:45781_igmp%2Fa c:control_collection s:shard1 r:core_node1 x:collection1] o.a.s.u.UpdateLog Initializing UpdateLog: dataDir= defaultSyncLevel=FLUSH numRecordsToKeep=100 maxNumLogsToKeep=10 numVersionBuckets=65536
[junit4] 2> 2588344 INFO (coreLoadExecutor-2778-thread-1-processing-n:127.0.0.1:45781_igmp%2Fa) [n:127.0.0.1:45781_igmp%2Fa c:control_collection s:shard1 r:core_node1 x:collection1] o.a.s.u.CommitTracker Hard AutoCommit: disabled
[junit4] 2> 2588345 INFO (coreLoadExecutor-2778-thread-1-processing-n:127.0.0.1:45781_igmp%2Fa) [n:127.0.0.1:45781_igmp%2Fa c:control_collection s:shard1 r:core_node1 x:collection1] o.a.s.u.CommitTracker Soft AutoCommit: disabled
[junit4] 2> 2588345 INFO (coreLoadExecutor-2778-thread-1-processing-n:127.0.0.1:45781_igmp%2Fa) [n:127.0.0.1:45781_igmp%2Fa c:control_collection s:shard1 r:core_node1 x:collection1] o.a.s.u.RandomMergePolicy RandomMergePolicy wrapping class org.apache.lucene.index.LogDocMergePolicy: [LogDocMergePolicy: minMergeSize=1000, mergeFactor=17, maxMergeSize=9223372036854775807, maxMergeSizeForForcedMerge=9223372036854775807, calibrateSizeByDeletes=true, maxMergeDocs=2147483647, maxCFSSegmentSizeMB=1.7119140625, noCFSRatio=0.66934704823659]
[junit4] 2> 2588345 INFO (coreLoadExecutor-2778-thread-1-processing-n:127.0.0.1:45781_igmp%2Fa) [n:127.0.0.1:45781_igmp%2Fa c:control_collection s:shard1 r:core_node1 x:collection1] o.a.s.c.SolrDeletionPolicy SolrDeletionPolicy.onInit: commits: num=1
[junit4] 2> commit{dir=RawDirectoryWrapper(RAMDirectory@4fd9038c lockFactory=org.apache.lucene.store.SingleInstanceLockFactory@30780548),segFN=segments_1,generation=1}
[junit4] 2> 2588345 INFO (coreLoadExecutor-2778-thread-1-processing-n:127.0.0.1:45781_igmp%2Fa) [n:127.0.0.1:45781_igmp%2Fa c:control_collection s:shard1 r:core_node1 x:collection1] o.a.s.c.SolrDeletionPolicy newest commit generation = 1
[junit4] 2> 2588345 INFO (coreLoadExecutor-2778-thread-1-processing-n:127.0.0.1:45781_igmp%2Fa) [n:127.0.0.1:45781_igmp%2Fa c:control_collection s:shard1 r:core_node1 x:collection1] o.a.s.s.SolrIndexSearcher Opening Searcher@648f26b5[collection1] main
[junit4] 2> 2588346 INFO (coreLoadExecutor-2778-thread-1-processing-n:127.0.0.1:45781_igmp%2Fa) [n:127.0.0.1:45781_igmp%2Fa c:control_collection s:shard1 r:core_node1 x:collection1] o.a.s.c.c.ZkStateReader Load collection config from: [/collections/control_collection]
[junit4] 2> 2588346 INFO (coreLoadExecutor-2778-thread-1-processing-n:127.0.0.1:45781_igmp%2Fa) [n:127.0.0.1:45781_igmp%2Fa c:control_collection s:shard1 r:core_node1 x:collection1] o.a.s.c.c.ZkStateReader path=[/collections/control_collection] [configName]=[conf1] specified config exists in ZooKeeper
[junit4] 2> 2588346 INFO (coreLoadExecutor-2778-thread-1-processing-n:127.0.0.1:45781_igmp%2Fa) [n:127.0.0.1:45781_igmp%2Fa c:control_collection s:shard1 r:core_node1 x:collection1] o.a.s.r.ManagedResourceStorage Setting up ZooKeeper-based storage for the RestManager with znodeBase: /configs/conf1
[junit4] 2> 2588347 INFO (coreLoadExecutor-2778-thread-1-processing-n:127.0.0.1:45781_igmp%2Fa) [n:127.0.0.1:45781_igmp%2Fa c:control_collection s:shard1 r:core_node1 x:collection1] o.a.s.r.ManagedResourceStorage Configured ZooKeeperStorageIO with znodeBase: /configs/conf1
[junit4] 2> 2588347 INFO (coreLoadExecutor-2778-thread-1-processing-n:127.0.0.1:45781_igmp%2Fa) [n:127.0.0.1:45781_igmp%2Fa c:control_collection s:shard1 r:core_node1 x:collection1] o.a.s.r.RestManager Initializing RestManager with initArgs: {}
[junit4] 2> 2588347 INFO (coreLoadExecutor-2778-thread-1-processing-n:127.0.0.1:45781_igmp%2Fa) [n:127.0.0.1:45781_igmp%2Fa c:control_collection s:shard1 r:core_node1 x:collection1] o.a.s.r.ManagedResourceStorage Reading _rest_managed.json using ZooKeeperStorageIO:path=/configs/conf1
[junit4] 2> 2588347 INFO (coreLoadExecutor-2778-thread-1-processing-n:127.0.0.1:45781_igmp%2Fa) [n:127.0.0.1:45781_igmp%2Fa c:control_collection s:shard1 r:core_node1 x:collection1] o.a.s.r.ManagedResourceStorage No data found for znode /configs/conf1/_rest_managed.json
[junit4] 2> 2588347 INFO (coreLoadExecutor-2778-thread-1-processing-n:127.0.0.1:45781_igmp%2Fa) [n:127.0.0.1:45781_igmp%2Fa c:control_collection s:shard1 r:core_node1 x:collection1] o.a.s.r.ManagedResourceStorage Loaded null at path _rest_managed.json using ZooKeeperStorageIO:path=/configs/conf1
[junit4] 2> 2588348 INFO (coreLoadExecutor-2778-thread-1-processing-n:127.0.0.1:45781_igmp%2Fa) [n:127.0.0.1:45781_igmp%2Fa c:control_collection s:shard1 r:core_node1 x:collection1] o.a.s.r.RestManager Initializing 0 registered ManagedResources
[junit4] 2> 2588348 INFO (coreLoadExecutor-2778-thread-1-processing-n:127.0.0.1:45781_igmp%2Fa) [n:127.0.0.1:45781_igmp%2Fa c:control_collection s:shard1 r:core_node1 x:collection1] o.a.s.h.ReplicationHandler Commits will be reserved for 10000
[junit4] 2> 2588349 INFO (searcherExecutor-2779-thread-1-processing-s:shard1 r:core_node1 x:collection1 n:127.0.0.1:45781_igmp%2Fa c:control_collection) [n:127.0.0.1:45781_igmp%2Fa c:control_collection s:shard1 r:core_node1 x:collection1] o.a.s.c.SolrCore [collection1] Registered new searcher Searcher@648f26b5[collection1] main{ExitableDirectoryReader(UninvertingDirectoryReader())}
[junit4] 2> 2588349 INFO (coreLoadExecutor-2778-thread-1-processing-n:127.0.0.1:45781_igmp%2Fa) [n:127.0.0.1:45781_igmp%2Fa c:control_collection s:shard1 r:core_node1 x:collection1] o.a.s.u.UpdateLog Looking up max value of version field to seed version buckets
[junit4] 2> 2588349 INFO (coreLoadExecutor-2778-thread-1-processing-n:127.0.0.1:45781_igmp%2Fa) [n:127.0.0.1:45781_igmp%2Fa c:control_collection s:shard1 r:core_node1 x:collection1] o.a.s.u.VersionInfo Refreshing highest value of _version_ for 65536 version buckets from index
[junit4] 2> 2588349 INFO (coreLoadExecutor-2778-thread-1-processing-n:127.0.0.1:45781_igmp%2Fa) [n:127.0.0.1:45781_igmp%2Fa c:control_collection s:shard1 r:core_node1 x:collection1] o.a.s.u.VersionInfo No terms found for _version_, cannot seed version bucket highest value from index
[junit4] 2> 2588349 INFO (coreLoadExecutor-2778-thread-1-processing-n:127.0.0.1:45781_igmp%2Fa) [n:127.0.0.1:45781_igmp%2Fa c:control_collection s:shard1 r:core_node1 x:collection1] o.a.s.u.UpdateLog Could not find max version in index or recent updates, using new clock 1524480820036763648
[junit4] 2> 2588351 INFO (coreLoadExecutor-2778-thread-1-processing-n:127.0.0.1:45781_igmp%2Fa) [n:127.0.0.1:45781_igmp%2Fa c:control_collection s:shard1 r:core_node1 x:collection1] o.a.s.u.UpdateLog Took 2.0ms to seed version buckets with highest version 1524480820036763648
[junit4] 2> 2588351 INFO (coreLoadExecutor-2778-thread-1-processing-n:127.0.0.1:45781_igmp%2Fa) [n:127.0.0.1:45781_igmp%2Fa c:control_collection s:shard1 r:core_node1 x:collection1] o.a.s.c.ZkController watch zkdir /configs/conf1
[junit4] 2> 2588352 INFO (coreLoadExecutor-2778-thread-1-processing-n:127.0.0.1:45781_igmp%2Fa) [n:127.0.0.1:45781_igmp%2Fa c:control_collection s:shard1 r:core_node1 x:collection1] o.a.s.c.CoreContainer registering core: collection1
[junit4] 2> 2588352 INFO (coreZkRegister-2772-thread-1-processing-s:shard1 r:core_node1 x:collection1 n:127.0.0.1:45781_igmp%2Fa c:control_collection) [n:127.0.0.1:45781_igmp%2Fa c:control_collection s:shard1 r:core_node1 x:collection1] o.a.s.c.ZkController Register replica - core:collection1 address:http://127.0.0.1:45781/igmp/a collection:control_collection shard:shard1
[junit4] 2> 2588353 INFO (coreZkRegister-2772-thread-1-processing-s:shard1 r:core_node1 x:collection1 n:127.0.0.1:45781_igmp%2Fa c:control_collection) [n:127.0.0.1:45781_igmp%2Fa c:control_collection s:shard1 r:core_node1 x:collection1] o.a.s.c.c.SolrZkClient makePath: /collections/control_collection/leader_elect/shard1/election
[junit4] 2> 2588357 INFO (coreZkRegister-2772-thread-1-processing-s:shard1 r:core_node1 x:collection1 n:127.0.0.1:45781_igmp%2Fa c:control_collection) [n:127.0.0.1:45781_igmp%2Fa c:control_collection s:shard1 r:core_node1 x:collection1] o.a.s.c.LeaderElector Joined leadership election with path: /collections/control_collection/leader_elect/shard1/election/95280051139575812-core_node1-n_0000000000
[junit4] 2> 2588357 INFO (coreZkRegister-2772-thread-1-processing-s:shard1 r:core_node1 x:collection1 n:127.0.0.1:45781_igmp%2Fa c:control_collection) [n:127.0.0.1:45781_igmp%2Fa c:control_collection s:shard1 r:core_node1 x:collection1] o.a.s.c.ShardLeaderElectionContext Running the leader process for shard=shard1 and weAreReplacement=false and leaderVoteWait=10000
[junit4] 2> 2588359 INFO (coreZkRegister-2772-thread-1-processing-s:shard1 r:core_node1 x:collection1 n:127.0.0.1:45781_igmp%2Fa c:control_collection) [n:127.0.0.1:45781_igmp%2Fa c:control_collection s:shard1 r:core_node1 x:collection1] o.a.s.c.ShardLeaderElectionContext Enough replicas found to continue.
[junit4] 2> 2588359 INFO (coreZkRegister-2772-thread-1-processing-s:shard1 r:core_node1 x:collection1 n:127.0.0.1:45781_igmp%2Fa c:control_collection) [n:127.0.0.1:45781_igmp%2Fa c:control_collection s:shard1 r:core_node1 x:collection1] o.a.s.c.ShardLeaderElectionContext I may be the new leader - try and sync
[junit4] 2> 2588359 INFO (coreZkRegister-2772-thread-1-processing-s:shard1 r:core_node1 x:collection1 n:127.0.0.1:45781_igmp%2Fa c:control_collection) [n:127.0.0.1:45781_igmp%2Fa c:control_collection s:shard1 r:core_node1 x:collection1] o.a.s.c.SyncStrategy Sync replicas to http://127.0.0.1:45781/igmp/a/collection1/
[junit4] 2> 2588359 INFO (coreZkRegister-2772-thread-1-processing-s:shard1 r:core_node1 x:collection1 n:127.0.0.1:45781_igmp%2Fa c:control_collection) [n:127.0.0.1:45781_igmp%2Fa c:control_collection s:shard1 r:core_node1 x:collection1] o.a.s.c.SyncStrategy Sync Success - now sync replicas to me
[junit4] 2> 2588359 INFO (coreZkRegister-2772-thread-1-processing-s:shard1 r:core_node1 x:collection1 n:127.0.0.1:45781_igmp%2Fa c:control_collection) [n:127.0.0.1:45781_igmp%2Fa c:control_collection s:shard1 r:core_node1 x:collection1] o.a.s.c.SyncStrategy http://127.0.0.1:45781/igmp/a/collection1/ has no replicas
[junit4] 2> 2588359 INFO (OverseerStateUpdate-95280051139575812-127.0.0.1:45781_igmp%2Fa-n_0000000000) [n:127.0.0.1:45781_igmp%2Fa ] o.a.s.c.Overseer processMessage: queueSize: 1, message = {
[junit4] 2> "operation":"leader",
[junit4] 2> "shard":"shard1",
[junit4] 2> "collection":"control_collection"} current state version: 1
[junit4] 2> 2588360 INFO (coreZkRegister-2772-thread-1-processing-s:shard1 r:core_node1 x:collection1 n:127.0.0.1:45781_igmp%2Fa c:control_collection) [n:127.0.0.1:45781_igmp%2Fa c:control_collection s:shard1 r:core_node1 x:collection1] o.a.s.c.c.SolrZkClient makePath: /collections/control_collection/leaders/shard1
[junit4] 2> 2588362 INFO (coreZkRegister-2772-thread-1-processing-s:shard1 r:core_node1 x:collection1 n:127.0.0.1:45781_igmp%2Fa c:control_collection) [n:127.0.0.1:45781_igmp%2Fa c:control_collection s:shard1 r:core_node1 x:collection1] o.a.s.c.ShardLeaderElectionContextBase Creating leader registration node
[junit4] 2> 2588364 INFO (coreZkRegister-2772-thread-1-processing-s:shard1 r:core_node1 x:collection1 n:127.0.0.1:45781_igmp%2Fa c:control_collection) [n:127.0.0.1:45781_igmp%2Fa c:control_collection s:shard1 r:core_node1 x:collection1] o.a.s.c.ShardLeaderElectionContext I am the new leader: http://127.0.0.1:45781/igmp/a/collection1/ shard1
[junit4] 2> 2588366 INFO (OverseerStateUpdate-95280051139575812-127.0.0.1:45781_igmp%2Fa-n_0000000000) [n:127.0.0.1:45781_igmp%2Fa ] o.a.s.c.Overseer processMessage: queueSize: 1, message = {
[junit4] 2> "operation":"leader",
[junit4] 2> "shard":"shard1",
[junit4] 2> "collection":"control_collection",
[junit4] 2> "base_url":"http://127.0.0.1:45781/igmp/a",
[junit4] 2> "core":"collection1",
[junit4] 2> "state":"active"} current state version: 1
[junit4] 2> 2588461 INFO (TEST-TestSolrConfigHandlerCloud.test-seed#[6046A6E442C2D55F]) [ ] o.a.s.c.c.SolrZkClient Using default ZkCredentialsProvider
[junit4] 2> 2588461 INFO (TEST-TestSolrConfigHandlerCloud.test-seed#[6046A6E442C2D55F]) [ ] o.a.s.c.c.ConnectionManager Waiting for client to connect to ZooKeeper
[junit4] 2> 2588462 INFO (zkCallback-952-thread-1) [ ] o.a.s.c.c.ConnectionManager Watcher org.apache.solr.common.cloud.ConnectionManager@29b6a8c8 name:ZooKeeperConnection Watcher:127.0.0.1:50958/solr got event WatchedEvent state:SyncConnected type:None path:null path:null type:None
[junit4] 2> 2588463 INFO (TEST-TestSolrConfigHandlerCloud.test-seed#[6046A6E442C2D55F]) [ ] o.a.s.c.c.ConnectionManager Client is connected to ZooKeeper
[junit4] 2> 2588463 INFO (TEST-TestSolrConfigHandlerCloud.test-seed#[6046A6E442C2D55F]) [ ] o.a.s.c.c.SolrZkClient Using default ZkACLProvider
[junit4] 2> 2588463 INFO (TEST-TestSolrConfigHandlerCloud.test-seed#[6046A6E442C2D55F]) [ ] o.a.s.c.c.ZkStateReader Updating cluster state from ZooKeeper...
[junit4] 2> 2588465 INFO (TEST-TestSolrConfigHandlerCloud.test-seed#[6046A6E442C2D55F]) [ ] o.a.s.c.ChaosMonkey monkey: init - expire sessions:false cause connection loss:false
[junit4] 2> 2588465 INFO (TEST-TestSolrConfigHandlerCloud.test-seed#[6046A6E442C2D55F]) [ ] o.a.s.c.AbstractFullDistribZkTestBase Creating collection1 with stateFormat=2
[junit4] 2> 2588465 INFO (TEST-TestSolrConfigHandlerCloud.test-seed#[6046A6E442C2D55F]) [ ] o.a.s.c.c.SolrZkClient Using default ZkCredentialsProvider
[junit4] 2> 2588465 INFO (TEST-TestSolrConfigHandlerCloud.test-seed#[6046A6E442C2D55F]) [ ] o.a.s.c.c.ConnectionManager Waiting for client to connect to ZooKeeper
[junit4] 2> 2588466 INFO (zkCallback-953-thread-1) [ ] o.a.s.c.c.ConnectionManager Watcher org.apache.solr.common.cloud.ConnectionManager@643cabb9 name:ZooKeeperConnection Watcher:127.0.0.1:50958/solr got event WatchedEvent state:SyncConnected type:None path:null path:null type:None
[junit4] 2> 2588466 INFO (TEST-TestSolrConfigHandlerCloud.test-seed#[6046A6E442C2D55F]) [ ] o.a.s.c.c.ConnectionManager Client is connected to ZooKeeper
[junit4] 2> 2588467 INFO (TEST-TestSolrConfigHandlerCloud.test-seed#[6046A6E442C2D55F]) [ ] o.a.s.c.c.SolrZkClient Using default ZkACLProvider
[junit4] 2> 2588469 INFO (OverseerStateUpdate-95280051139575812-127.0.0.1:45781_igmp%2Fa-n_0000000000) [n:127.0.0.1:45781_igmp%2Fa ] o.a.s.c.Overseer processMessage: queueSize: 1, message = {
[junit4] 2> "operation":"create",
[junit4] 2> "name":"collection1",
[junit4] 2> "numShards":"2",
[junit4] 2> "stateFormat":"2"} current state version: 1
[junit4] 2> 2588469 INFO (OverseerStateUpdate-95280051139575812-127.0.0.1:45781_igmp%2Fa-n_0000000000) [n:127.0.0.1:45781_igmp%2Fa ] o.a.s.c.o.ClusterStateMutator building a new cName: collection1
[junit4] 2> 2588470 INFO (zkCallback-952-thread-1) [ ] o.a.s.c.c.ZkStateReader A cluster state change: [WatchedEvent state:SyncConnected type:NodeDataChanged path:/clusterstate.json], has occurred - updating... (live nodes size: [1])
[junit4] 2> 2588470 INFO (zkCallback-950-thread-2-processing-n:127.0.0.1:45781_igmp%2Fa) [n:127.0.0.1:45781_igmp%2Fa ] o.a.s.c.c.ZkStateReader A cluster state change: [WatchedEvent state:SyncConnected type:NodeDataChanged path:/clusterstate.json], has occurred - updating... (live nodes size: [1])
[junit4] 2> 2588470 INFO (zkCallback-950-thread-1-processing-n:127.0.0.1:45781_igmp%2Fa) [n:127.0.0.1:45781_igmp%2Fa ] o.a.s.c.c.ZkStateReader A cluster state change: [WatchedEvent state:SyncConnected type:NodeDataChanged path:/clusterstate.json], has occurred - updating... (live nodes size: [1])
[junit4] 2> 2588518 INFO (coreZkRegister-2772-thread-1-processing-s:shard1 r:core_node1 x:collection1 n:127.0.0.1:45781_igmp%2Fa c:control_collection) [n:127.0.0.1:45781_igmp%2Fa c:control_collection s:shard1 r:core_node1 x:collection1] o.a.s.c.ZkController We are http://127.0.0.1:45781/igmp/a/collection1/ and leader is http://127.0.0.1:45781/igmp/a/collection1/
[junit4] 2> 2588518 INFO (coreZkRegister-2772-thread-1-processing-s:shard1 r:core_node1 x:collection1 n:127.0.0.1:45781_igmp%2Fa c:control_collection) [n:127.0.0.1:45781_igmp%2Fa c:control_collection s:shard1 r:core_node1 x:collection1] o.a.s.c.ZkController No LogReplay needed for core=collection1 baseURL=http://127.0.0.1:45781/igmp/a
[junit4] 2> 2588518 INFO (coreZkRegister-2772-thread-1-processing-s:shard1 r:core_node1 x:collection1 n:127.0.0.1:45781_igmp%2Fa c:control_collection) [n:127.0.0.1:45781_igmp%2Fa c:control_collection s:shard1 r:core_node1 x:collection1] o.a.s.c.ZkController I am the leader, no recovery necessary
[junit4] 2> 2588518 INFO (coreZkRegister-2772-thread-1-processing-s:shard1 r:core_node1 x:collection1 n:127.0.0.1:45781_igmp%2Fa c:control_collection) [n:127.0.0.1:45781_igmp%2Fa c:control_collection s:shard1 r:core_node1 x:collection1] o.a.s.c.ZkController publishing state=active
[junit4] 2> 2588518 INFO (coreZkRegister-2772-thread-1-processing-s:shard1 r:core_node1 x:collection1 n:127.0.0.1:45781_igmp%2Fa c:control_collection) [n:127.0.0.1:45781_igmp%2Fa c:control_collection s:shard1 r:core_node1 x:collection1] o.a.s.c.ZkController numShards not found on descriptor - reading it from system property
[junit4] 2> 2588520 INFO (OverseerStateUpdate-95280051139575812-127.0.0.1:45781_igmp%2Fa-n_0000000000) [n:127.0.0.1:45781_igmp%2Fa ] o.a.s.c.Overseer processMessage: queueSize: 1, message = {
[junit4] 2> "numShards":"2",
[junit4] 2> "state":"active",
[junit4] 2> "shard":"shard1",
[junit4] 2> "core":"collection1",
[junit4] 2> "node_name":"127.0.0.1:45781_igmp%2Fa",
[junit4] 2> "core_node_name":"core_node1",
[junit4] 2> "collection":"control_collection",
[junit4] 2> "base_url":"http://127.0.0.1:45781/igmp/a",
[junit4] 2> "operation":"state",
[junit4] 2> "roles":null} current state version: 2
[junit4] 2> 2588521 INFO (OverseerStateUpdate-95280051139575812-127.0.0.1:45781_igmp%2Fa-n_0000000000) [n:127.0.0.1:45781_igmp%2Fa ] o.a.s.c.o.ReplicaMutator Update state numShards=2 message={
[junit4] 2> "numShards":"2",
[junit4] 2> "state":"active",
[junit4] 2> "shard":"shard1",
[junit4] 2> "core":"collection1",
[junit4] 2> "node_name":"127.0.0.1:45781_igmp%2Fa",
[junit4] 2> "core_node_name":"core_node1",
[junit4] 2> "collection":"control_collection",
[junit4] 2> "base_url":"http://127.0.0.1:45781/igmp/a",
[junit4] 2> "operation":"state",
[junit4] 2> "roles":null}
[junit4] 2> 2588522 INFO (OverseerStateUpdate-95280051139575812-127.0.0.1:45781_igmp%2Fa-n_0000000000) [n:127.0.0.1:45781_igmp%2Fa ] o.a.s.c.o.ZkStateWriter going to create_collection /collections/collection1/state.json
[junit4] 2> 2588561 INFO (TEST-TestSolrConfigHandlerCloud.test-seed#[6046A6E442C2D55F]) [ ] o.a.s.SolrTestCaseJ4 Writing core.properties file to /x1/jenkins/jenkins-slave/workspace/Lucene-Solr-NightlyTests-5.x/solr/build/solr-core/test/J1/temp/solr.handler.TestSolrConfigHandlerCloud_6046A6E442C2D55F-001/shard-1-001/cores/collection1
[junit4] 2> 2588562 INFO (TEST-TestSolrConfigHandlerCloud.test-seed#[6046A6E442C2D55F]) [ ] o.a.s.c.AbstractFullDistribZkTestBase create jetty 1 in directory /x1/jenkins/jenkins-slave/workspace/Lucene-Solr-NightlyTests-5.x/solr/build/solr-core/test/J1/temp/solr.handler.TestSolrConfigHandlerCloud_6046A6E442C2D55F-001/shard-1-001
[junit4] 2> 2588563 INFO (TEST-TestSolrConfigHandlerCloud.test-seed#[6046A6E442C2D55F]) [ ] o.e.j.s.Server jetty-9.2.13.v20150730
[junit4] 2> 2588593 INFO (TEST-TestSolrConfigHandlerCloud.test-seed#[6046A6E442C2D55F]) [ ] o.e.j.s.h.ContextHandler Started o.e.j.s.ServletContextHandler@56d5f96b{/igmp/a,null,AVAILABLE}
[junit4] 2> 2588593 INFO (TEST-TestSolrConfigHandlerCloud.test-seed#[6046A6E442C2D55F]) [ ] o.e.j.s.ServerConnector Started ServerConnector@79ea0c56{HTTP/1.1}{127.0.0.1:41018}
[junit4] 2> 2588593 INFO (TEST-TestSolrConfigHandlerCloud.test-seed#[6046A6E442C2D55F]) [ ] o.e.j.s.Server Started @2591475ms
[junit4] 2> 2588593 INFO (TEST-TestSolrConfigHandlerCloud.test-seed#[6046A6E442C2D55F]) [ ] o.a.s.c.s.e.JettySolrRunner Jetty properties: {hostContext=/igmp/a, coreRootDirectory=/x1/jenkins/jenkins-slave/workspace/Lucene-Solr-NightlyTests-5.x/solr/build/solr-core/test/J1/temp/solr.handler.TestSolrConfigHandlerCloud_6046A6E442C2D55F-001/shard-1-001/cores, solr.data.dir=/x1/jenkins/jenkins-slave/workspace/Lucene-Solr-NightlyTests-5.x/solr/build/solr-core/test/J1/temp/solr.handler.TestSolrConfigHandlerCloud_6046A6E442C2D55F-001/tempDir-001/jetty1, solrconfig=solrconfig.xml, hostPort=41018}
[junit4] 2> 2588594 INFO (TEST-TestSolrConfigHandlerCloud.test-seed#[6046A6E442C2D55F]) [ ] o.a.s.s.SolrDispatchFilter SolrDispatchFilter.init(): sun.misc.Launcher$AppClassLoader@3827de24
[junit4] 2> 2588594 INFO (TEST-TestSolrConfigHandlerCloud.test-seed#[6046A6E442C2D55F]) [ ] o.a.s.c.SolrResourceLoader new SolrResourceLoader for directory: '/x1/jenkins/jenkins-slave/workspace/Lucene-Solr-NightlyTests-5.x/solr/build/solr-core/test/J1/temp/solr.handler.TestSolrConfigHandlerCloud_6046A6E442C2D55F-001/shard-1-001'
[junit4] 2> 2588594 INFO (TEST-TestSolrConfigHandlerCloud.test-seed#[6046A6E442C2D55F]) [ ] o.a.s.c.SolrResourceLoader JNDI not configured for solr (NoInitialContextEx)
[junit4] 2> 2588594 INFO (TEST-TestSolrConfigHandlerCloud.test-seed#[6046A6E442C2D55F]) [ ] o.a.s.c.SolrResourceLoader solr home defaulted to 'solr/' (could not find system property or JNDI)
[junit4] 2> 2588594 INFO (TEST-TestSolrConfigHandlerCloud.test-seed#[6046A6E442C2D55F]) [ ] o.a.s.c.c.SolrZkClient Using default ZkCredentialsProvider
[junit4] 2> 2588597 INFO (TEST-TestSolrConfigHandlerCloud.test-seed#[6046A6E442C2D55F]) [ ] o.a.s.c.c.ConnectionManager Waiting for client to connect to ZooKeeper
[junit4] 2> 2588600 INFO (zkCallback-954-thread-1) [ ] o.a.s.c.c.ConnectionManager Watcher org.apache.solr.common.cloud.ConnectionManager@779c626c name:ZooKeeperConnection Watcher:127.0.0.1:50958/solr got event WatchedEvent state:SyncConnected type:None path:null path:null type:None
[junit4] 2> 2588600 INFO (TEST-TestSolrConfigHandlerCloud.test-seed#[6046A6E442C2D55F]) [ ] o.a.s.c.c.ConnectionManager Client is connected to ZooKeeper
[junit4] 2> 2588601 INFO (TEST-TestSolrConfigHandlerCloud.test-seed#[6046A6E442C2D55F]) [ ] o.a.s.c.c.SolrZkClient Using default ZkACLProvider
[junit4] 2> 2588602 INFO (TEST-TestSolrConfigHandlerCloud.test-seed#[6046A6E442C2D55F]) [ ] o.a.s.s.SolrDispatchFilter Loading solr.xml from SolrHome (not found in ZooKeeper)
[junit4] 2> 2588603 INFO (TEST-TestSolrConfigHandlerCloud.test-seed#[6046A6E442C2D55F]) [ ] o.a.s.c.SolrXmlConfig Loading container configuration from /x1/jenkins/jenkins-slave/workspace/Lucene-Solr-NightlyTests-5.x/solr/build/solr-core/test/J1/temp/solr.handler.TestSolrConfigHandlerCloud_6046A6E442C2D55F-001/shard-1-001/solr.xml
[junit4] 2> 2588618 INFO (TEST-TestSolrConfigHandlerCloud.test-seed#[6046A6E442C2D55F]) [ ] o.a.s.c.CorePropertiesLocator Config-defined core root directory: /x1/jenkins/jenkins-slave/workspace/Lucene-Solr-NightlyTests-5.x/solr/build/solr-core/test/J1/temp/solr.handler.TestSolrConfigHandlerCloud_6046A6E442C2D55F-001/shard-1-001/cores
[junit4] 2> 2588618 INFO (TEST-TestSolrConfigHandlerCloud.test-seed#[6046A6E442C2D55F]) [ ] o.a.s.c.CoreContainer New CoreContainer 544127100
[junit4] 2> 2588618 INFO (TEST-TestSolrConfigHandlerCloud.test-seed#[6046A6E442C2D55F]) [ ] o.a.s.c.CoreContainer Loading cores into CoreContainer [instanceDir=/x1/jenkins/jenkins-slave/workspace/Lucene-Solr-NightlyTests-5.x/solr/build/solr-core/test/J1/temp/solr.handler.TestSolrConfigHandlerCloud_6046A6E442C2D55F-001/shard-1-001]
[junit4] 2> 2588619 WARN (TEST-TestSolrConfigHandlerCloud.test-seed#[6046A6E442C2D55F]) [ ] o.a.s.c.CoreContainer Couldn't add files from /x1/jenkins/jenkins-slave/workspace/Lucene-Solr-NightlyTests-5.x/solr/build/solr-core/test/J1/temp/solr.handler.TestSolrConfigHandlerCloud_6046A6E442C2D55F-001/shard-1-001/lib to classpath: /x1/jenkins/jenkins-slave/workspace/Lucene-Solr-NightlyTests-5.x/solr/build/solr-core/test/J1/temp/solr.handler.TestSolrConfigHandlerCloud_6046A6E442C2D55F-001/shard-1-001/lib
[junit4] 2> 2588619 INFO (TEST-TestSolrConfigHandlerCloud.test-seed#[6046A6E442C2D55F]) [ ] o.a.s.h.c.HttpShardHandlerFactory created with socketTimeout : 90000,urlScheme : ,connTimeout : 15000,maxConnectionsPerHost : 20,maxConnections : 10000,corePoolSize : 0,maximumPoolSize : 2147483647,maxThreadIdleTime : 5,sizeOfQueue : -1,fairnessPolicy : false,useRetries : false,
[junit4] 2> 2588620 INFO (TEST-TestSolrConfigHandlerCloud.test-seed#[6046A6E442C2D55F]) [ ] o.a.s.u.UpdateShardHandler Creating UpdateShardHandler HTTP client with params: socketTimeout=340000&connTimeout=45000&retry=true
[junit4] 2> 2588621 INFO (TEST-TestSolrConfigHandlerCloud.test-seed#[6046A6E442C2D55F]) [ ] o.a.s.l.LogWatcher SLF4J impl is org.slf4j.impl.Log4jLoggerFactory
[junit4] 2> 2588621 INFO (TEST-TestSolrConfigHandlerCloud.test-seed#[6046A6E442C2D55F]) [ ] o.a.s.l.LogWatcher Registering Log Listener [Log4j (org.slf4j.impl.Log4jLoggerFactory)]
[junit4] 2> 2588621 INFO (TEST-TestSolrConfigHandlerCloud.test-seed#[6046A6E442C2D55F]) [ ] o.a.s.c.ZkContainer Zookeeper client=127.0.0.1:50958/solr
[junit4] 2> 2588621 INFO (TEST-TestSolrConfigHandlerCloud.test-seed#[6046A6E442C2D55F]) [ ] o.a.s.c.ZkController zkHost includes chroot
[junit4] 2> 2588621 INFO (TEST-TestSolrConfigHandlerCloud.test-seed#[6046A6E442C2D55F]) [ ] o.a.s.c.c.SolrZkClient Using default ZkCredentialsProvider
[junit4] 2> 2588626 INFO (zkCallback-952-thread-1) [ ] o.a.s.c.c.ZkStateReader A cluster state change: [WatchedEvent state:SyncConnected type:NodeDataChanged path:/clusterstate.json], has occurred - updating... (live nodes size: [1])
[junit4] 2> 2588634 INFO (TEST-TestSolrConfigHandlerCloud.test-seed#[6046A6E442C2D55F]) [ ] o.a.s.c.c.ConnectionManager Waiting for client to connect to ZooKeeper
[junit4] 2> 2588626 INFO (zkCallback-950-thread-2-processing-n:127.0.0.1:45781_igmp%2Fa) [n:127.0.0.1:45781_igmp%2Fa ] o.a.s.c.c.ZkStateReader A cluster state change: [WatchedEvent state:SyncConnected type:NodeDataChanged path:/clusterstate.json], has occurred - updating... (live nodes size: [1])
[junit4] 2> 2588626 INFO (zkCallback-950-thread-1-processing-n:127.0.0.1:45781_igmp%2Fa) [n:127.0.0.1:45781_igmp%2Fa ] o.a.s.c.c.ZkStateReader A cluster state change: [WatchedEvent state:SyncConnected type:NodeDataChanged path:/clusterstate.json], has occurred - updating... (live nodes size: [1])
[junit4] 2> 2588638 INFO (zkCallback-957-thread-1) [ ] o.a.s.c.c.ConnectionManager Watcher org.apache.solr.common.cloud.ConnectionManager@1fcd1f60 name:ZooKeeperConnection Watcher:127.0.0.1:50958 got event WatchedEvent state:SyncConnected type:None path:null path:null type:None
[junit4] 2> 2588638 INFO (TEST-TestSolrConfigHandlerCloud.test-seed#[6046A6E442C2D55F]) [ ] o.a.s.c.c.ConnectionManager Client is connected to ZooKeeper
[junit4] 2> 2588639 INFO (TEST-TestSolrConfigHandlerCloud.test-seed#[6046A6E442C2D55F]) [ ] o.a.s.c.c.SolrZkClient Using default ZkACLProvider
[junit4] 2> 2588648 INFO (TEST-TestSolrConfigHandlerCloud.test-seed#[6046A6E442C2D55F]) [n:127.0.0.1:41018_igmp%2Fa ] o.a.s.c.c.ConnectionManager Waiting for client to connect to ZooKeeper
[junit4] 2> 2588650 INFO (zkCallback-958-thread-1-processing-n:127.0.0.1:41018_igmp%2Fa) [n:127.0.0.1:41018_igmp%2Fa ] o.a.s.c.c.ConnectionManager Watcher org.apache.solr.common.cloud.ConnectionManager@10aee620 name:ZooKeeperConnection Watcher:127.0.0.1:50958/solr got event WatchedEvent state:SyncConnected type:None path:null path:null type:None
[junit4] 2> 2588650 INFO (TEST-TestSolrConfigHandlerCloud.test-seed#[6046A6E442C2D55F]) [n:127.0.0.1:41018_igmp%2Fa ] o.a.s.c.c.ConnectionManager Client is connected to ZooKeeper
[junit4] 2> 2588655 INFO (TEST-TestSolrConfigHandlerCloud.test-seed#[6046A6E442C2D55F]) [n:127.0.0.1:41018_igmp%2Fa ] o.a.s.c.c.ZkStateReader Updating cluster state from ZooKeeper...
[junit4] 2> 2589666 INFO (TEST-TestSolrConfigHandlerCloud.test-seed#[6046A6E442C2D55F]) [n:127.0.0.1:41018_igmp%2Fa ] o.a.s.c.ZkController Register node as live in ZooKeeper:/live_nodes/127.0.0.1:41018_igmp%2Fa
[junit4] 2> 2589666 INFO (TEST-TestSolrConfigHandlerCloud.test-seed#[6046A6E442C2D55F]) [n:127.0.0.1:41018_igmp%2Fa ] o.a.s.c.c.SolrZkClient makePath: /live_nodes/127.0.0.1:41018_igmp%2Fa
[junit4] 2> 2589668 INFO (zkCallback-952-thread-1) [ ] o.a.s.c.c.ZkStateReader A live node change: [WatchedEvent state:SyncConnected type:NodeChildrenChanged path:/live_nodes], has occurred - updating... (live nodes size: [1])
[junit4] 2> 2589668 INFO (zkCallback-950-thread-2-processing-n:127.0.0.1:45781_igmp%2Fa) [n:127.0.0.1:45781_igmp%2Fa ] o.a.s.c.c.ZkStateReader A live node change: [WatchedEvent state:SyncConnected type:NodeChildrenChanged path:/live_nodes], has occurred - updating... (live nodes size: [1])
[junit4] 2> 2589668 INFO (zkCallback-958-thread-1-processing-n:127.0.0.1:41018_igmp%2Fa) [n:127.0.0.1:41018_igmp%2Fa ] o.a.s.c.c.ZkStateReader A live node change: [WatchedEvent state:SyncConnected type:NodeChildrenChanged path:/live_nodes], has occurred - updating... (live nodes size: [1])
[junit4] 2> 2589668 INFO (zkCallback-950-thread-3-processing-n:127.0.0.1:45781_igmp%2Fa) [n:127.0.0.1:45781_igmp%2Fa ] o.a.s.c.c.ZkStateReader A live node change: [WatchedEvent state:SyncConnected type:NodeChildrenChanged path:/live_nodes], has occurred - updating... (live nodes size: [1])
[junit4] 2> 2589670 INFO (TEST-TestSolrConfigHandlerCloud.test-seed#[6046A6E442C2D55F]) [n:127.0.0.1:41018_igmp%2Fa ] o.a.s.c.Overseer Overseer (id=null) closing
[junit4] 2> 2589671 INFO (TEST-TestSolrConfigHandlerCloud.test-seed#[6046A6E442C2D55F]) [n:127.0.0.1:41018_igmp%2Fa ] o.a.s.c.LeaderElector Joined leadership election with path: /overseer_elect/election/95280051139575817-127.0.0.1:41018_igmp%2Fa-n_0000000001
[junit4] 2> 2589672 INFO (TEST-TestSolrConfigHandlerCloud.test-seed#[6046A6E442C2D55F]) [n:127.0.0.1:41018_igmp%2Fa ] o.a.s.c.LeaderElector Watching path /overseer_elect/election/95280051139575812-127.0.0.1:45781_igmp%2Fa-n_0000000000 to know if I could be the leader
[junit4] 2> 2589686 INFO (TEST-TestSolrConfigHandlerCloud.test-seed#[6046A6E442C2D55F]) [n:127.0.0.1:41018_igmp%2Fa ] o.a.s.c.CoreContainer Security conf doesn't exist. Skipping setup for authorization module.
[junit4] 2> 2589686 INFO (TEST-TestSolrConfigHandlerCloud.test-seed#[6046A6E442C2D55F]) [n:127.0.0.1:41018_igmp%2Fa ] o.a.s.c.CoreContainer No authentication plugin used.
[junit4] 2> 2589687 INFO (TEST-TestSolrConfigHandlerCloud.test-seed#[6046A6E442C2D55F]) [n:127.0.0.1:41018_igmp%2Fa ] o.a.s.c.CorePropertiesLocator Looking for core definitions underneath /x1/jenkins/jenkins-slave/workspace/Lucene-Solr-NightlyTests-5.x/solr/build/solr-core/test/J1/temp/solr.handler.TestSolrConfigHandlerCloud_6046A6E442C2D55F-001/shard-1-001/cores
[junit4] 2> 2589688 INFO (TEST-TestSolrConfigHandlerCloud.test-seed#[6046A6E442C2D55F]) [n:127.0.0.1:41018_igmp%2Fa ] o.a.s.c.CoreDescriptor Created CoreDescriptor: {name=collection1, dataDir=data/, coreNodeName=, collection=collection1, transient=false, shard=, loadOnStartup=true, configSetProperties=configsetprops.json, config=solrconfig.xml, schema=schema.xml}
[junit4] 2> 2589688 INFO (TEST-TestSolrConfigHandlerCloud.test-seed#[6046A6E442C2D55F]) [n:127.0.0.1:41018_igmp%2Fa ] o.a.s.c.CorePropertiesLocator Found core collection1 in /x1/jenkins/jenkins-slave/workspace/Lucene-Solr-NightlyTests-5.x/solr/build/solr-core/test/J1/temp/solr.handler.TestSolrConfigHandlerCloud_6046A6E442C2D55F-001/shard-1-001/cores/collection1
[junit4] 2> 2589688 INFO (TEST-TestSolrConfigHandlerCloud.test-seed#[6046A6E442C2D55F]) [n:127.0.0.1:41018_igmp%2Fa ] o.a.s.c.CorePropertiesLocator Found 1 core definitions
[junit4] 2> 2589693 INFO (TEST-TestSolrConfigHandlerCloud.test-seed#[6046A6E442C2D55F]) [n:127.0.0.1:41018_igmp%2Fa ] o.a.s.s.SolrDispatchFilter user.dir=/x1/jenkins/jenkins-slave/workspace/Lucene-Solr-NightlyTests-5.x/solr/build/solr-core/test/J1
[junit4] 2> 2589693 INFO (TEST-TestSolrConfigHandlerCloud.test-seed#[6046A6E442C2D55F]) [n:127.0.0.1:41018_igmp%2Fa ] o.a.s.s.SolrDispatchFilter SolrDispatchFilter.init() done
[junit4] 2> 2589693 INFO (coreLoadExecutor-2789-thread-1-processing-n:127.0.0.1:41018_igmp%2Fa) [n:127.0.0.1:41018_igmp%2Fa c:collection1 x:collection1] o.a.s.c.ZkController publishing state=down
[junit4] 2> 2589694 INFO (coreLoadExecutor-2789-thread-1-processing-n:127.0.0.1:41018_igmp%2Fa) [n:127.0.0.1:41018_igmp%2Fa c:collection1 x:collection1] o.a.s.c.ZkController numShards not found on descriptor - reading it from system property
[junit4] 2> 2589695 INFO (coreLoadExecutor-2789-thread-1-processing-n:127.0.0.1:41018_igmp%2Fa) [n:127.0.0.1:41018_igmp%2Fa c:collection1 x:collection1] o.a.s.c.ZkController Registering watch for collection collection1
[junit4] 2> 2589695 INFO (coreLoadExecutor-2789-thread-1-processing-n:127.0.0.1:41018_igmp%2Fa) [n:127.0.0.1:41018_igmp%2Fa c:collection1 x:collection1] o.a.s.c.c.ZkStateReader addZkWatch [collection1]
[junit4] 2> 2589695 INFO (coreLoadExecutor-2789-thread-1-processing-n:127.0.0.1:41018_igmp%2Fa) [n:127.0.0.1:41018_igmp%2Fa c:collection1 x:collection1] o.a.s.c.c.ZkStateReader Add data for [collection1] ver [0]
[junit4] 2> 2589695 INFO (OverseerStateUpdate-95280051139575812-127.0.0.1:45781_igmp%2Fa-n_0000000000) [n:127.0.0.1:45781_igmp%2Fa ] o.a.s.c.Overseer processMessage: queueSize: 1, message = {
[junit4] 2> "numShards":"2",
[junit4] 2> "state":"down",
[junit4] 2> "shard":null,
[junit4] 2> "core":"collection1",
[junit4] 2> "node_name":"127.0.0.1:41018_igmp%2Fa",
[junit4] 2> "collection":"collection1",
[junit4] 2> "base_url":"http://127.0.0.1:41018/igmp/a",
[junit4] 2> "operation":"state",
[junit4] 2> "roles":null} current state version: 3
[junit4] 2> 2589695 INFO (coreLoadExecutor-2789-thread-1-processing-n:127.0.0.1:41018_igmp%2Fa) [n:127.0.0.1:41018_igmp%2Fa c:collection1 x:collection1] o.a.s.c.ZkController look for our core node name
[junit4] 2> 2589696 INFO (OverseerStateUpdate-95280051139575812-127.0.0.1:45781_igmp%2Fa-n_0000000000) [n:127.0.0.1:45781_igmp%2Fa ] o.a.s.c.o.ReplicaMutator Update state numShards=2 message={
[junit4] 2> "numShards":"2",
[junit4] 2> "state":"down",
[junit4] 2> "shard":null,
[junit4] 2> "core":"collection1",
[junit4] 2> "node_name":"127.0.0.1:41018_igmp%2Fa",
[junit4] 2> "collection":"collection1",
[junit4] 2> "base_url":"http://127.0.0.1:41018/igmp/a",
[junit4] 2> "operation":"state",
[junit4] 2> "roles":null}
[junit4] 2> 2589696 INFO (OverseerStateUpdate-95280051139575812-127.0.0.1:45781_igmp%2Fa-n_0000000000) [n:127.0.0.1:45781_igmp%2Fa ] o.a.s.c.o.ReplicaMutator Collection already exists with numShards=2
[junit4] 2> 2589696 INFO (OverseerStateUpdate-95280051139575812-127.0.0.1:45781_igmp%2Fa-n_0000000000) [n:127.0.0.1:45781_igmp%2Fa ] o.a.s.c.o.ReplicaMutator Assigning new node to shard shard=shard2
[junit4] 2> 2589798 INFO (OverseerStateUpdate-95280051139575812-127.0.0.1:45781_igmp%2Fa-n_0000000000) [n:127.0.0.1:45781_igmp%2Fa ] o.a.s.c.o.ZkStateWriter going to update_collection /collections/collection1/state.json version: 0
[junit4] 2> 2589799 INFO (zkCallback-958-thread-1-processing-n:127.0.0.1:41018_igmp%2Fa) [n:127.0.0.1:41018_igmp%2Fa ] o.a.s.c.c.ZkStateReader A cluster state change: [WatchedEvent state:SyncConnected type:NodeDataChanged path:/collections/collection1/state.json] for collection [collection1] has occurred - updating... (live nodes size: [2])
[junit4] 2> 2589799 INFO (zkCallback-958-thread-1-processing-n:127.0.0.1:41018_igmp%2Fa) [n:127.0.0.1:41018_igmp%2Fa ] o.a.s.c.c.ZkStateReader Updating data for [collection1] from [0] to [1]
[junit4] 2> 2590696 INFO (coreLoadExecutor-2789-thread-1-processing-n:127.0.0.1:41018_igmp%2Fa) [n:127.0.0.1:41018_igmp%2Fa c:collection1 x:collection1] o.a.s.c.ZkController waiting to find shard id in clusterstate for collection1
[junit4] 2> 2590696 INFO (coreLoadExecutor-2789-thread-1-processing-n:127.0.0.1:41018_igmp%2Fa) [n:127.0.0.1:41018_igmp%2Fa c:collection1 x:collection1] o.a.s.c.ZkController Check for collection zkNode:collection1
[junit4] 2> 2590696 INFO (coreLoadExecutor-2789-thread-1-processing-n:127.0.0.1:41018_igmp%2Fa) [n:127.0.0.1:41018_igmp%2Fa c:collection1 x:collection1] o.a.s.c.ZkController Collection zkNode exists
[junit4] 2> 2590696 INFO (coreLoadExecutor-2789-thread-1-processing-n:127.0.0.1:41018_igmp%2Fa) [n:127.0.0.1:41018_igmp%2Fa c:collection1 x:collection1] o.a.s.c.c.ZkStateReader Load collection config from: [/collections/collection1]
[junit4] 2> 2590697 INFO (coreLoadExecutor-2789-thread-1-processing-n:127.0.0.1:41018_igmp%2Fa) [n:127.0.0.1:41018_igmp%2Fa c:collection1 x:collection1] o.a.s.c.c.ZkStateReader path=[/collections/collection1] [configName]=[conf1] specified config exists in ZooKeeper
[junit4] 2> 2590697 INFO (coreLoadExecutor-2789-thread-1-processing-n:127.0.0.1:41018_igmp%2Fa) [n:127.0.0.1:41018_igmp%2Fa c:collection1 x:collection1] o.a.s.c.SolrResourceLoader new SolrResourceLoader for directory: '/x1/jenkins/jenkins-slave/workspace/Lucene-Solr-NightlyTests-5.x/solr/build/solr-core/test/J1/temp/solr.handler.TestSolrConfigHandlerCloud_6046A6E442C2D55F-001/shard-1-001/cores/collection1'
[junit4] 2> 2590697 INFO (coreLoadExecutor-2789-thread-1-processing-n:127.0.0.1:41018_igmp%2Fa) [n:127.0.0.1:41018_igmp%2Fa c:collection1 x:collection1] o.a.s.c.SolrResourceLoader JNDI not configured for solr (NoInitialContextEx)
[junit4] 2> 2590697 INFO (coreLoadExecutor-2789-thread-1-processing-n:127.0.0.1:41018_igmp%2Fa) [n:127.0.0.1:41018_igmp%2Fa c:collection1 x:collection1] o.a.s.c.SolrResourceLoader solr home defaulted to 'solr/' (could not find system property or JNDI)
[junit4] 2> 2590699 INFO (coreLoadExecutor-2789-thread-1-processing-n:127.0.0.1:41018_igmp%2Fa) [n:127.0.0.1:41018_igmp%2Fa c:collection1 x:collection1] o.a.s.c.Config loaded config solrconfig.xml with version 0
[junit4] 2> 2590707 INFO (coreLoadExecutor-2789-thread-1-processing-n:127.0.0.1:41018_igmp%2Fa) [n:127.0.0.1:41018_igmp%2Fa c:collection1 x:collection1] o.a.s.c.SolrConfig current version of requestparams : -1
[junit4] 2> 2590722 INFO (coreLoadExecutor-2789-thread-1-processing-n:127.0.0.1:41018_igmp%2Fa) [n:127.0.0.1:41018_igmp%2Fa c:collection1 x:collection1] o.a.s.c.SolrConfig Using Lucene MatchVersion: 5.5.0
[junit4] 2> 2590753 INFO (coreLoadExecutor-2789-thread-1-processing-n:127.0.0.1:41018_igmp%2Fa) [n:127.0.0.1:41018_igmp%2Fa c:collection1 x:collection1] o.a.s.c.SolrConfig Loaded SolrConfig: solrconfig.xml
[junit4] 2> 2590761 INFO (coreLoadExecutor-2789-thread-1-processing-n:127.0.0.1:41018_igmp%2Fa) [n:127.0.0.1:41018_igmp%2Fa c:collection1 x:collection1] o.a.s.s.IndexSchema [collection1] Schema name=test
[junit4] 2> 2591043 INFO (coreLoadExecutor-2789-thread-1-processing-n:127.0.0.1:41018_igmp%2Fa) [n:127.0.0.1:41018_igmp%2Fa c:collection1 x:collection1] o.a.s.s.OpenExchangeRatesOrgProvider Initialized with rates=open-exchange-rates.json, refreshInterval=1440.
[junit4] 2> 2591054 INFO (coreLoadExecutor-2789-thread-1-processing-n:127.0.0.1:41018_igmp%2Fa) [n:127.0.0.1:41018_igmp%2Fa c:collection1 x:collection1] o.a.s.s.IndexSchema default search field in schema is text
[junit4] 2> 2591056 INFO (coreLoadExecutor-2789-thread-1-processing-n:127.0.0.1:41018_igmp%2Fa) [n:127.0.0.1:41018_igmp%2Fa c:collection1 x:collection1] o.a.s.s.IndexSchema unique key field: id
[junit4] 2> 2591069 INFO (coreLoadExecutor-2789-thread-1-processing-n:127.0.0.1:41018_igmp%2Fa) [n:127.0.0.1:41018_igmp%2Fa c:collection1 x:collection1] o.a.s.s.FileExchangeRateProvider Reloading exchange rates from file currency.xml
[junit4] 2> 2591074 INFO (coreLoadExecutor-2789-thread-1-processing-n:127.0.0.1:41018_igmp%2Fa) [n:127.0.0.1:41018_igmp%2Fa c:collection1 x:collection1] o.a.s.s.FileExchangeRateProvider Reloading exchange rates from file currency.xml
[junit4] 2> 2591077 INFO (coreLoadExecutor-2789-thread-1-processing-n:127.0.0.1:41018_igmp%2Fa) [n:127.0.0.1:41018_igmp%2Fa c:collection1 x:collection1] o.a.s.s.OpenExchangeRatesOrgProvider Reloading exchange rates from open-exchange-rates.json
[junit4] 2> 2591078 INFO (coreLoadExecutor-2789-thread-1-processing-n:127.0.0.1:41018_igmp%2Fa) [n:127.0.0.1:41018_igmp%2Fa c:collection1 x:collection1] o.a.s.s.OpenExchangeRatesOrgProvider Reloading exchange rates from open-exchange-rates.json
[junit4] 2> 2591080 INFO (coreLoadExecutor-2789-thread-1-processing-n:127.0.0.1:41018_igmp%2Fa) [n:127.0.0.1:41018_igmp%2Fa c:collection1 x:collection1] o.a.s.c.ConfigSetProperties Did not find ConfigSet properties, assuming default properties: Can't find resource 'configsetprops.json' in classpath or '/configs/conf1', cwd=/x1/jenkins/jenkins-slave/workspace/Lucene-Solr-NightlyTests-5.x/solr/build/solr-core/test/J1
[junit4] 2> 2591080 INFO (coreLoadExecutor-2789-thread-1-processing-n:127.0.0.1:41018_igmp%2Fa) [n:127.0.0.1:41018_igmp%2Fa c:collection1 x:collection1] o.a.s.c.CoreContainer Creating SolrCore 'collection1' using configuration from collection collection1
[jun
[...truncated too long message...]
essionExpiredException: KeeperErrorCode = Session expired for /configs/conf1/enumsConfig.xml
[junit4] 2> at org.apache.zookeeper.KeeperException.create(KeeperException.java:127)
[junit4] 2> at org.apache.zookeeper.KeeperException.create(KeeperException.java:51)
[junit4] 2> at org.apache.zookeeper.ZooKeeper.exists(ZooKeeper.java:1045)
[junit4] 2> at org.apache.solr.common.cloud.SolrZkClient$5.execute(SolrZkClient.java:311)
[junit4] 2> at org.apache.solr.common.cloud.SolrZkClient$5.execute(SolrZkClient.java:308)
[junit4] 2> at org.apache.solr.common.cloud.ZkCmdExecutor.retryOperation(ZkCmdExecutor.java:61)
[junit4] 2> at org.apache.solr.common.cloud.SolrZkClient.exists(SolrZkClient.java:308)
[junit4] 2> at org.apache.solr.cloud.ZkController.pathExists(ZkController.java:838)
[junit4] 2> at org.apache.solr.cloud.ZkSolrResourceLoader.openResource(ZkSolrResourceLoader.java:87)
[junit4] 2> ... 14 more
[junit4] 2> 2711628 INFO (Thread-6992) [n:127.0.0.1:34587_igmp%2Fa ] o.a.s.s.OpenExchangeRatesOrgProvider Initialized with rates=open-exchange-rates.json, refreshInterval=1440.
[junit4] 2> 2711629 WARN (Thread-6992) [n:127.0.0.1:34587_igmp%2Fa ] o.a.s.c.SolrCores Tried to remove core collection1 from pendingCoreOps and it wasn't there.
[junit4] 2> 2711629 WARN (Thread-6992) [n:127.0.0.1:34587_igmp%2Fa ] o.a.s.c.ZkController listener throws error
[junit4] 2> org.apache.solr.common.SolrException: Unable to reload core [collection1]
[junit4] 2> at org.apache.solr.core.CoreContainer.reload(CoreContainer.java:925)
[junit4] 2> at org.apache.solr.core.SolrCore$11.run(SolrCore.java:2604)
[junit4] 2> at org.apache.solr.cloud.ZkController$5.run(ZkController.java:2449)
[junit4] 2> Caused by: org.apache.solr.common.SolrException: Could not load conf for core collection1: Can't load schema schema.xml: Plugin Initializing failure for [schema.xml] fieldType
[junit4] 2> at org.apache.solr.core.ConfigSetService.getConfig(ConfigSetService.java:85)
[junit4] 2> at org.apache.solr.core.CoreContainer.reload(CoreContainer.java:918)
[junit4] 2> ... 2 more
[junit4] 2> Caused by: org.apache.solr.common.SolrException: Can't load schema schema.xml: Plugin Initializing failure for [schema.xml] fieldType
[junit4] 2> at org.apache.solr.schema.IndexSchema.readSchema(IndexSchema.java:578)
[junit4] 2> at org.apache.solr.schema.IndexSchema.<init>(IndexSchema.java:160)
[junit4] 2> at org.apache.solr.schema.IndexSchemaFactory.create(IndexSchemaFactory.java:56)
[junit4] 2> at org.apache.solr.schema.IndexSchemaFactory.buildIndexSchema(IndexSchemaFactory.java:70)
[junit4] 2> at org.apache.solr.core.ConfigSetService.createIndexSchema(ConfigSetService.java:109)
[junit4] 2> at org.apache.solr.core.ConfigSetService.getConfig(ConfigSetService.java:80)
[junit4] 2> ... 3 more
[junit4] 2> Caused by: org.apache.solr.common.SolrException: Plugin Initializing failure for [schema.xml] fieldType
[junit4] 2> at org.apache.solr.util.plugin.AbstractPluginLoader.load(AbstractPluginLoader.java:195)
[junit4] 2> at org.apache.solr.schema.IndexSchema.readSchema(IndexSchema.java:471)
[junit4] 2> ... 8 more
[junit4] 2> Caused by: org.apache.solr.common.SolrException: Error while opening enums config.
[junit4] 2> at org.apache.solr.schema.EnumField.init(EnumField.java:143)
[junit4] 2> at org.apache.solr.schema.FieldType.setArgs(FieldType.java:175)
[junit4] 2> at org.apache.solr.schema.FieldTypePluginLoader.init(FieldTypePluginLoader.java:151)
[junit4] 2> at org.apache.solr.schema.FieldTypePluginLoader.init(FieldTypePluginLoader.java:54)
[junit4] 2> at org.apache.solr.util.plugin.AbstractPluginLoader.load(AbstractPluginLoader.java:192)
[junit4] 2> ... 9 more
[junit4] 2> Caused by: java.io.IOException: Error opening /configs/conf1/enumsConfig.xml
[junit4] 2> at org.apache.solr.cloud.ZkSolrResourceLoader.openResource(ZkSolrResourceLoader.java:93)
[junit4] 2> at org.apache.solr.schema.EnumField.init(EnumField.java:101)
[junit4] 2> ... 13 more
[junit4] 2> Caused by: org.apache.zookeeper.KeeperException$SessionExpiredException: KeeperErrorCode = Session expired for /configs/conf1/enumsConfig.xml
[junit4] 2> at org.apache.zookeeper.KeeperException.create(KeeperException.java:127)
[junit4] 2> at org.apache.zookeeper.KeeperException.create(KeeperException.java:51)
[junit4] 2> at org.apache.zookeeper.ZooKeeper.exists(ZooKeeper.java:1045)
[junit4] 2> at org.apache.solr.common.cloud.SolrZkClient$5.execute(SolrZkClient.java:311)
[junit4] 2> at org.apache.solr.common.cloud.SolrZkClient$5.execute(SolrZkClient.java:308)
[junit4] 2> at org.apache.solr.common.cloud.ZkCmdExecutor.retryOperation(ZkCmdExecutor.java:61)
[junit4] 2> at org.apache.solr.common.cloud.SolrZkClient.exists(SolrZkClient.java:308)
[junit4] 2> at org.apache.solr.cloud.ZkController.pathExists(ZkController.java:838)
[junit4] 2> at org.apache.solr.cloud.ZkSolrResourceLoader.openResource(ZkSolrResourceLoader.java:87)
[junit4] 2> ... 14 more
[junit4] 2> NOTE: test params are: codec=Asserting(Lucene54): {}, docValues:{}, sim=DefaultSimilarity, locale=id, timezone=America/Louisville
[junit4] 2> NOTE: Linux 3.13.0-52-generic amd64/Oracle Corporation 1.7.0_80 (64-bit)/cpus=4,threads=1,free=114810576,total=530579456
[junit4] 2> NOTE: All tests run in this JVM: [CoreAdminRequestStatusTest, MoreLikeThisHandlerTest, SpellingQueryConverterTest, TestChildDocTransformer, TestBlendedInfixSuggestions, OverseerCollectionConfigSetProcessorTest, DirectoryFactoryTest, TestPartialUpdateDeduplication, ZkSolrClientTest, SpellCheckComponentTest, TestBulkSchemaAPI, MultiThreadedOCPTest, FacetPivotSmallTest, SSLMigrationTest, TestRecoveryHdfs, CloneFieldUpdateProcessorFactoryTest, DocValuesMissingTest, SolrIndexSplitterTest, AnalyticsMergeStrategyTest, OverseerTaskQueueTest, TestWordDelimiterFilterFactory, TestMissingGroups, TestDefaultSearchFieldResource, WordBreakSolrSpellCheckerTest, TestEmbeddedSolrServerConstructors, TestReplicationHandlerBackup, TestBM25SimilarityFactory, UUIDUpdateProcessorFallbackTest, TestSchemaResource, TestCloudSchemaless, TestSchemaManager, TestOrdValues, OpenCloseCoreStressTest, SuggestComponentTest, UpdateRequestProcessorFactoryTest, TestQuerySenderListener, FileUtilsTest, ChaosMonkeySafeLeaderTest, TestAddFieldRealTimeGet, ShardRoutingCustomTest, CSVRequestHandlerTest, TestManagedSchemaFieldTypeResource, ResponseHeaderTest, TestTrie, TestPKIAuthenticationPlugin, TestMiniSolrCloudCluster, TestPivotHelperCode, ParsingFieldUpdateProcessorsTest, TestSerializedLuceneMatchVersion, TestBulkSchemaConcurrent, TestDistributedGrouping, MinimalSchemaTest, IndexBasedSpellCheckerTest, ZkControllerTest, RuleEngineTest, BlockJoinFacetDistribTest, TestQueryTypes, HdfsUnloadDistributedZkTest, SimplePostToolTest, TestRandomCollapseQParserPlugin, TestSolrConfigHandler, TestRawTransformer, FastVectorHighlighterTest, NumericFieldsTest, BasicFunctionalityTest, TestFiltering, DistribJoinFromCollectionTest, TestDFISimilarityFactory, SpellCheckCollatorTest, SolrInfoMBeanTest, LeaderInitiatedRecoveryOnCommitTest, VMParamsZkACLAndCredentialsProvidersTest, AsyncMigrateRouteKeyTest, SecurityConfHandlerTest, HighlighterMaxOffsetTest, SoftAutoCommitTest, TestQueryUtils, NotRequiredUniqueKeyTest, ZkCLITest, TestRTimerTree, TestFastLRUCache, TestConfigSetsAPI, TestSolrConfigHandlerCloud]
[junit4] 2> NOTE: download the large Jenkins line-docs file by running 'ant get-jenkins-line-docs' in the lucene directory.
[junit4] 2> NOTE: reproduce with: ant test -Dtestcase=TestSolrConfigHandlerCloud -Dtests.seed=6046A6E442C2D55F -Dtests.multiplier=2 -Dtests.nightly=true -Dtests.slow=true -Dtests.linedocsfile=/x1/jenkins/lucene-data/enwiki.random.lines.txt -Dtests.locale=id -Dtests.timezone=America/Louisville -Dtests.asserts=true -Dtests.file.encoding=US-ASCII
[junit4] ERROR 0.00s J1 | TestSolrConfigHandlerCloud (suite) <<<
[junit4] > Throwable #1: java.lang.AssertionError: ObjectTracker found 3 object(s) that were not released!!! [RawDirectoryWrapper, MDCAwareThreadPoolExecutor, RawDirectoryWrapper]
[junit4] > at __randomizedtesting.SeedInfo.seed([6046A6E442C2D55F]:0)
[junit4] > at org.apache.solr.SolrTestCaseJ4.afterClass(SolrTestCaseJ4.java:229)
[junit4] > at java.lang.Thread.run(Thread.java:745)
[junit4] Completed [336/566 (1!)] on J1 in 125.14s, 1 test, 1 failure <<< FAILURES!
[...truncated 724 lines...]
BUILD FAILED
/x1/jenkins/jenkins-slave/workspace/Lucene-Solr-NightlyTests-5.x/build.xml:757: The following error occurred while executing this line:
/x1/jenkins/jenkins-slave/workspace/Lucene-Solr-NightlyTests-5.x/build.xml:694: The following error occurred while executing this line:
/x1/jenkins/jenkins-slave/workspace/Lucene-Solr-NightlyTests-5.x/build.xml:59: The following error occurred while executing this line:
/x1/jenkins/jenkins-slave/workspace/Lucene-Solr-NightlyTests-5.x/solr/build.xml:233: The following error occurred while executing this line:
/x1/jenkins/jenkins-slave/workspace/Lucene-Solr-NightlyTests-5.x/solr/common-build.xml:534: The following error occurred while executing this line:
/x1/jenkins/jenkins-slave/workspace/Lucene-Solr-NightlyTests-5.x/lucene/common-build.xml:1444: The following error occurred while executing this line:
/x1/jenkins/jenkins-slave/workspace/Lucene-Solr-NightlyTests-5.x/lucene/common-build.xml:1000: There were test failures: 566 suites (7 ignored), 2266 tests, 1 suite-level error, 33 ignored (18 assumptions) [seed: 6046A6E442C2D55F]
Total time: 290 minutes 51 seconds
Build step 'Invoke Ant' marked build as failure
Archiving artifacts
Recording test results
Email was triggered for: Failure - Any
Sending email for trigger: Failure - Any