You are viewing a plain text version of this content. The canonical link for it is here.
Posted to dev@lucene.apache.org by Apache Hudson Server <hu...@hudson.apache.org> on 2011/03/25 22:31:38 UTC

[HUDSON] Lucene-Solr-tests-only-trunk - Build # 6351 - Still Failing

Build: https://hudson.apache.org/hudson/job/Lucene-Solr-tests-only-trunk/6351/

4 tests failed.
FAILED:  org.apache.solr.client.solrj.SolrExampleBinaryTest.testAugmentFields

Error Message:
java.lang.String cannot be cast to org.apache.solr.common.util.NamedList

Stack Trace:
java.lang.ClassCastException: java.lang.String cannot be cast to org.apache.solr.common.util.NamedList
	at org.apache.solr.client.solrj.SolrExampleTests.testAugmentFields(SolrExampleTests.java:427)
	at org.apache.lucene.util.LuceneTestCase$LuceneTestCaseRunner.runChild(LuceneTestCase.java:1215)
	at org.apache.lucene.util.LuceneTestCase$LuceneTestCaseRunner.runChild(LuceneTestCase.java:1147)


FAILED:  org.apache.solr.client.solrj.embedded.SolrExampleEmbeddedTest.testAugmentFields

Error Message:
java.lang.String cannot be cast to org.apache.solr.common.util.NamedList

Stack Trace:
java.lang.ClassCastException: java.lang.String cannot be cast to org.apache.solr.common.util.NamedList
	at org.apache.solr.client.solrj.SolrExampleTests.testAugmentFields(SolrExampleTests.java:427)
	at org.apache.lucene.util.LuceneTestCase$LuceneTestCaseRunner.runChild(LuceneTestCase.java:1215)
	at org.apache.lucene.util.LuceneTestCase$LuceneTestCaseRunner.runChild(LuceneTestCase.java:1147)


FAILED:  org.apache.solr.client.solrj.embedded.SolrExampleJettyTest.testAugmentFields

Error Message:
java.lang.String cannot be cast to org.apache.solr.common.util.NamedList

Stack Trace:
java.lang.ClassCastException: java.lang.String cannot be cast to org.apache.solr.common.util.NamedList
	at org.apache.solr.client.solrj.SolrExampleTests.testAugmentFields(SolrExampleTests.java:427)
	at org.apache.lucene.util.LuceneTestCase$LuceneTestCaseRunner.runChild(LuceneTestCase.java:1215)
	at org.apache.lucene.util.LuceneTestCase$LuceneTestCaseRunner.runChild(LuceneTestCase.java:1147)


FAILED:  org.apache.solr.client.solrj.embedded.SolrExampleStreamingTest.testAugmentFields

Error Message:
java.lang.String cannot be cast to org.apache.solr.common.util.NamedList

Stack Trace:
java.lang.ClassCastException: java.lang.String cannot be cast to org.apache.solr.common.util.NamedList
	at org.apache.solr.client.solrj.SolrExampleTests.testAugmentFields(SolrExampleTests.java:427)
	at org.apache.lucene.util.LuceneTestCase$LuceneTestCaseRunner.runChild(LuceneTestCase.java:1215)
	at org.apache.lucene.util.LuceneTestCase$LuceneTestCaseRunner.runChild(LuceneTestCase.java:1147)




Build Log (for compile errors):
[...truncated 8706 lines...]



---------------------------------------------------------------------
To unsubscribe, e-mail: dev-unsubscribe@lucene.apache.org
For additional commands, e-mail: dev-help@lucene.apache.org


[HUDSON] Lucene-Solr-tests-only-trunk - Build # 6356 - Still Failing

Posted by Apache Hudson Server <hu...@hudson.apache.org>.
Build: https://hudson.apache.org/hudson/job/Lucene-Solr-tests-only-trunk/6356/

No tests ran.

Build Log (for compile errors):
[...truncated 33 lines...]



---------------------------------------------------------------------
To unsubscribe, e-mail: dev-unsubscribe@lucene.apache.org
For additional commands, e-mail: dev-help@lucene.apache.org


[HUDSON] Lucene-Solr-tests-only-trunk - Build # 6355 - Still Failing

Posted by Apache Hudson Server <hu...@hudson.apache.org>.
Build: https://hudson.apache.org/hudson/job/Lucene-Solr-tests-only-trunk/6355/

No tests ran.

Build Log (for compile errors):
[...truncated 34 lines...]



---------------------------------------------------------------------
To unsubscribe, e-mail: dev-unsubscribe@lucene.apache.org
For additional commands, e-mail: dev-help@lucene.apache.org


[HUDSON] Lucene-Solr-tests-only-trunk - Build # 6354 - Still Failing

Posted by Apache Hudson Server <hu...@hudson.apache.org>.
Build: https://hudson.apache.org/hudson/job/Lucene-Solr-tests-only-trunk/6354/

No tests ran.

Build Log (for compile errors):
[...truncated 36 lines...]



---------------------------------------------------------------------
To unsubscribe, e-mail: dev-unsubscribe@lucene.apache.org
For additional commands, e-mail: dev-help@lucene.apache.org


[HUDSON] Lucene-Solr-tests-only-trunk - Build # 6353 - Still Failing

Posted by Apache Hudson Server <hu...@hudson.apache.org>.
Build: https://hudson.apache.org/hudson/job/Lucene-Solr-tests-only-trunk/6353/

No tests ran.

Build Log (for compile errors):
[...truncated 69 lines...]



---------------------------------------------------------------------
To unsubscribe, e-mail: dev-unsubscribe@lucene.apache.org
For additional commands, e-mail: dev-help@lucene.apache.org


[HUDSON] Lucene-Solr-tests-only-trunk - Build # 6352 - Still Failing

Posted by Apache Hudson Server <hu...@hudson.apache.org>.
Build: https://hudson.apache.org/hudson/job/Lucene-Solr-tests-only-trunk/6352/

No tests ran.

Build Log (for compile errors):
[...truncated 52 lines...]



---------------------------------------------------------------------
To unsubscribe, e-mail: dev-unsubscribe@lucene.apache.org
For additional commands, e-mail: dev-help@lucene.apache.org