You are viewing a plain text version of this content. The canonical link for it is here.
Posted to builds@cassandra.apache.org by Apache Jenkins Server <je...@builds.apache.org> on 2023/09/20 13:01:59 UTC
Build complete: Cassandra-5.0 #41 [UNSTABLE] 07768674acc5e5507ccb7d88270574c968f379b7
-------------------------------------------------------------------------------
Build Cassandra-5.0 #41 Still Unstable
URL: https://ci-cassandra.apache.org/job/Cassandra-5.0/41/
-------------------------------------------------------------------------------
Changes:
[Stefan Miklosovic] Enable 3rd party JDK installations for Debian package
-------------------------------------------------------------------------------
Failed Tests:
4 tests failed.
FAILED: dtest-large-novnode.consistency_test.TestAccuracy.test_network_topology_strategy_users
FAILED: dtest-novnode.secondary_indexes_test.TestPreJoinCallback.test_resume
FAILED: dtest-novnode.replication_test.TestSnitchConfigurationUpdate.test_rf_collapse_property_file_snitch
FAILED: org.apache.cassandra.utils.bytecomparable.ByteSourceComparisonTest.testPatitionerOrder-cassandra.testtag_IS_UNDEFINED
-------------------------------------------------------------------------------
For complete test report and logs see https://nightlies.apache.org/cassandra/Cassandra-5.0/41/