You are viewing a plain text version of this content. The canonical link for it is here.
Posted to builds@hbase.apache.org by Apache Jenkins Server <je...@builds.apache.org> on 2015/10/10 02:41:18 UTC
Build failed in Jenkins: HBase-1.2 » latest1.8,Hadoop #236
See <https://builds.apache.org/job/HBase-1.2/jdk=latest1.8,label=Hadoop/236/changes>
Changes:
[stack] HBASE-14584 TestNamespacesInstanceModel fails on jdk8; DISABLE TEST
------------------------------------------
[...truncated 53041 lines...]
"org.apache.hadoop.hdfs.server.blockmanagement.DecommissionManager$Monitor@7a7471ce" #42 daemon prio=5 os_prio=0 tid=0x00007fc0592b9000 nid=0x265 waiting on condition [0x00007fc00842f000]
java.lang.Thread.State: TIMED_WAITING (sleeping)
at java.lang.Thread.sleep(Native Method)
at org.apache.hadoop.hdfs.server.blockmanagement.DecommissionManager$Monitor.run(DecommissionManager.java:76)
at java.lang.Thread.run(Thread.java:745)
"org.apache.hadoop.hdfs.server.blockmanagement.PendingReplicationBlocks$PendingReplicationMonitor@132ddbab" #41 daemon prio=5 os_prio=0 tid=0x00007fc0592b7000 nid=0x264 waiting on condition [0x00007fc008530000]
java.lang.Thread.State: TIMED_WAITING (sleeping)
at java.lang.Thread.sleep(Native Method)
at org.apache.hadoop.hdfs.server.blockmanagement.PendingReplicationBlocks$PendingReplicationMonitor.run(PendingReplicationBlocks.java:221)
at java.lang.Thread.run(Thread.java:745)
"org.apache.hadoop.util.JvmPauseMonitor$Monitor@48c35007" #37 daemon prio=5 os_prio=0 tid=0x00007fc0592ab800 nid=0x25b waiting on condition [0x00007fc008732000]
java.lang.Thread.State: TIMED_WAITING (sleeping)
at java.lang.Thread.sleep(Native Method)
at org.apache.hadoop.util.JvmPauseMonitor$Monitor.run(JvmPauseMonitor.java:180)
at java.lang.Thread.run(Thread.java:745)
"IPC Server idle connection scanner for port 34313" #35 daemon prio=5 os_prio=0 tid=0x00007fc059257800 nid=0x244 in Object.wait() [0x00007fc008833000]
java.lang.Thread.State: TIMED_WAITING (on object monitor)
at java.lang.Object.wait(Native Method)
at java.util.TimerThread.mainLoop(Timer.java:552)
- locked <0x0000000715318f18> (a java.util.TaskQueue)
at java.util.TimerThread.run(Timer.java:505)
"Socket Reader #1 for port 34313" #34 prio=5 os_prio=0 tid=0x00007fc059259000 nid=0x243 runnable [0x00007fc008934000]
java.lang.Thread.State: RUNNABLE
at sun.nio.ch.EPollArrayWrapper.epollWait(Native Method)
at sun.nio.ch.EPollArrayWrapper.poll(EPollArrayWrapper.java:269)
at sun.nio.ch.EPollSelectorImpl.doSelect(EPollSelectorImpl.java:79)
at sun.nio.ch.SelectorImpl.lockAndDoSelect(SelectorImpl.java:86)
- locked <0x000000071531b930> (a sun.nio.ch.Util$2)
- locked <0x000000071531b920> (a java.util.Collections$UnmodifiableSet)
- locked <0x000000071531afd8> (a sun.nio.ch.EPollSelectorImpl)
at sun.nio.ch.SelectorImpl.select(SelectorImpl.java:97)
at sun.nio.ch.SelectorImpl.select(SelectorImpl.java:101)
at org.apache.hadoop.ipc.Server$Listener$Reader.doRunLoop(Server.java:616)
- locked <0x000000071531bf58> (a org.apache.hadoop.ipc.Server$Listener$Reader)
at org.apache.hadoop.ipc.Server$Listener$Reader.run(Server.java:595)
"Timer-0" #30 daemon prio=5 os_prio=0 tid=0x00007fc059141800 nid=0x237 in Object.wait() [0x00007fc008e35000]
java.lang.Thread.State: TIMED_WAITING (on object monitor)
at java.lang.Object.wait(Native Method)
at java.util.TimerThread.mainLoop(Timer.java:552)
- locked <0x000000071531d660> (a java.util.TaskQueue)
at java.util.TimerThread.run(Timer.java:505)
"1811922029@qtp-2024415090-1 - Acceptor0 HttpServer2$SelectChannelConnectorWithSafeStartup@localhost:43941" #29 daemon prio=5 os_prio=0 tid=0x00007fc05912f800 nid=0x233 runnable [0x00007fc008f36000]
java.lang.Thread.State: RUNNABLE
at sun.nio.ch.EPollArrayWrapper.epollWait(Native Method)
at sun.nio.ch.EPollArrayWrapper.poll(EPollArrayWrapper.java:269)
at sun.nio.ch.EPollSelectorImpl.doSelect(EPollSelectorImpl.java:79)
at sun.nio.ch.SelectorImpl.lockAndDoSelect(SelectorImpl.java:86)
- locked <0x000000071531e120> (a sun.nio.ch.Util$2)
- locked <0x000000071531e130> (a java.util.Collections$UnmodifiableSet)
- locked <0x000000071531e0d8> (a sun.nio.ch.EPollSelectorImpl)
at sun.nio.ch.SelectorImpl.select(SelectorImpl.java:97)
at org.mortbay.io.nio.SelectorManager$SelectSet.doSelect(SelectorManager.java:498)
at org.mortbay.io.nio.SelectorManager.doSelect(SelectorManager.java:192)
at org.mortbay.jetty.nio.SelectChannelConnector.accept(SelectChannelConnector.java:124)
at org.mortbay.jetty.AbstractConnector$Acceptor.run(AbstractConnector.java:708)
at org.mortbay.thread.QueuedThreadPool$PoolThread.run(QueuedThreadPool.java:582)
"1408695561@qtp-2024415090-0" #28 daemon prio=5 os_prio=0 tid=0x00007fc05912f000 nid=0x232 in Object.wait() [0x00007fc009f96000]
java.lang.Thread.State: TIMED_WAITING (on object monitor)
at java.lang.Object.wait(Native Method)
at org.mortbay.thread.QueuedThreadPool$PoolThread.run(QueuedThreadPool.java:626)
- locked <0x00000007154be4e0> (a org.mortbay.thread.QueuedThreadPool$PoolThread)
"Timer for 'NameNode' metrics system" #26 daemon prio=5 os_prio=0 tid=0x00007fc0590c5800 nid=0x21f in Object.wait() [0x00007fc009437000]
java.lang.Thread.State: TIMED_WAITING (on object monitor)
at java.lang.Object.wait(Native Method)
at java.util.TimerThread.mainLoop(Timer.java:552)
- locked <0x000000071102ef70> (a java.util.TaskQueue)
at java.util.TimerThread.run(Timer.java:505)
"Service Thread" #17 daemon prio=9 os_prio=0 tid=0x00007fc0582d7000 nid=0x7f8a runnable [0x0000000000000000]
java.lang.Thread.State: RUNNABLE
"C1 CompilerThread11" #16 daemon prio=9 os_prio=0 tid=0x00007fc0582d2000 nid=0x7f89 waiting on condition [0x0000000000000000]
java.lang.Thread.State: RUNNABLE
"C1 CompilerThread10" #15 daemon prio=9 os_prio=0 tid=0x00007fc0582d0000 nid=0x7f88 waiting on condition [0x0000000000000000]
java.lang.Thread.State: RUNNABLE
"C1 CompilerThread9" #14 daemon prio=9 os_prio=0 tid=0x00007fc0582cd800 nid=0x7f87 waiting on condition [0x0000000000000000]
java.lang.Thread.State: RUNNABLE
"C1 CompilerThread8" #13 daemon prio=9 os_prio=0 tid=0x00007fc0582cb800 nid=0x7f86 waiting on condition [0x0000000000000000]
java.lang.Thread.State: RUNNABLE
"C2 CompilerThread7" #12 daemon prio=9 os_prio=0 tid=0x00007fc0582c9800 nid=0x7f85 waiting on condition [0x0000000000000000]
java.lang.Thread.State: RUNNABLE
"C2 CompilerThread6" #11 daemon prio=9 os_prio=0 tid=0x00007fc0582c7800 nid=0x7f84 waiting on condition [0x0000000000000000]
java.lang.Thread.State: RUNNABLE
"C2 CompilerThread5" #10 daemon prio=9 os_prio=0 tid=0x00007fc0582c5000 nid=0x7f83 waiting on condition [0x0000000000000000]
java.lang.Thread.State: RUNNABLE
"C2 CompilerThread4" #9 daemon prio=9 os_prio=0 tid=0x00007fc0582bb000 nid=0x7f82 waiting on condition [0x0000000000000000]
java.lang.Thread.State: RUNNABLE
"C2 CompilerThread3" #8 daemon prio=9 os_prio=0 tid=0x00007fc0582b9000 nid=0x7f81 waiting on condition [0x0000000000000000]
java.lang.Thread.State: RUNNABLE
"C2 CompilerThread2" #7 daemon prio=9 os_prio=0 tid=0x00007fc0582b6800 nid=0x7f80 waiting on condition [0x0000000000000000]
java.lang.Thread.State: RUNNABLE
"C2 CompilerThread1" #6 daemon prio=9 os_prio=0 tid=0x00007fc0582b5000 nid=0x7f7f waiting on condition [0x0000000000000000]
java.lang.Thread.State: RUNNABLE
"C2 CompilerThread0" #5 daemon prio=9 os_prio=0 tid=0x00007fc0582b2000 nid=0x7f7e waiting on condition [0x0000000000000000]
java.lang.Thread.State: RUNNABLE
"Signal Dispatcher" #4 daemon prio=9 os_prio=0 tid=0x00007fc0582b0800 nid=0x7f7d runnable [0x0000000000000000]
java.lang.Thread.State: RUNNABLE
"Finalizer" #3 daemon prio=8 os_prio=0 tid=0x00007fc058279000 nid=0x7f7c in Object.wait() [0x00007fc015cdb000]
java.lang.Thread.State: WAITING (on object monitor)
at java.lang.Object.wait(Native Method)
at java.lang.ref.ReferenceQueue.remove(ReferenceQueue.java:143)
- locked <0x0000000711025e58> (a java.lang.ref.ReferenceQueue$Lock)
at java.lang.ref.ReferenceQueue.remove(ReferenceQueue.java:164)
at java.lang.ref.Finalizer$FinalizerThread.run(Finalizer.java:209)
"Reference Handler" #2 daemon prio=10 os_prio=0 tid=0x00007fc058276800 nid=0x7f7b in Object.wait() [0x00007fc015ddc000]
java.lang.Thread.State: WAITING (on object monitor)
at java.lang.Object.wait(Native Method)
at java.lang.Object.wait(Object.java:502)
at java.lang.ref.Reference$ReferenceHandler.run(Reference.java:157)
- locked <0x000000071102f138> (a java.lang.ref.Reference$Lock)
"main" #1 prio=5 os_prio=0 tid=0x00007fc05800a800 nid=0x7f6c in Object.wait() [0x00007fc061372000]
java.lang.Thread.State: WAITING (on object monitor)
at java.lang.Object.wait(Native Method)
at java.lang.Object.wait(Object.java:502)
at org.apache.hadoop.hbase.client.ResultBoundedCompletionService.take(ResultBoundedCompletionService.java:148)
- locked <0x0000000789b6d018> (a [Lorg.apache.hadoop.hbase.client.ResultBoundedCompletionService$QueueingFuture;)
at org.apache.hadoop.hbase.client.ScannerCallableWithReplicas.call(ScannerCallableWithReplicas.java:188)
at org.apache.hadoop.hbase.client.ScannerCallableWithReplicas.call(ScannerCallableWithReplicas.java:59)
at org.apache.hadoop.hbase.client.RpcRetryingCaller.callWithoutRetries(RpcRetryingCaller.java:200)
at org.apache.hadoop.hbase.client.ClientSmallReversedScanner.loadCache(ClientSmallReversedScanner.java:212)
at org.apache.hadoop.hbase.client.ClientSmallReversedScanner.next(ClientSmallReversedScanner.java:186)
at org.apache.hadoop.hbase.client.ConnectionManager$HConnectionImplementation.locateRegionInMeta(ConnectionManager.java:1272)
at org.apache.hadoop.hbase.client.ConnectionManager$HConnectionImplementation.locateRegion(ConnectionManager.java:1178)
at org.apache.hadoop.hbase.client.ConnectionManager$HConnectionImplementation.relocateRegion(ConnectionManager.java:1149)
at org.apache.hadoop.hbase.client.ConnectionManager$HConnectionImplementation.relocateRegion(ConnectionManager.java:1133)
at org.apache.hadoop.hbase.client.ConnectionManager$HConnectionImplementation.getRegionLocation(ConnectionManager.java:954)
at org.apache.hadoop.hbase.client.HRegionLocator.getRegionLocation(HRegionLocator.java:83)
at org.apache.hadoop.hbase.client.RegionServerCallable.prepare(RegionServerCallable.java:79)
at org.apache.hadoop.hbase.client.RpcRetryingCaller.callWithRetries(RpcRetryingCaller.java:124)
at org.apache.hadoop.hbase.ipc.RegionCoprocessorRpcChannel.callExecService(RegionCoprocessorRpcChannel.java:96)
at org.apache.hadoop.hbase.ipc.CoprocessorRpcChannel.callBlockingMethod(CoprocessorRpcChannel.java:73)
at org.apache.hadoop.hbase.protobuf.generated.AccessControlProtos$AccessControlService$BlockingStub.grant(AccessControlProtos.java:10280)
at org.apache.hadoop.hbase.protobuf.ProtobufUtil.grant(ProtobufUtil.java:2209)
at org.apache.hadoop.hbase.security.access.SecureTestUtil$8.call(SecureTestUtil.java:502)
at org.apache.hadoop.hbase.security.access.SecureTestUtil$8.call(SecureTestUtil.java:494)
at org.apache.hadoop.hbase.security.access.SecureTestUtil.updateACLs(SecureTestUtil.java:324)
at org.apache.hadoop.hbase.security.access.SecureTestUtil.grantOnTable(SecureTestUtil.java:494)
at org.apache.hadoop.hbase.security.access.TestCellACLs.testCoveringCheck(TestCellACLs.java:402)
at sun.reflect.NativeMethodAccessorImpl.invoke0(Native Method)
at sun.reflect.NativeMethodAccessorImpl.invoke(NativeMethodAccessorImpl.java:62)
at sun.reflect.DelegatingMethodAccessorImpl.invoke(DelegatingMethodAccessorImpl.java:43)
at java.lang.reflect.Method.invoke(Method.java:497)
at org.junit.runners.model.FrameworkMethod$1.runReflectiveCall(FrameworkMethod.java:50)
at org.junit.internal.runners.model.ReflectiveCallable.run(ReflectiveCallable.java:12)
at org.junit.runners.model.FrameworkMethod.invokeExplosively(FrameworkMethod.java:47)
at org.junit.internal.runners.statements.InvokeMethod.evaluate(InvokeMethod.java:17)
at org.junit.internal.runners.statements.RunBefores.evaluate(RunBefores.java:26)
at org.junit.internal.runners.statements.RunAfters.evaluate(RunAfters.java:27)
at org.junit.rules.TestWatcher$1.evaluate(TestWatcher.java:55)
at org.junit.rules.RunRules.evaluate(RunRules.java:20)
at org.junit.runners.ParentRunner.runLeaf(ParentRunner.java:325)
at org.junit.runners.BlockJUnit4ClassRunner.runChild(BlockJUnit4ClassRunner.java:78)
at org.junit.runners.BlockJUnit4ClassRunner.runChild(BlockJUnit4ClassRunner.java:57)
at org.junit.runners.ParentRunner$3.run(ParentRunner.java:290)
at org.junit.runners.ParentRunner$1.schedule(ParentRunner.java:71)
at org.junit.runners.ParentRunner.runChildren(ParentRunner.java:288)
at org.junit.runners.ParentRunner.access$000(ParentRunner.java:58)
at org.junit.runners.ParentRunner$2.evaluate(ParentRunner.java:268)
at org.junit.internal.runners.statements.RunBefores.evaluate(RunBefores.java:26)
at org.junit.internal.runners.statements.RunAfters.evaluate(RunAfters.java:27)
at org.junit.runners.ParentRunner.run(ParentRunner.java:363)
at org.junit.runners.Suite.runChild(Suite.java:128)
at org.junit.runners.Suite.runChild(Suite.java:27)
at org.junit.runners.ParentRunner$3.run(ParentRunner.java:290)
at org.junit.runners.ParentRunner$1.schedule(ParentRunner.java:71)
at org.junit.runners.ParentRunner.runChildren(ParentRunner.java:288)
at org.junit.runners.ParentRunner.access$000(ParentRunner.java:58)
at org.junit.runners.ParentRunner$2.evaluate(ParentRunner.java:268)
at org.junit.runners.ParentRunner.run(ParentRunner.java:363)
at org.junit.runner.JUnitCore.run(JUnitCore.java:137)
at org.junit.runner.JUnitCore.run(JUnitCore.java:115)
at org.apache.maven.surefire.junitcore.JUnitCoreWrapper.createRequestAndRun(JUnitCoreWrapper.java:108)
at org.apache.maven.surefire.junitcore.JUnitCoreWrapper.executeEager(JUnitCoreWrapper.java:78)
at org.apache.maven.surefire.junitcore.JUnitCoreWrapper.execute(JUnitCoreWrapper.java:54)
at org.apache.maven.surefire.junitcore.JUnitCoreProvider.invoke(JUnitCoreProvider.java:144)
at org.apache.maven.surefire.booter.ForkedBooter.invokeProviderInSameClassLoader(ForkedBooter.java:203)
at org.apache.maven.surefire.booter.ForkedBooter.runSuitesInProcess(ForkedBooter.java:155)
at org.apache.maven.surefire.booter.ForkedBooter.main(ForkedBooter.java:103)
"VM Thread" os_prio=0 tid=0x00007fc058271800 nid=0x7f7a runnable
"GC task thread#0 (ParallelGC)" os_prio=0 tid=0x00007fc05801f800 nid=0x7f6d runnable
"GC task thread#1 (ParallelGC)" os_prio=0 tid=0x00007fc058021800 nid=0x7f6e runnable
"GC task thread#2 (ParallelGC)" os_prio=0 tid=0x00007fc058023000 nid=0x7f6f runnable
"GC task thread#3 (ParallelGC)" os_prio=0 tid=0x00007fc058025000 nid=0x7f70 runnable
"GC task thread#4 (ParallelGC)" os_prio=0 tid=0x00007fc058026800 nid=0x7f71 runnable
"GC task thread#5 (ParallelGC)" os_prio=0 tid=0x00007fc058028800 nid=0x7f72 runnable
"GC task thread#6 (ParallelGC)" os_prio=0 tid=0x00007fc05802a000 nid=0x7f73 runnable
"GC task thread#7 (ParallelGC)" os_prio=0 tid=0x00007fc05802c000 nid=0x7f74 runnable
"GC task thread#8 (ParallelGC)" os_prio=0 tid=0x00007fc05802d800 nid=0x7f75 runnable
"GC task thread#9 (ParallelGC)" os_prio=0 tid=0x00007fc05802f800 nid=0x7f76 runnable
"GC task thread#10 (ParallelGC)" os_prio=0 tid=0x00007fc058031000 nid=0x7f77 runnable
"GC task thread#11 (ParallelGC)" os_prio=0 tid=0x00007fc058033000 nid=0x7f78 runnable
"GC task thread#12 (ParallelGC)" os_prio=0 tid=0x00007fc058034800 nid=0x7f79 runnable
"VM Periodic Task Thread" os_prio=0 tid=0x00007fc0582d9800 nid=0x7f8b waiting on condition
JNI global references: 293
+ echo '************ END zombies jstack extract'
************ END zombies jstack extract
+ JIRA_COMMENT='
{color:red}-1 core zombie tests{color}. There are 2 zombie test(s): at org.apache.hadoop.mapreduce.v2.TestMRAMWithNonNormalizedCapabilities.testJobWithNonNormalizedCapabilities(TestMRAMWithNonNormalizedCapabilities.java:103)
at org.apache.hadoop.hbase.security.access.TestCellACLs.testCoveringCheck(TestCellACLs.java:402)'
+ BAD=1
+ jps
+ grep surefirebooter
+ cut -d ' ' -f 1
+ xargs kill -9
POST BUILD TASK : SUCCESS
END OF POST BUILD TASK : 0
Archiving artifacts
Jenkins build is back to normal : HBase-1.2 » latest1.8,Hadoop #243
Posted by Apache Jenkins Server <je...@builds.apache.org>.
See <https://builds.apache.org/job/HBase-1.2/jdk=latest1.8,label=Hadoop/243/changes>
Build failed in Jenkins: HBase-1.2 » latest1.8,Hadoop #242
Posted by Apache Jenkins Server <je...@builds.apache.org>.
See <https://builds.apache.org/job/HBase-1.2/jdk=latest1.8,label=Hadoop/242/changes>
Changes:
[eclark] HBASE-14544 Allow HConnectionImpl to not refresh the dns on errors
[stack] HBASE-14582 Regionserver status webpage bucketcache list can become huge
[eclark] HBASE-14211 Add more rigorous integration tests of splits
[matteo.bertozzi] HBASE-14577 HBase shell help for scan and returning a column family has
[stack] HBASE-14587 Attach a test-sources.jar for hbase-server (Andrew Wang)
------------------------------------------
[...truncated 46721 lines...]
Running org.apache.hadoop.hbase.mapreduce.TestMultithreadedTableMapper
Tests run: 4, Failures: 0, Errors: 0, Skipped: 0, Time elapsed: 190.767 sec - in org.apache.hadoop.hbase.mapreduce.TestMultiTableSnapshotInputFormat
Java HotSpot(TM) 64-Bit Server VM warning: ignoring option MaxPermSize=256m; support was removed in 8.0
Running org.apache.hadoop.hbase.mapreduce.TestTimeRangeMapRed
Tests run: 1, Failures: 0, Errors: 0, Skipped: 0, Time elapsed: 133.376 sec - in org.apache.hadoop.hbase.mapreduce.TestMultithreadedTableMapper
Java HotSpot(TM) 64-Bit Server VM warning: ignoring option MaxPermSize=256m; support was removed in 8.0
Running org.apache.hadoop.hbase.mapreduce.TestSyncTable
Tests run: 7, Failures: 0, Errors: 0, Skipped: 0, Time elapsed: 271.98 sec - in org.apache.hadoop.hbase.mapreduce.TestTableInputFormatScan1
Java HotSpot(TM) 64-Bit Server VM warning: ignoring option MaxPermSize=256m; support was removed in 8.0
Tests run: 1, Failures: 0, Errors: 0, Skipped: 0, Time elapsed: 73.237 sec - in org.apache.hadoop.hbase.mapreduce.TestTimeRangeMapRed
Java HotSpot(TM) 64-Bit Server VM warning: ignoring option MaxPermSize=256m; support was removed in 8.0
Tests run: 12, Failures: 0, Errors: 0, Skipped: 0, Time elapsed: 461.437 sec - in org.apache.hadoop.hbase.mapreduce.TestImportExport
Java HotSpot(TM) 64-Bit Server VM warning: ignoring option MaxPermSize=256m; support was removed in 8.0
Java HotSpot(TM) 64-Bit Server VM warning: ignoring option MaxPermSize=256m; support was removed in 8.0
Running org.apache.hadoop.hbase.mapreduce.TestCopyTable
Running org.apache.hadoop.hbase.TestMetaTableAccessor
Running org.apache.hadoop.hbase.mapreduce.TestMultiTableInputFormat
Tests run: 13, Failures: 0, Errors: 0, Skipped: 0, Time elapsed: 14.529 sec - in org.apache.hadoop.hbase.TestMetaTableAccessor
Java HotSpot(TM) 64-Bit Server VM warning: ignoring option MaxPermSize=256m; support was removed in 8.0
Java HotSpot(TM) 64-Bit Server VM warning: ignoring option MaxPermSize=256m; support was removed in 8.0
Running org.apache.hadoop.hbase.io.TestFileLink
Tests run: 5, Failures: 0, Errors: 0, Skipped: 0, Time elapsed: 15.772 sec - in org.apache.hadoop.hbase.io.TestFileLink
Java HotSpot(TM) 64-Bit Server VM warning: ignoring option MaxPermSize=256m; support was removed in 8.0
Java HotSpot(TM) 64-Bit Server VM warning: ignoring option MaxPermSize=256m; support was removed in 8.0
Tests run: 1, Failures: 0, Errors: 0, Skipped: 0, Time elapsed: 103.442 sec - in org.apache.hadoop.hbase.mapreduce.TestSyncTable
Java HotSpot(TM) 64-Bit Server VM warning: ignoring option MaxPermSize=256m; support was removed in 8.0
Java HotSpot(TM) 64-Bit Server VM warning: ignoring option MaxPermSize=256m; support was removed in 8.0
Java HotSpot(TM) 64-Bit Server VM warning: ignoring option MaxPermSize=256m; support was removed in 8.0
Java HotSpot(TM) 64-Bit Server VM warning: ignoring option MaxPermSize=256m; support was removed in 8.0
Java HotSpot(TM) 64-Bit Server VM warning: ignoring option MaxPermSize=256m; support was removed in 8.0
Running org.apache.hadoop.hbase.io.hfile.TestHFileBlockIndex
Java HotSpot(TM) 64-Bit Server VM warning: ignoring option MaxPermSize=256m; support was removed in 8.0
Java HotSpot(TM) 64-Bit Server VM warning: ignoring option MaxPermSize=256m; support was removed in 8.0
Java HotSpot(TM) 64-Bit Server VM warning: ignoring option MaxPermSize=256m; support was removed in 8.0
Java HotSpot(TM) 64-Bit Server VM warning: ignoring option MaxPermSize=256m; support was removed in 8.0
Java HotSpot(TM) 64-Bit Server VM warning: ignoring option MaxPermSize=256m; support was removed in 8.0
Java HotSpot(TM) 64-Bit Server VM warning: ignoring option MaxPermSize=256m; support was removed in 8.0
Java HotSpot(TM) 64-Bit Server VM warning: ignoring option MaxPermSize=256m; support was removed in 8.0
Running org.apache.hadoop.hbase.io.hfile.TestScannerSelectionUsingTTL
Tests run: 10, Failures: 0, Errors: 0, Skipped: 0, Time elapsed: 9.1 sec - in org.apache.hadoop.hbase.io.hfile.TestHFileBlockIndex
Java HotSpot(TM) 64-Bit Server VM warning: ignoring option MaxPermSize=256m; support was removed in 8.0
Java HotSpot(TM) 64-Bit Server VM warning: ignoring option MaxPermSize=256m; support was removed in 8.0
Running org.apache.hadoop.hbase.io.hfile.TestHFileSeek
Tests run: 1, Failures: 0, Errors: 0, Skipped: 0, Time elapsed: 1.583 sec - in org.apache.hadoop.hbase.io.hfile.TestHFileSeek
Java HotSpot(TM) 64-Bit Server VM warning: ignoring option MaxPermSize=256m; support was removed in 8.0
Java HotSpot(TM) 64-Bit Server VM warning: ignoring option MaxPermSize=256m; support was removed in 8.0
Java HotSpot(TM) 64-Bit Server VM warning: ignoring option MaxPermSize=256m; support was removed in 8.0
Running org.apache.hadoop.hbase.io.hfile.TestHFileBlock
Tests run: 6, Failures: 0, Errors: 0, Skipped: 0, Time elapsed: 63.7 sec - in org.apache.hadoop.hbase.io.hfile.TestScannerSelectionUsingTTL
Java HotSpot(TM) 64-Bit Server VM warning: ignoring option MaxPermSize=256m; support was removed in 8.0
Java HotSpot(TM) 64-Bit Server VM warning: ignoring option MaxPermSize=256m; support was removed in 8.0
Java HotSpot(TM) 64-Bit Server VM warning: ignoring option MaxPermSize=256m; support was removed in 8.0
Java HotSpot(TM) 64-Bit Server VM warning: ignoring option MaxPermSize=256m; support was removed in 8.0
Java HotSpot(TM) 64-Bit Server VM warning: ignoring option MaxPermSize=256m; support was removed in 8.0
Java HotSpot(TM) 64-Bit Server VM warning: ignoring option MaxPermSize=256m; support was removed in 8.0
Java HotSpot(TM) 64-Bit Server VM warning: ignoring option MaxPermSize=256m; support was removed in 8.0
Java HotSpot(TM) 64-Bit Server VM warning: ignoring option MaxPermSize=256m; support was removed in 8.0
Running org.apache.hadoop.hbase.io.hfile.TestCacheConfig
Tests run: 6, Failures: 0, Errors: 0, Skipped: 0, Time elapsed: 1.752 sec - in org.apache.hadoop.hbase.io.hfile.TestCacheConfig
Java HotSpot(TM) 64-Bit Server VM warning: ignoring option MaxPermSize=256m; support was removed in 8.0
Java HotSpot(TM) 64-Bit Server VM warning: ignoring option MaxPermSize=256m; support was removed in 8.0
Java HotSpot(TM) 64-Bit Server VM warning: ignoring option MaxPermSize=256m; support was removed in 8.0
Java HotSpot(TM) 64-Bit Server VM warning: ignoring option MaxPermSize=256m; support was removed in 8.0
Java HotSpot(TM) 64-Bit Server VM warning: ignoring option MaxPermSize=256m; support was removed in 8.0
Java HotSpot(TM) 64-Bit Server VM warning: ignoring option MaxPermSize=256m; support was removed in 8.0
Running org.apache.hadoop.hbase.io.hfile.TestForceCacheImportantBlocks
Tests run: 8, Failures: 0, Errors: 0, Skipped: 0, Time elapsed: 367.279 sec - in org.apache.hadoop.hbase.mapreduce.TestTableSnapshotInputFormat
Java HotSpot(TM) 64-Bit Server VM warning: ignoring option MaxPermSize=256m; support was removed in 8.0
Running org.apache.hadoop.hbase.io.hfile.TestCacheOnWrite
Tests run: 28, Failures: 0, Errors: 0, Skipped: 0, Time elapsed: 92.913 sec - in org.apache.hadoop.hbase.io.hfile.TestHFileBlock
Java HotSpot(TM) 64-Bit Server VM warning: ignoring option MaxPermSize=256m; support was removed in 8.0
Java HotSpot(TM) 64-Bit Server VM warning: ignoring option MaxPermSize=256m; support was removed in 8.0
Java HotSpot(TM) 64-Bit Server VM warning: ignoring option MaxPermSize=256m; support was removed in 8.0
Java HotSpot(TM) 64-Bit Server VM warning: ignoring option MaxPermSize=256m; support was removed in 8.0
Running org.apache.hadoop.hbase.io.encoding.TestLoadAndSwitchEncodeOnDisk
Tests run: 5, Failures: 0, Errors: 0, Skipped: 0, Time elapsed: 161.209 sec - in org.apache.hadoop.hbase.mapreduce.TestCopyTable
Java HotSpot(TM) 64-Bit Server VM warning: ignoring option MaxPermSize=256m; support was removed in 8.0
Tests run: 4, Failures: 0, Errors: 0, Skipped: 0, Time elapsed: 36.096 sec - in org.apache.hadoop.hbase.io.hfile.TestForceCacheImportantBlocks
Java HotSpot(TM) 64-Bit Server VM warning: ignoring option MaxPermSize=256m; support was removed in 8.0
Running org.apache.hadoop.hbase.io.encoding.TestEncodedSeekers
Running org.apache.hadoop.hbase.io.encoding.TestChangingEncoding
Tests run: 4, Failures: 0, Errors: 0, Skipped: 0, Time elapsed: 161.302 sec - in org.apache.hadoop.hbase.mapreduce.TestMultiTableInputFormat
Java HotSpot(TM) 64-Bit Server VM warning: ignoring option MaxPermSize=256m; support was removed in 8.0
Running org.apache.hadoop.hbase.io.encoding.TestDataBlockEncoders
Tests run: 1, Failures: 0, Errors: 0, Skipped: 0, Time elapsed: 27.316 sec - in org.apache.hadoop.hbase.io.encoding.TestLoadAndSwitchEncodeOnDisk
Java HotSpot(TM) 64-Bit Server VM warning: ignoring option MaxPermSize=256m; support was removed in 8.0
Running org.apache.hadoop.hbase.io.encoding.TestBufferedDataBlockEncoder
Tests run: 1, Failures: 0, Errors: 0, Skipped: 0, Time elapsed: 13.722 sec - in org.apache.hadoop.hbase.io.encoding.TestBufferedDataBlockEncoder
Java HotSpot(TM) 64-Bit Server VM warning: ignoring option MaxPermSize=256m; support was removed in 8.0
Java HotSpot(TM) 64-Bit Server VM warning: ignoring option MaxPermSize=256m; support was removed in 8.0
Java HotSpot(TM) 64-Bit Server VM warning: ignoring option MaxPermSize=256m; support was removed in 8.0
Java HotSpot(TM) 64-Bit Server VM warning: ignoring option MaxPermSize=256m; support was removed in 8.0
Java HotSpot(TM) 64-Bit Server VM warning: ignoring option MaxPermSize=256m; support was removed in 8.0
Java HotSpot(TM) 64-Bit Server VM warning: ignoring option MaxPermSize=256m; support was removed in 8.0
Java HotSpot(TM) 64-Bit Server VM warning: ignoring option MaxPermSize=256m; support was removed in 8.0
Running org.apache.hadoop.hbase.filter.TestScanRowPrefix
Tests run: 1, Failures: 0, Errors: 0, Skipped: 0, Time elapsed: 5.3 sec - in org.apache.hadoop.hbase.filter.TestScanRowPrefix
Java HotSpot(TM) 64-Bit Server VM warning: ignoring option MaxPermSize=256m; support was removed in 8.0
Running org.apache.hadoop.hbase.filter.TestFilterWithScanLimits
Tests run: 1, Failures: 0, Errors: 0, Skipped: 0, Time elapsed: 3.878 sec - in org.apache.hadoop.hbase.filter.TestFilterWithScanLimits
Java HotSpot(TM) 64-Bit Server VM warning: ignoring option MaxPermSize=256m; support was removed in 8.0
Java HotSpot(TM) 64-Bit Server VM warning: ignoring option MaxPermSize=256m; support was removed in 8.0
Java HotSpot(TM) 64-Bit Server VM warning: ignoring option MaxPermSize=256m; support was removed in 8.0
Java HotSpot(TM) 64-Bit Server VM warning: ignoring option MaxPermSize=256m; support was removed in 8.0
Java HotSpot(TM) 64-Bit Server VM warning: ignoring option MaxPermSize=256m; support was removed in 8.0
Java HotSpot(TM) 64-Bit Server VM warning: ignoring option MaxPermSize=256m; support was removed in 8.0
Java HotSpot(TM) 64-Bit Server VM warning: ignoring option MaxPermSize=256m; support was removed in 8.0
Running org.apache.hadoop.hbase.filter.TestFilterWrapper
Tests run: 1, Failures: 0, Errors: 0, Skipped: 0, Time elapsed: 3.878 sec - in org.apache.hadoop.hbase.filter.TestFilterWrapper
Java HotSpot(TM) 64-Bit Server VM warning: ignoring option MaxPermSize=256m; support was removed in 8.0
Java HotSpot(TM) 64-Bit Server VM warning: ignoring option MaxPermSize=256m; support was removed in 8.0
Java HotSpot(TM) 64-Bit Server VM warning: ignoring option MaxPermSize=256m; support was removed in 8.0
Java HotSpot(TM) 64-Bit Server VM warning: ignoring option MaxPermSize=256m; support was removed in 8.0
Running org.apache.hadoop.hbase.filter.TestFuzzyRowFilterEndToEnd
Tests run: 72, Failures: 0, Errors: 0, Skipped: 0, Time elapsed: 128.272 sec - in org.apache.hadoop.hbase.io.hfile.TestCacheOnWrite
Java HotSpot(TM) 64-Bit Server VM warning: ignoring option MaxPermSize=256m; support was removed in 8.0
Java HotSpot(TM) 64-Bit Server VM warning: ignoring option MaxPermSize=256m; support was removed in 8.0
Java HotSpot(TM) 64-Bit Server VM warning: ignoring option MaxPermSize=256m; support was removed in 8.0
Java HotSpot(TM) 64-Bit Server VM warning: ignoring option MaxPermSize=256m; support was removed in 8.0
Java HotSpot(TM) 64-Bit Server VM warning: ignoring option MaxPermSize=256m; support was removed in 8.0
Java HotSpot(TM) 64-Bit Server VM warning: ignoring option MaxPermSize=256m; support was removed in 8.0
Java HotSpot(TM) 64-Bit Server VM warning: ignoring option MaxPermSize=256m; support was removed in 8.0
Java HotSpot(TM) 64-Bit Server VM warning: ignoring option MaxPermSize=256m; support was removed in 8.0
Java HotSpot(TM) 64-Bit Server VM warning: ignoring option MaxPermSize=256m; support was removed in 8.0
Running org.apache.hadoop.hbase.filter.TestColumnRangeFilter
Tests run: 20, Failures: 0, Errors: 0, Skipped: 0, Time elapsed: 119.35 sec - in org.apache.hadoop.hbase.io.encoding.TestEncodedSeekers
Java HotSpot(TM) 64-Bit Server VM warning: ignoring option MaxPermSize=256m; support was removed in 8.0
Java HotSpot(TM) 64-Bit Server VM warning: ignoring option MaxPermSize=256m; support was removed in 8.0
Java HotSpot(TM) 64-Bit Server VM warning: ignoring option MaxPermSize=256m; support was removed in 8.0
Java HotSpot(TM) 64-Bit Server VM warning: ignoring option MaxPermSize=256m; support was removed in 8.0
Java HotSpot(TM) 64-Bit Server VM warning: ignoring option MaxPermSize=256m; support was removed in 8.0
Tests run: 1, Failures: 0, Errors: 0, Skipped: 0, Time elapsed: 6.515 sec - in org.apache.hadoop.hbase.filter.TestColumnRangeFilter
Java HotSpot(TM) 64-Bit Server VM warning: ignoring option MaxPermSize=256m; support was removed in 8.0
Running org.apache.hadoop.hbase.filter.TestFuzzyRowAndColumnRangeFilter
Running org.apache.hadoop.hbase.filter.TestMultiRowRangeFilter
Tests run: 1, Failures: 0, Errors: 0, Skipped: 0, Time elapsed: 2.924 sec - in org.apache.hadoop.hbase.filter.TestFuzzyRowAndColumnRangeFilter
Tests run: 3, Failures: 0, Errors: 0, Skipped: 0, Time elapsed: 137.058 sec - in org.apache.hadoop.hbase.io.encoding.TestChangingEncoding
Tests run: 20, Failures: 0, Errors: 0, Skipped: 0, Time elapsed: 18.109 sec - in org.apache.hadoop.hbase.filter.TestMultiRowRangeFilter
Tests run: 28, Failures: 0, Errors: 0, Skipped: 0, Time elapsed: 210.597 sec - in org.apache.hadoop.hbase.io.encoding.TestDataBlockEncoders
Tests run: 2, Failures: 0, Errors: 0, Skipped: 0, Time elapsed: 215.603 sec - in org.apache.hadoop.hbase.filter.TestFuzzyRowFilterEndToEnd
Results :
Flaked tests:
org.apache.hadoop.hbase.master.TestTableLockManager.testReapAllTableLocks(org.apache.hadoop.hbase.master.TestTableLockManager)
Run 1: TestTableLockManager.testReapAllTableLocks:283 » LockTimeout Timed out acquiri...
Run 2: PASS
Tests run: 2529, Failures: 0, Errors: 0, Skipped: 57, Flakes: 1
[INFO] ------------------------------------------------------------------------
[INFO] Reactor Summary:
[INFO]
[INFO] Apache HBase ...................................... SUCCESS [1:07.164s]
[INFO] Apache HBase - Checkstyle ......................... SUCCESS [5.536s]
[INFO] Apache HBase - Resource Bundle .................... SUCCESS [0.162s]
[INFO] Apache HBase - Annotations ........................ SUCCESS [1.429s]
[INFO] Apache HBase - Protocol ........................... SUCCESS [18.334s]
[INFO] Apache HBase - Common ............................. SUCCESS [5:14.698s]
[INFO] Apache HBase - Procedure .......................... SUCCESS [1:53.277s]
[INFO] Apache HBase - Client ............................. SUCCESS [1:26.329s]
[INFO] Apache HBase - Hadoop Compatibility ............... SUCCESS [8.796s]
[INFO] Apache HBase - Hadoop Two Compatibility ........... SUCCESS [7.772s]
[INFO] Apache HBase - Prefix Tree ........................ SUCCESS [7.545s]
[INFO] Apache HBase - Server ............................. FAILURE [1:31:48.614s]
[INFO] Apache HBase - Testing Util ....................... SKIPPED
[INFO] Apache HBase - Thrift ............................. SKIPPED
[INFO] Apache HBase - Rest ............................... SKIPPED
[INFO] Apache HBase - Shell .............................. SKIPPED
[INFO] Apache HBase - Integration Tests .................. SKIPPED
[INFO] Apache HBase - Examples ........................... SKIPPED
[INFO] Apache HBase - External Block Cache ............... SKIPPED
[INFO] Apache HBase - Assembly ........................... SKIPPED
[INFO] Apache HBase - Shaded ............................. SKIPPED
[INFO] Apache HBase - Shaded - Client .................... SKIPPED
[INFO] Apache HBase - Shaded - Server .................... SKIPPED
[INFO] ------------------------------------------------------------------------
[INFO] BUILD FAILURE
[INFO] ------------------------------------------------------------------------
[INFO] Total time: 1:42:39.846s
[INFO] Finished at: Mon Oct 12 23:25:41 UTC 2015
[INFO] Final Memory: 451M/907M
[INFO] ------------------------------------------------------------------------
[ERROR] Failed to execute goal org.apache.maven.plugins:maven-surefire-plugin:2.18.1:test (secondPartTestsExecution) on project hbase-server: There was a timeout or other error in the fork -> [Help 1]
[ERROR]
[ERROR] To see the full stack trace of the errors, re-run Maven with the -e switch.
[ERROR] Re-run Maven using the -X switch to enable full debug logging.
[ERROR]
[ERROR] For more information about the errors and possible solutions, please read the following articles:
[ERROR] [Help 1] http://cwiki.apache.org/confluence/display/MAVEN/MojoFailureException
[ERROR]
[ERROR] After correcting the problems, you can resume the build with the command
[ERROR] mvn <goals> -rf :hbase-server
Build step 'Invoke top-level Maven targets' marked build as failure
Performing Post build task...
Match found for :.* : True
Logical operation result is TRUE
Running script : ZOMBIE_TESTS_COUNT=`jps | grep surefirebooter | wc -l`
if [[ $ZOMBIE_TESTS_COUNT != 0 ]] ; then
#It seems sometimes the tests are not dying immediately. Let's give them 10s
echo "Suspicious java process found - waiting 10s to see if there are just slow to stop"
sleep 10
ZOMBIE_TESTS_COUNT=`jps | grep surefirebooter | wc -l`
if [[ $ZOMBIE_TESTS_COUNT != 0 ]] ; then
echo "There are $ZOMBIE_TESTS_COUNT zombie tests, they should have been killed by surefire but survived"
echo "************ BEGIN zombies jstack extract"
ZB_STACK=`jps | grep surefirebooter | cut -d ' ' -f 1 | xargs -n 1 jstack | grep ".test" | grep "\.java"`
jps | grep surefirebooter | cut -d ' ' -f 1 | xargs -n 1 jstack
echo "************ END zombies jstack extract"
JIRA_COMMENT="$JIRA_COMMENT
{color:red}-1 core zombie tests{color}. There are ${ZOMBIE_TESTS_COUNT} zombie test(s): ${ZB_STACK}"
BAD=1
jps | grep surefirebooter | cut -d ' ' -f 1 | xargs kill -9
else
echo "We're ok: there is no zombie test, but some tests took some time to stop"
fi
else
echo "We're ok: there is no zombie test"
fi
[Hadoop] $ /bin/bash -xe /tmp/hudson5632173649251470752.sh
++ jps
++ wc -l
++ grep surefirebooter
+ ZOMBIE_TESTS_COUNT=2
+ [[ 2 != 0 ]]
+ echo 'Suspicious java process found - waiting 10s to see if there are just slow to stop'
Suspicious java process found - waiting 10s to see if there are just slow to stop
+ sleep 10
++ jps
++ grep surefirebooter
++ wc -l
+ ZOMBIE_TESTS_COUNT=2
+ [[ 2 != 0 ]]
+ echo 'There are 2 zombie tests, they should have been killed by surefire but survived'
There are 2 zombie tests, they should have been killed by surefire but survived
+ echo '************ BEGIN zombies jstack extract'
************ BEGIN zombies jstack extract
++ jps
++ cut -d ' ' -f 1
++ xargs -n 1 jstack
++ grep '\.java'
++ grep surefirebooter
++ grep .test
+ ZB_STACK=
POST BUILD TASK : FAILURE
END OF POST BUILD TASK : 0
Archiving artifacts
Build failed in Jenkins: HBase-1.2 » latest1.8,Hadoop #241
Posted by Apache Jenkins Server <je...@builds.apache.org>.
See <https://builds.apache.org/job/HBase-1.2/jdk=latest1.8,label=Hadoop/241/changes>
Changes:
[eclark] HBASE-14585 Clean up TestSnapshotCloneIndependence
------------------------------------------
[...truncated 46553 lines...]
[INFO] Finished at: Mon Oct 12 20:30:30 UTC 2015
[INFO] Final Memory: 454M/673M
[INFO] ------------------------------------------------------------------------
[ERROR] Failed to execute goal org.apache.maven.plugins:maven-surefire-plugin:2.18.1:test (secondPartTestsExecution) on project hbase-server: There was a timeout or other error in the fork -> [Help 1]
[ERROR]
[ERROR] To see the full stack trace of the errors, re-run Maven with the -e switch.
[ERROR] Re-run Maven using the -X switch to enable full debug logging.
[ERROR]
[ERROR] For more information about the errors and possible solutions, please read the following articles:
[ERROR] [Help 1] http://cwiki.apache.org/confluence/display/MAVEN/MojoFailureException
[ERROR]
[ERROR] After correcting the problems, you can resume the build with the command
[ERROR] mvn <goals> -rf :hbase-server
Build step 'Invoke top-level Maven targets' marked build as failure
Performing Post build task...
Match found for :.* : True
Logical operation result is TRUE
Running script : ZOMBIE_TESTS_COUNT=`jps | grep surefirebooter | wc -l`
if [[ $ZOMBIE_TESTS_COUNT != 0 ]] ; then
#It seems sometimes the tests are not dying immediately. Let's give them 10s
echo "Suspicious java process found - waiting 10s to see if there are just slow to stop"
sleep 10
ZOMBIE_TESTS_COUNT=`jps | grep surefirebooter | wc -l`
if [[ $ZOMBIE_TESTS_COUNT != 0 ]] ; then
echo "There are $ZOMBIE_TESTS_COUNT zombie tests, they should have been killed by surefire but survived"
echo "************ BEGIN zombies jstack extract"
ZB_STACK=`jps | grep surefirebooter | cut -d ' ' -f 1 | xargs -n 1 jstack | grep ".test" | grep "\.java"`
jps | grep surefirebooter | cut -d ' ' -f 1 | xargs -n 1 jstack
echo "************ END zombies jstack extract"
JIRA_COMMENT="$JIRA_COMMENT
{color:red}-1 core zombie tests{color}. There are ${ZOMBIE_TESTS_COUNT} zombie test(s): ${ZB_STACK}"
BAD=1
jps | grep surefirebooter | cut -d ' ' -f 1 | xargs kill -9
else
echo "We're ok: there is no zombie test, but some tests took some time to stop"
fi
else
echo "We're ok: there is no zombie test"
fi
[Hadoop] $ /bin/bash -xe /tmp/hudson5995356686362007419.sh
++ jps
++ grep surefirebooter
++ wc -l
+ ZOMBIE_TESTS_COUNT=2
+ [[ 2 != 0 ]]
+ echo 'Suspicious java process found - waiting 10s to see if there are just slow to stop'
Suspicious java process found - waiting 10s to see if there are just slow to stop
+ sleep 10
++ jps
++ grep surefirebooter
++ wc -l
+ ZOMBIE_TESTS_COUNT=1
+ [[ 1 != 0 ]]
+ echo 'There are 1 zombie tests, they should have been killed by surefire but survived'
There are 1 zombie tests, they should have been killed by surefire but survived
+ echo '************ BEGIN zombies jstack extract'
************ BEGIN zombies jstack extract
++ jps
++ grep surefirebooter
++ cut -d ' ' -f 1
++ xargs -n 1 jstack
++ grep '\.java'
++ grep .test
+ ZB_STACK=' at org.apache.hadoop.hdfs.web.TestWebHdfsTokens.testLazyTokenFetchForSWebhdfs(TestWebHdfsTokens.java:223)'
+ jps
+ grep surefirebooter
+ cut -d ' ' -f 1
+ xargs -n 1 jstack
2015-10-12 20:30:43
Full thread dump Java HotSpot(TM) 64-Bit Server VM (24.55-b03 mixed mode):
"Attach Listener" daemon prio=10 tid=0x00007f99c4001000 nid=0x21f0 waiting on condition [0x0000000000000000]
java.lang.Thread.State: RUNNABLE
"Truststore reloader thread" daemon prio=10 tid=0x00007f99bc421800 nid=0x21ce runnable [0x00007f99c2120000]
java.lang.Thread.State: RUNNABLE
at java.lang.ThreadLocal.createMap(ThreadLocal.java:225)
at java.lang.ThreadLocal.setInitialValue(ThreadLocal.java:166)
at java.lang.ThreadLocal.get(ThreadLocal.java:150)
at java.lang.StringCoding.deref(StringCoding.java:63)
at java.lang.StringCoding.encode(StringCoding.java:330)
at java.lang.String.getBytes(String.java:916)
at java.io.UnixFileSystem.getBooleanAttributes0(Native Method)
at java.io.UnixFileSystem.getBooleanAttributes(UnixFileSystem.java:242)
at java.io.File.exists(File.java:813)
at org.apache.hadoop.security.ssl.ReloadingX509TrustManager.needsReload(ReloadingX509TrustManager.java:149)
at org.apache.hadoop.security.ssl.ReloadingX509TrustManager.run(ReloadingX509TrustManager.java:193)
at java.lang.Thread.run(Thread.java:745)
"Truststore reloader thread" daemon prio=10 tid=0x00007f99bc427000 nid=0x21cd waiting on condition [0x00007f99c2222000]
java.lang.Thread.State: TIMED_WAITING (sleeping)
at java.lang.Thread.sleep(Native Method)
at org.apache.hadoop.security.ssl.ReloadingX509TrustManager.run(ReloadingX509TrustManager.java:189)
at java.lang.Thread.run(Thread.java:745)
"Truststore reloader thread" daemon prio=10 tid=0x00007f99bc41f800 nid=0x21cb waiting on condition [0x00007f99c2323000]
java.lang.Thread.State: TIMED_WAITING (sleeping)
at java.lang.Thread.sleep(Native Method)
at org.apache.hadoop.security.ssl.ReloadingX509TrustManager.run(ReloadingX509TrustManager.java:189)
at java.lang.Thread.run(Thread.java:745)
"Truststore reloader thread" daemon prio=10 tid=0x00007f99bc2f0000 nid=0x217f waiting on condition [0x00007f99c2424000]
java.lang.Thread.State: TIMED_WAITING (sleeping)
at java.lang.Thread.sleep(Native Method)
at org.apache.hadoop.security.ssl.ReloadingX509TrustManager.run(ReloadingX509TrustManager.java:189)
at java.lang.Thread.run(Thread.java:745)
"org.apache.hadoop.fs.FileSystem$Statistics$StatisticsDataReferenceCleaner" daemon prio=10 tid=0x00007f99bc0c7000 nid=0x217e in Object.wait() [0x00007f99c2999000]
java.lang.Thread.State: WAITING (on object monitor)
at java.lang.Object.wait(Native Method)
- waiting on <0x00000007e12a8068> (a java.lang.ref.ReferenceQueue$Lock)
at java.lang.ref.ReferenceQueue.remove(ReferenceQueue.java:135)
- locked <0x00000007e12a8068> (a java.lang.ref.ReferenceQueue$Lock)
at java.lang.ref.ReferenceQueue.remove(ReferenceQueue.java:151)
at org.apache.hadoop.fs.FileSystem$Statistics$StatisticsDataReferenceCleaner.run(FileSystem.java:3101)
at java.lang.Thread.run(Thread.java:745)
"process reaper" daemon prio=10 tid=0x00007f99d4941800 nid=0x2179 waiting on condition [0x00007f99c2efb000]
java.lang.Thread.State: TIMED_WAITING (parking)
at sun.misc.Unsafe.park(Native Method)
- parking to wait for <0x00000007e12b0078> (a java.util.concurrent.SynchronousQueue$TransferStack)
at java.util.concurrent.locks.LockSupport.parkNanos(LockSupport.java:226)
at java.util.concurrent.SynchronousQueue$TransferStack.awaitFulfill(SynchronousQueue.java:460)
at java.util.concurrent.SynchronousQueue$TransferStack.transfer(SynchronousQueue.java:359)
at java.util.concurrent.SynchronousQueue.poll(SynchronousQueue.java:942)
at java.util.concurrent.ThreadPoolExecutor.getTask(ThreadPoolExecutor.java:1068)
at java.util.concurrent.ThreadPoolExecutor.runWorker(ThreadPoolExecutor.java:1130)
at java.util.concurrent.ThreadPoolExecutor$Worker.run(ThreadPoolExecutor.java:615)
at java.lang.Thread.run(Thread.java:745)
"Service Thread" daemon prio=10 tid=0x00007f99d4291000 nid=0x2176 runnable [0x0000000000000000]
java.lang.Thread.State: RUNNABLE
"C2 CompilerThread1" daemon prio=10 tid=0x00007f99d428e800 nid=0x2175 waiting on condition [0x0000000000000000]
java.lang.Thread.State: RUNNABLE
"C2 CompilerThread0" daemon prio=10 tid=0x00007f99d428b800 nid=0x2174 runnable [0x0000000000000000]
java.lang.Thread.State: RUNNABLE
"Signal Dispatcher" daemon prio=10 tid=0x00007f99d4281800 nid=0x2173 runnable [0x0000000000000000]
java.lang.Thread.State: RUNNABLE
"Finalizer" daemon prio=10 tid=0x00007f99d426b000 nid=0x2172 in Object.wait() [0x00007f99c8378000]
java.lang.Thread.State: WAITING (on object monitor)
at java.lang.Object.wait(Native Method)
- waiting on <0x00000007e1281e70> (a java.lang.ref.ReferenceQueue$Lock)
at java.lang.ref.ReferenceQueue.remove(ReferenceQueue.java:135)
- locked <0x00000007e1281e70> (a java.lang.ref.ReferenceQueue$Lock)
at java.lang.ref.ReferenceQueue.remove(ReferenceQueue.java:151)
at java.lang.ref.Finalizer$FinalizerThread.run(Finalizer.java:189)
"Reference Handler" daemon prio=10 tid=0x00007f99d4267000 nid=0x2171 in Object.wait() [0x00007f99c8479000]
java.lang.Thread.State: WAITING (on object monitor)
at java.lang.Object.wait(Native Method)
- waiting on <0x00000007e1281830> (a java.lang.ref.Reference$Lock)
at java.lang.Object.wait(Object.java:503)
at java.lang.ref.Reference$ReferenceHandler.run(Reference.java:133)
- locked <0x00000007e1281830> (a java.lang.ref.Reference$Lock)
"main" prio=10 tid=0x00007f99d400a000 nid=0x2162 runnable [0x00007f99dc538000]
java.lang.Thread.State: RUNNABLE
at sun.misc.Unsafe.putOrderedObject(Native Method)
at java.util.concurrent.ConcurrentHashMap.setEntryAt(ConcurrentHashMap.java:316)
at java.util.concurrent.ConcurrentHashMap$Segment.put(ConcurrentHashMap.java:462)
at java.util.concurrent.ConcurrentHashMap.putIfAbsent(ConcurrentHashMap.java:1150)
at java.lang.ClassLoader.getClassLoadingLock(ClassLoader.java:464)
at java.lang.ClassLoader.loadClass(ClassLoader.java:405)
at java.lang.ClassLoader.loadClass(ClassLoader.java:412)
- locked <0x00000007e12c0638> (a java.lang.Object)
at sun.misc.Launcher$AppClassLoader.loadClass(Launcher.java:308)
at java.lang.ClassLoader.loadClass(ClassLoader.java:358)
at org.apache.hadoop.hdfs.server.namenode.NameNode.createNameNode(NameNode.java:1451)
at org.apache.hadoop.hdfs.MiniDFSCluster.createNameNode(MiniDFSCluster.java:1155)
at org.apache.hadoop.hdfs.MiniDFSCluster.createNameNodesAndSetConf(MiniDFSCluster.java:1030)
at org.apache.hadoop.hdfs.MiniDFSCluster.initMiniDFSCluster(MiniDFSCluster.java:820)
at org.apache.hadoop.hdfs.MiniDFSCluster.<init>(MiniDFSCluster.java:479)
at org.apache.hadoop.hdfs.MiniDFSCluster$Builder.build(MiniDFSCluster.java:438)
at org.apache.hadoop.hdfs.web.TestWebHdfsTokens.testLazyTokenFetchForSWebhdfs(TestWebHdfsTokens.java:223)
at sun.reflect.NativeMethodAccessorImpl.invoke0(Native Method)
at sun.reflect.NativeMethodAccessorImpl.invoke(NativeMethodAccessorImpl.java:57)
at sun.reflect.DelegatingMethodAccessorImpl.invoke(DelegatingMethodAccessorImpl.java:43)
at java.lang.reflect.Method.invoke(Method.java:606)
at org.junit.runners.model.FrameworkMethod$1.runReflectiveCall(FrameworkMethod.java:47)
at org.junit.internal.runners.model.ReflectiveCallable.run(ReflectiveCallable.java:12)
at org.junit.runners.model.FrameworkMethod.invokeExplosively(FrameworkMethod.java:44)
at org.junit.internal.runners.statements.InvokeMethod.evaluate(InvokeMethod.java:17)
at org.junit.runners.ParentRunner.runLeaf(ParentRunner.java:271)
at org.junit.runners.BlockJUnit4ClassRunner.runChild(BlockJUnit4ClassRunner.java:70)
at org.junit.runners.BlockJUnit4ClassRunner.runChild(BlockJUnit4ClassRunner.java:50)
at org.junit.runners.ParentRunner$3.run(ParentRunner.java:238)
at org.junit.runners.ParentRunner$1.schedule(ParentRunner.java:63)
at org.junit.runners.ParentRunner.runChildren(ParentRunner.java:236)
at org.junit.runners.ParentRunner.access$000(ParentRunner.java:53)
at org.junit.runners.ParentRunner$2.evaluate(ParentRunner.java:229)
at org.junit.internal.runners.statements.RunBefores.evaluate(RunBefores.java:26)
at org.junit.runners.ParentRunner.run(ParentRunner.java:309)
at org.apache.maven.surefire.junit4.JUnit4Provider.execute(JUnit4Provider.java:264)
at org.apache.maven.surefire.junit4.JUnit4Provider.executeTestSet(JUnit4Provider.java:153)
at org.apache.maven.surefire.junit4.JUnit4Provider.invoke(JUnit4Provider.java:124)
at org.apache.maven.surefire.booter.ForkedBooter.invokeProviderInSameClassLoader(ForkedBooter.java:200)
at org.apache.maven.surefire.booter.ForkedBooter.runSuitesInProcess(ForkedBooter.java:153)
at org.apache.maven.surefire.booter.ForkedBooter.main(ForkedBooter.java:103)
"VM Thread" prio=10 tid=0x00007f99d4264800 nid=0x2170 runnable
"GC task thread#0 (ParallelGC)" prio=10 tid=0x00007f99d4020000 nid=0x2163 runnable
"GC task thread#1 (ParallelGC)" prio=10 tid=0x00007f99d4022000 nid=0x2164 runnable
"GC task thread#2 (ParallelGC)" prio=10 tid=0x00007f99d4023800 nid=0x2165 runnable
"GC task thread#3 (ParallelGC)" prio=10 tid=0x00007f99d4025800 nid=0x2166 runnable
"GC task thread#4 (ParallelGC)" prio=10 tid=0x00007f99d4027800 nid=0x2167 runnable
"GC task thread#5 (ParallelGC)" prio=10 tid=0x00007f99d4029800 nid=0x2168 runnable
"GC task thread#6 (ParallelGC)" prio=10 tid=0x00007f99d402b000 nid=0x2169 runnable
"GC task thread#7 (ParallelGC)" prio=10 tid=0x00007f99d402d000 nid=0x216a runnable
"GC task thread#8 (ParallelGC)" prio=10 tid=0x00007f99d402f000 nid=0x216b runnable
"GC task thread#9 (ParallelGC)" prio=10 tid=0x00007f99d4030800 nid=0x216c runnable
"GC task thread#10 (ParallelGC)" prio=10 tid=0x00007f99d4032800 nid=0x216d runnable
"GC task thread#11 (ParallelGC)" prio=10 tid=0x00007f99d4034800 nid=0x216e runnable
"GC task thread#12 (ParallelGC)" prio=10 tid=0x00007f99d4036800 nid=0x216f runnable
"VM Periodic Task Thread" prio=10 tid=0x00007f99d429b800 nid=0x2177 waiting on condition
JNI global references: 158
+ echo '************ END zombies jstack extract'
************ END zombies jstack extract
+ JIRA_COMMENT='
{color:red}-1 core zombie tests{color}. There are 1 zombie test(s): at org.apache.hadoop.hdfs.web.TestWebHdfsTokens.testLazyTokenFetchForSWebhdfs(TestWebHdfsTokens.java:223)'
+ BAD=1
+ jps
+ grep surefirebooter
+ cut -d ' ' -f 1
+ xargs kill -9
POST BUILD TASK : SUCCESS
END OF POST BUILD TASK : 0
Archiving artifacts
Build failed in Jenkins: HBase-1.2 » latest1.8,Hadoop #240
Posted by Apache Jenkins Server <je...@builds.apache.org>.
See <https://builds.apache.org/job/HBase-1.2/jdk=latest1.8,label=Hadoop/240/>
------------------------------------------
[...truncated 49067 lines...]
at sun.nio.ch.EPollSelectorImpl.doSelect(EPollSelectorImpl.java:79)
at sun.nio.ch.SelectorImpl.lockAndDoSelect(SelectorImpl.java:86)
- locked <0x0000000715343c08> (a sun.nio.ch.Util$2)
- locked <0x0000000715343bf8> (a java.util.Collections$UnmodifiableSet)
- locked <0x00000007153437d0> (a sun.nio.ch.EPollSelectorImpl)
at sun.nio.ch.SelectorImpl.select(SelectorImpl.java:97)
at sun.nio.ch.SelectorImpl.select(SelectorImpl.java:101)
at org.apache.hadoop.ipc.Server$Listener.run(Server.java:668)
"IPC Server Responder" #36 daemon prio=5 os_prio=0 tid=0x00007f9ff52c6000 nid=0x7dac runnable [0x00007f9fb5511000]
java.lang.Thread.State: RUNNABLE
at sun.nio.ch.EPollArrayWrapper.epollWait(Native Method)
at sun.nio.ch.EPollArrayWrapper.poll(EPollArrayWrapper.java:269)
at sun.nio.ch.EPollSelectorImpl.doSelect(EPollSelectorImpl.java:79)
at sun.nio.ch.SelectorImpl.lockAndDoSelect(SelectorImpl.java:86)
- locked <0x00000007153458c0> (a sun.nio.ch.Util$2)
- locked <0x00000007153458b0> (a java.util.Collections$UnmodifiableSet)
- locked <0x0000000715345798> (a sun.nio.ch.EPollSelectorImpl)
at sun.nio.ch.SelectorImpl.select(SelectorImpl.java:97)
at org.apache.hadoop.ipc.Server$Responder.doRunLoop(Server.java:835)
at org.apache.hadoop.ipc.Server$Responder.run(Server.java:818)
"org.apache.hadoop.hdfs.server.blockmanagement.BlockManager$ReplicationMonitor@6ff65192" #31 daemon prio=5 os_prio=0 tid=0x00007f9ff52b9000 nid=0x7dab waiting on condition [0x00007f9fb510d000]
java.lang.Thread.State: TIMED_WAITING (sleeping)
at java.lang.Thread.sleep(Native Method)
at org.apache.hadoop.hdfs.server.blockmanagement.BlockManager$ReplicationMonitor.run(BlockManager.java:3397)
at java.lang.Thread.run(Thread.java:745)
"org.apache.hadoop.hdfs.server.blockmanagement.HeartbeatManager$Monitor@2dd80673" #32 daemon prio=5 os_prio=0 tid=0x00007f9ff52b7000 nid=0x7daa waiting on condition [0x00007f9fb520e000]
java.lang.Thread.State: TIMED_WAITING (sleeping)
at java.lang.Thread.sleep(Native Method)
at org.apache.hadoop.hdfs.server.blockmanagement.HeartbeatManager$Monitor.run(HeartbeatManager.java:319)
at java.lang.Thread.run(Thread.java:745)
"org.apache.hadoop.hdfs.server.blockmanagement.DecommissionManager$Monitor@7a7471ce" #42 daemon prio=5 os_prio=0 tid=0x00007f9ff52b6000 nid=0x7da9 waiting on condition [0x00007f9fb530f000]
java.lang.Thread.State: TIMED_WAITING (sleeping)
at java.lang.Thread.sleep(Native Method)
at org.apache.hadoop.hdfs.server.blockmanagement.DecommissionManager$Monitor.run(DecommissionManager.java:76)
at java.lang.Thread.run(Thread.java:745)
"org.apache.hadoop.hdfs.server.blockmanagement.PendingReplicationBlocks$PendingReplicationMonitor@132ddbab" #41 daemon prio=5 os_prio=0 tid=0x00007f9ff52b3800 nid=0x7da8 waiting on condition [0x00007f9fb5410000]
java.lang.Thread.State: TIMED_WAITING (sleeping)
at java.lang.Thread.sleep(Native Method)
at org.apache.hadoop.hdfs.server.blockmanagement.PendingReplicationBlocks$PendingReplicationMonitor.run(PendingReplicationBlocks.java:221)
at java.lang.Thread.run(Thread.java:745)
"org.apache.hadoop.util.JvmPauseMonitor$Monitor@48c35007" #37 daemon prio=5 os_prio=0 tid=0x00007f9ff52a8800 nid=0x7da2 waiting on condition [0x00007f9fb5612000]
java.lang.Thread.State: TIMED_WAITING (sleeping)
at java.lang.Thread.sleep(Native Method)
at org.apache.hadoop.util.JvmPauseMonitor$Monitor.run(JvmPauseMonitor.java:180)
at java.lang.Thread.run(Thread.java:745)
"IPC Server idle connection scanner for port 53475" #35 daemon prio=5 os_prio=0 tid=0x00007f9ff5288000 nid=0x7da1 in Object.wait() [0x00007f9fb5713000]
java.lang.Thread.State: TIMED_WAITING (on object monitor)
at java.lang.Object.wait(Native Method)
at java.util.TimerThread.mainLoop(Timer.java:552)
- locked <0x0000000715342ec8> (a java.util.TaskQueue)
at java.util.TimerThread.run(Timer.java:505)
"Socket Reader #1 for port 53475" #34 prio=5 os_prio=0 tid=0x00007f9ff5286800 nid=0x7da0 runnable [0x00007f9fb5814000]
java.lang.Thread.State: RUNNABLE
at sun.nio.ch.EPollArrayWrapper.epollWait(Native Method)
at sun.nio.ch.EPollArrayWrapper.poll(EPollArrayWrapper.java:269)
at sun.nio.ch.EPollSelectorImpl.doSelect(EPollSelectorImpl.java:79)
at sun.nio.ch.SelectorImpl.lockAndDoSelect(SelectorImpl.java:86)
- locked <0x0000000715342c08> (a sun.nio.ch.Util$2)
- locked <0x0000000715342bf8> (a java.util.Collections$UnmodifiableSet)
- locked <0x0000000714b32e08> (a sun.nio.ch.EPollSelectorImpl)
at sun.nio.ch.SelectorImpl.select(SelectorImpl.java:97)
at sun.nio.ch.SelectorImpl.select(SelectorImpl.java:101)
at org.apache.hadoop.ipc.Server$Listener$Reader.doRunLoop(Server.java:616)
- locked <0x0000000715343ed0> (a org.apache.hadoop.ipc.Server$Listener$Reader)
at org.apache.hadoop.ipc.Server$Listener$Reader.run(Server.java:595)
"Timer-0" #30 daemon prio=5 os_prio=0 tid=0x00007f9ff513e800 nid=0x7d93 in Object.wait() [0x00007f9fb5d15000]
java.lang.Thread.State: TIMED_WAITING (on object monitor)
at java.lang.Object.wait(Native Method)
at java.util.TimerThread.mainLoop(Timer.java:552)
- locked <0x0000000714b08910> (a java.util.TaskQueue)
at java.util.TimerThread.run(Timer.java:505)
"1811922029@qtp-2024415090-1 - Acceptor0 HttpServer2$SelectChannelConnectorWithSafeStartup@localhost:37139" #29 daemon prio=5 os_prio=0 tid=0x00007f9ff512c800 nid=0x7d37 runnable [0x00007f9fb5e15000]
java.lang.Thread.State: RUNNABLE
at sun.nio.ch.EPollArrayWrapper.epollWait(Native Method)
at sun.nio.ch.EPollArrayWrapper.poll(EPollArrayWrapper.java:269)
at sun.nio.ch.EPollSelectorImpl.doSelect(EPollSelectorImpl.java:79)
at sun.nio.ch.SelectorImpl.lockAndDoSelect(SelectorImpl.java:86)
- locked <0x000000071535ae30> (a sun.nio.ch.Util$2)
- locked <0x000000071535ae40> (a java.util.Collections$UnmodifiableSet)
- locked <0x000000071535ade8> (a sun.nio.ch.EPollSelectorImpl)
at sun.nio.ch.SelectorImpl.select(SelectorImpl.java:97)
at org.mortbay.io.nio.SelectorManager$SelectSet.doSelect(SelectorManager.java:498)
at org.mortbay.io.nio.SelectorManager.doSelect(SelectorManager.java:192)
at org.mortbay.jetty.nio.SelectChannelConnector.accept(SelectChannelConnector.java:124)
at org.mortbay.jetty.AbstractConnector$Acceptor.run(AbstractConnector.java:708)
at org.mortbay.thread.QueuedThreadPool$PoolThread.run(QueuedThreadPool.java:582)
"1408695561@qtp-2024415090-0" #28 daemon prio=5 os_prio=0 tid=0x00007f9ff512b800 nid=0x7d36 in Object.wait() [0x00007f9fb6317000]
java.lang.Thread.State: TIMED_WAITING (on object monitor)
at java.lang.Object.wait(Native Method)
at org.mortbay.thread.QueuedThreadPool$PoolThread.run(QueuedThreadPool.java:626)
- locked <0x0000000714b08960> (a org.mortbay.thread.QueuedThreadPool$PoolThread)
"Timer for 'NameNode' metrics system" #26 daemon prio=5 os_prio=0 tid=0x00007f9ff50c2800 nid=0x7ca7 in Object.wait() [0x00007f9fb6e8a000]
java.lang.Thread.State: TIMED_WAITING (on object monitor)
at java.lang.Object.wait(Native Method)
at java.util.TimerThread.mainLoop(Timer.java:552)
- locked <0x000000071102f3b0> (a java.util.TaskQueue)
at java.util.TimerThread.run(Timer.java:505)
"Service Thread" #17 daemon prio=9 os_prio=0 tid=0x00007f9ff42d6800 nid=0x7ba6 runnable [0x0000000000000000]
java.lang.Thread.State: RUNNABLE
"C1 CompilerThread11" #16 daemon prio=9 os_prio=0 tid=0x00007f9ff42d1800 nid=0x7ba5 waiting on condition [0x0000000000000000]
java.lang.Thread.State: RUNNABLE
"C1 CompilerThread10" #15 daemon prio=9 os_prio=0 tid=0x00007f9ff42cf800 nid=0x7ba4 waiting on condition [0x0000000000000000]
java.lang.Thread.State: RUNNABLE
"C1 CompilerThread9" #14 daemon prio=9 os_prio=0 tid=0x00007f9ff42cd800 nid=0x7ba3 waiting on condition [0x0000000000000000]
java.lang.Thread.State: RUNNABLE
"C1 CompilerThread8" #13 daemon prio=9 os_prio=0 tid=0x00007f9ff42cb800 nid=0x7ba2 waiting on condition [0x0000000000000000]
java.lang.Thread.State: RUNNABLE
"C2 CompilerThread7" #12 daemon prio=9 os_prio=0 tid=0x00007f9ff42c9800 nid=0x7ba1 waiting on condition [0x0000000000000000]
java.lang.Thread.State: RUNNABLE
"C2 CompilerThread6" #11 daemon prio=9 os_prio=0 tid=0x00007f9ff42c7800 nid=0x7ba0 waiting on condition [0x0000000000000000]
java.lang.Thread.State: RUNNABLE
"C2 CompilerThread5" #10 daemon prio=9 os_prio=0 tid=0x00007f9ff42c5000 nid=0x7b9f waiting on condition [0x0000000000000000]
java.lang.Thread.State: RUNNABLE
"C2 CompilerThread4" #9 daemon prio=9 os_prio=0 tid=0x00007f9ff42bb000 nid=0x7b9e waiting on condition [0x0000000000000000]
java.lang.Thread.State: RUNNABLE
"C2 CompilerThread3" #8 daemon prio=9 os_prio=0 tid=0x00007f9ff42b9000 nid=0x7b9d waiting on condition [0x0000000000000000]
java.lang.Thread.State: RUNNABLE
"C2 CompilerThread2" #7 daemon prio=9 os_prio=0 tid=0x00007f9ff42b6800 nid=0x7b9c waiting on condition [0x0000000000000000]
java.lang.Thread.State: RUNNABLE
"C2 CompilerThread1" #6 daemon prio=9 os_prio=0 tid=0x00007f9ff42b5000 nid=0x7b9b waiting on condition [0x0000000000000000]
java.lang.Thread.State: RUNNABLE
"C2 CompilerThread0" #5 daemon prio=9 os_prio=0 tid=0x00007f9ff42b2000 nid=0x7b9a waiting on condition [0x0000000000000000]
java.lang.Thread.State: RUNNABLE
"Signal Dispatcher" #4 daemon prio=9 os_prio=0 tid=0x00007f9ff42b0800 nid=0x7b99 runnable [0x0000000000000000]
java.lang.Thread.State: RUNNABLE
"Finalizer" #3 daemon prio=8 os_prio=0 tid=0x00007f9ff4279000 nid=0x7b95 in Object.wait() [0x00007f9fbd3d2000]
java.lang.Thread.State: WAITING (on object monitor)
at java.lang.Object.wait(Native Method)
at java.lang.ref.ReferenceQueue.remove(ReferenceQueue.java:143)
- locked <0x000000071102dab0> (a java.lang.ref.ReferenceQueue$Lock)
at java.lang.ref.ReferenceQueue.remove(ReferenceQueue.java:164)
at java.lang.ref.Finalizer$FinalizerThread.run(Finalizer.java:209)
"Reference Handler" #2 daemon prio=10 os_prio=0 tid=0x00007f9ff4276800 nid=0x7b94 in Object.wait() [0x00007f9fbd4d3000]
java.lang.Thread.State: WAITING (on object monitor)
at java.lang.Object.wait(Native Method)
at java.lang.Object.wait(Object.java:502)
at java.lang.ref.Reference$ReferenceHandler.run(Reference.java:157)
- locked <0x000000071102dd10> (a java.lang.ref.Reference$Lock)
"main" #1 prio=5 os_prio=0 tid=0x00007f9ff400a800 nid=0x7b7e waiting on condition [0x00007f9ffc9ee000]
java.lang.Thread.State: TIMED_WAITING (sleeping)
at java.lang.Thread.sleep(Native Method)
at org.apache.hadoop.hbase.client.HBaseAdmin$ProcedureFuture.waitProcedureResult(HBaseAdmin.java:4244)
at org.apache.hadoop.hbase.client.HBaseAdmin$ProcedureFuture.get(HBaseAdmin.java:4173)
at org.apache.hadoop.hbase.client.HBaseAdmin.disableTable(HBaseAdmin.java:1219)
at org.apache.hadoop.hbase.HBaseTestingUtility.deleteTable(HBaseTestingUtility.java:1877)
at org.apache.hadoop.hbase.security.access.TestCellACLs.tearDown(TestCellACLs.java:482)
at sun.reflect.NativeMethodAccessorImpl.invoke0(Native Method)
at sun.reflect.NativeMethodAccessorImpl.invoke(NativeMethodAccessorImpl.java:62)
at sun.reflect.DelegatingMethodAccessorImpl.invoke(DelegatingMethodAccessorImpl.java:43)
at java.lang.reflect.Method.invoke(Method.java:497)
at org.junit.runners.model.FrameworkMethod$1.runReflectiveCall(FrameworkMethod.java:50)
at org.junit.internal.runners.model.ReflectiveCallable.run(ReflectiveCallable.java:12)
at org.junit.runners.model.FrameworkMethod.invokeExplosively(FrameworkMethod.java:47)
at org.junit.internal.runners.statements.RunAfters.evaluate(RunAfters.java:33)
at org.junit.rules.TestWatcher$1.evaluate(TestWatcher.java:55)
at org.junit.rules.RunRules.evaluate(RunRules.java:20)
at org.junit.runners.ParentRunner.runLeaf(ParentRunner.java:325)
at org.junit.runners.BlockJUnit4ClassRunner.runChild(BlockJUnit4ClassRunner.java:78)
at org.junit.runners.BlockJUnit4ClassRunner.runChild(BlockJUnit4ClassRunner.java:57)
at org.junit.runners.ParentRunner$3.run(ParentRunner.java:290)
at org.junit.runners.ParentRunner$1.schedule(ParentRunner.java:71)
at org.junit.runners.ParentRunner.runChildren(ParentRunner.java:288)
at org.junit.runners.ParentRunner.access$000(ParentRunner.java:58)
at org.junit.runners.ParentRunner$2.evaluate(ParentRunner.java:268)
at org.junit.internal.runners.statements.RunBefores.evaluate(RunBefores.java:26)
at org.junit.internal.runners.statements.RunAfters.evaluate(RunAfters.java:27)
at org.junit.runners.ParentRunner.run(ParentRunner.java:363)
at org.junit.runners.Suite.runChild(Suite.java:128)
at org.junit.runners.Suite.runChild(Suite.java:27)
at org.junit.runners.ParentRunner$3.run(ParentRunner.java:290)
at org.junit.runners.ParentRunner$1.schedule(ParentRunner.java:71)
at org.junit.runners.ParentRunner.runChildren(ParentRunner.java:288)
at org.junit.runners.ParentRunner.access$000(ParentRunner.java:58)
at org.junit.runners.ParentRunner$2.evaluate(ParentRunner.java:268)
at org.junit.runners.ParentRunner.run(ParentRunner.java:363)
at org.junit.runner.JUnitCore.run(JUnitCore.java:137)
at org.junit.runner.JUnitCore.run(JUnitCore.java:115)
at org.apache.maven.surefire.junitcore.JUnitCoreWrapper.createRequestAndRun(JUnitCoreWrapper.java:108)
at org.apache.maven.surefire.junitcore.JUnitCoreWrapper.executeEager(JUnitCoreWrapper.java:78)
at org.apache.maven.surefire.junitcore.JUnitCoreWrapper.execute(JUnitCoreWrapper.java:54)
at org.apache.maven.surefire.junitcore.JUnitCoreProvider.invoke(JUnitCoreProvider.java:144)
at org.apache.maven.surefire.booter.ForkedBooter.invokeProviderInSameClassLoader(ForkedBooter.java:203)
at org.apache.maven.surefire.booter.ForkedBooter.runSuitesInProcess(ForkedBooter.java:155)
at org.apache.maven.surefire.booter.ForkedBooter.main(ForkedBooter.java:103)
"VM Thread" os_prio=0 tid=0x00007f9ff4271800 nid=0x7b92 runnable
"GC task thread#0 (ParallelGC)" os_prio=0 tid=0x00007f9ff401f800 nid=0x7b81 runnable
"GC task thread#1 (ParallelGC)" os_prio=0 tid=0x00007f9ff4021800 nid=0x7b82 runnable
"GC task thread#2 (ParallelGC)" os_prio=0 tid=0x00007f9ff4023000 nid=0x7b83 runnable
"GC task thread#3 (ParallelGC)" os_prio=0 tid=0x00007f9ff4025000 nid=0x7b84 runnable
"GC task thread#4 (ParallelGC)" os_prio=0 tid=0x00007f9ff4026800 nid=0x7b85 runnable
"GC task thread#5 (ParallelGC)" os_prio=0 tid=0x00007f9ff4028800 nid=0x7b86 runnable
"GC task thread#6 (ParallelGC)" os_prio=0 tid=0x00007f9ff402a000 nid=0x7b87 runnable
"GC task thread#7 (ParallelGC)" os_prio=0 tid=0x00007f9ff402c000 nid=0x7b88 runnable
"GC task thread#8 (ParallelGC)" os_prio=0 tid=0x00007f9ff402d800 nid=0x7b89 runnable
"GC task thread#9 (ParallelGC)" os_prio=0 tid=0x00007f9ff402f800 nid=0x7b8a runnable
"GC task thread#10 (ParallelGC)" os_prio=0 tid=0x00007f9ff4031000 nid=0x7b8b runnable
"GC task thread#11 (ParallelGC)" os_prio=0 tid=0x00007f9ff4033000 nid=0x7b8c runnable
"GC task thread#12 (ParallelGC)" os_prio=0 tid=0x00007f9ff4034800 nid=0x7b8d runnable
"VM Periodic Task Thread" os_prio=0 tid=0x00007f9ff42d9800 nid=0x7ba7 waiting on condition
JNI global references: 295
POST BUILD TASK : FAILURE
END OF POST BUILD TASK : 0
Archiving artifacts
Build failed in Jenkins: HBase-1.2 » latest1.8,Hadoop #239
Posted by Apache Jenkins Server <je...@builds.apache.org>.
See <https://builds.apache.org/job/HBase-1.2/jdk=latest1.8,label=Hadoop/239/changes>
Changes:
[tedyu] HBASE-14578 URISyntaxException during snapshot restore for table with
------------------------------------------
[...truncated 53421 lines...]
at java.util.concurrent.locks.LockSupport.parkNanos(LockSupport.java:226)
at java.util.concurrent.locks.AbstractQueuedSynchronizer$ConditionObject.awaitNanos(AbstractQueuedSynchronizer.java:2082)
at java.util.concurrent.LinkedBlockingQueue.poll(LinkedBlockingQueue.java:467)
at org.apache.hadoop.ipc.CallQueueManager.take(CallQueueManager.java:109)
at org.apache.hadoop.ipc.Server$Handler.run(Server.java:1985)
"IPC Server listener on 44325" daemon prio=10 tid=0x00007fdab1d39000 nid=0x557d runnable [0x00007fdaa208f000]
java.lang.Thread.State: RUNNABLE
at sun.nio.ch.EPollArrayWrapper.epollWait(Native Method)
at sun.nio.ch.EPollArrayWrapper.poll(EPollArrayWrapper.java:269)
at sun.nio.ch.EPollSelectorImpl.doSelect(EPollSelectorImpl.java:79)
at sun.nio.ch.SelectorImpl.lockAndDoSelect(SelectorImpl.java:87)
- locked <0x00000007d90b1d20> (a sun.nio.ch.Util$2)
- locked <0x00000007d90b1d10> (a java.util.Collections$UnmodifiableSet)
- locked <0x00000007d90b18e0> (a sun.nio.ch.EPollSelectorImpl)
at sun.nio.ch.SelectorImpl.select(SelectorImpl.java:98)
at sun.nio.ch.SelectorImpl.select(SelectorImpl.java:102)
at org.apache.hadoop.ipc.Server$Listener.run(Server.java:668)
"IPC Server Responder" daemon prio=10 tid=0x00007fdab1ce8000 nid=0x557c runnable [0x00007fdaa2594000]
java.lang.Thread.State: RUNNABLE
at sun.nio.ch.EPollArrayWrapper.epollWait(Native Method)
at sun.nio.ch.EPollArrayWrapper.poll(EPollArrayWrapper.java:269)
at sun.nio.ch.EPollSelectorImpl.doSelect(EPollSelectorImpl.java:79)
at sun.nio.ch.SelectorImpl.lockAndDoSelect(SelectorImpl.java:87)
- locked <0x00000007d91061d0> (a sun.nio.ch.Util$2)
- locked <0x00000007d91061c0> (a java.util.Collections$UnmodifiableSet)
- locked <0x00000007d91060a8> (a sun.nio.ch.EPollSelectorImpl)
at sun.nio.ch.SelectorImpl.select(SelectorImpl.java:98)
at org.apache.hadoop.ipc.Server$Responder.doRunLoop(Server.java:835)
at org.apache.hadoop.ipc.Server$Responder.run(Server.java:818)
"org.apache.hadoop.hdfs.server.blockmanagement.BlockManager$ReplicationMonitor@6caa873c" daemon prio=10 tid=0x00007fdab1cde800 nid=0x557a waiting on condition [0x00007fdaa2190000]
java.lang.Thread.State: TIMED_WAITING (sleeping)
at java.lang.Thread.sleep(Native Method)
at org.apache.hadoop.hdfs.server.blockmanagement.BlockManager$ReplicationMonitor.run(BlockManager.java:3397)
at java.lang.Thread.run(Thread.java:745)
"org.apache.hadoop.hdfs.server.blockmanagement.HeartbeatManager$Monitor@2f94abe0" daemon prio=10 tid=0x00007fdab1cdc800 nid=0x5579 waiting on condition [0x00007fdaa2291000]
java.lang.Thread.State: TIMED_WAITING (sleeping)
at java.lang.Thread.sleep(Native Method)
at org.apache.hadoop.hdfs.server.blockmanagement.HeartbeatManager$Monitor.run(HeartbeatManager.java:319)
at java.lang.Thread.run(Thread.java:745)
"org.apache.hadoop.hdfs.server.blockmanagement.DecommissionManager$Monitor@49908839" daemon prio=10 tid=0x00007fdab1cdb800 nid=0x5578 waiting on condition [0x00007fdaa2392000]
java.lang.Thread.State: TIMED_WAITING (sleeping)
at java.lang.Thread.sleep(Native Method)
at org.apache.hadoop.hdfs.server.blockmanagement.DecommissionManager$Monitor.run(DecommissionManager.java:76)
at java.lang.Thread.run(Thread.java:745)
"org.apache.hadoop.hdfs.server.blockmanagement.PendingReplicationBlocks$PendingReplicationMonitor@44b35022" daemon prio=10 tid=0x00007fdab1cd9800 nid=0x5577 waiting on condition [0x00007fdaa2493000]
java.lang.Thread.State: TIMED_WAITING (sleeping)
at java.lang.Thread.sleep(Native Method)
at org.apache.hadoop.hdfs.server.blockmanagement.PendingReplicationBlocks$PendingReplicationMonitor.run(PendingReplicationBlocks.java:221)
at java.lang.Thread.run(Thread.java:745)
"org.apache.hadoop.util.JvmPauseMonitor$Monitor@45b5f7e0" daemon prio=10 tid=0x00007fdab1ac9800 nid=0x5571 waiting on condition [0x00007fdaa2695000]
java.lang.Thread.State: TIMED_WAITING (sleeping)
at java.lang.Thread.sleep(Native Method)
at org.apache.hadoop.util.JvmPauseMonitor$Monitor.run(JvmPauseMonitor.java:180)
at java.lang.Thread.run(Thread.java:745)
"IPC Server idle connection scanner for port 44325" daemon prio=10 tid=0x00007fdab1aa8800 nid=0x5570 in Object.wait() [0x00007fdaa2796000]
java.lang.Thread.State: TIMED_WAITING (on object monitor)
at java.lang.Object.wait(Native Method)
- waiting on <0x00000007d90b11d0> (a java.util.TaskQueue)
at java.util.TimerThread.mainLoop(Timer.java:552)
- locked <0x00000007d90b11d0> (a java.util.TaskQueue)
at java.util.TimerThread.run(Timer.java:505)
"Socket Reader #1 for port 44325" prio=10 tid=0x00007fdab1a6a800 nid=0x556f runnable [0x00007fdaa2897000]
java.lang.Thread.State: RUNNABLE
at sun.nio.ch.EPollArrayWrapper.epollWait(Native Method)
at sun.nio.ch.EPollArrayWrapper.poll(EPollArrayWrapper.java:269)
at sun.nio.ch.EPollSelectorImpl.doSelect(EPollSelectorImpl.java:79)
at sun.nio.ch.SelectorImpl.lockAndDoSelect(SelectorImpl.java:87)
- locked <0x00000007d90affa0> (a sun.nio.ch.Util$2)
- locked <0x00000007d90aff90> (a java.util.Collections$UnmodifiableSet)
- locked <0x00000007d90aeeb8> (a sun.nio.ch.EPollSelectorImpl)
at sun.nio.ch.SelectorImpl.select(SelectorImpl.java:98)
at sun.nio.ch.SelectorImpl.select(SelectorImpl.java:102)
at org.apache.hadoop.ipc.Server$Listener$Reader.doRunLoop(Server.java:616)
- locked <0x00000007d90b1fe0> (a org.apache.hadoop.ipc.Server$Listener$Reader)
at org.apache.hadoop.ipc.Server$Listener$Reader.run(Server.java:595)
"Timer-0" daemon prio=10 tid=0x00007fdab19f2000 nid=0x556e in Object.wait() [0x00007fdaa2998000]
java.lang.Thread.State: TIMED_WAITING (on object monitor)
at java.lang.Object.wait(Native Method)
- waiting on <0x00000007d9139bc0> (a java.util.TaskQueue)
at java.util.TimerThread.mainLoop(Timer.java:552)
- locked <0x00000007d9139bc0> (a java.util.TaskQueue)
at java.util.TimerThread.run(Timer.java:505)
"806474454@qtp-868912029-1 - Acceptor0 HttpServer2$SelectChannelConnectorWithSafeStartup@localhost:51506" daemon prio=10 tid=0x00007fdab19da800 nid=0x556d runnable [0x00007fdaa2a99000]
java.lang.Thread.State: RUNNABLE
at sun.nio.ch.EPollArrayWrapper.epollWait(Native Method)
at sun.nio.ch.EPollArrayWrapper.poll(EPollArrayWrapper.java:269)
at sun.nio.ch.EPollSelectorImpl.doSelect(EPollSelectorImpl.java:79)
at sun.nio.ch.SelectorImpl.lockAndDoSelect(SelectorImpl.java:87)
- locked <0x00000007d913a310> (a sun.nio.ch.Util$2)
- locked <0x00000007d913a300> (a java.util.Collections$UnmodifiableSet)
- locked <0x00000007d9139f30> (a sun.nio.ch.EPollSelectorImpl)
at sun.nio.ch.SelectorImpl.select(SelectorImpl.java:98)
at org.mortbay.io.nio.SelectorManager$SelectSet.doSelect(SelectorManager.java:498)
at org.mortbay.io.nio.SelectorManager.doSelect(SelectorManager.java:192)
at org.mortbay.jetty.nio.SelectChannelConnector.accept(SelectChannelConnector.java:124)
at org.mortbay.jetty.AbstractConnector$Acceptor.run(AbstractConnector.java:708)
at org.mortbay.thread.QueuedThreadPool$PoolThread.run(QueuedThreadPool.java:582)
"2086078170@qtp-868912029-0" daemon prio=10 tid=0x00007fdab19dc000 nid=0x556c in Object.wait() [0x00007fdaa2b9a000]
java.lang.Thread.State: TIMED_WAITING (on object monitor)
at java.lang.Object.wait(Native Method)
- waiting on <0x00000007d913a768> (a org.mortbay.thread.QueuedThreadPool$PoolThread)
at org.mortbay.thread.QueuedThreadPool$PoolThread.run(QueuedThreadPool.java:626)
- locked <0x00000007d913a768> (a org.mortbay.thread.QueuedThreadPool$PoolThread)
"Timer for 'NameNode' metrics system" daemon prio=10 tid=0x00007fdab196e000 nid=0x556b in Object.wait() [0x00007fdaa330d000]
java.lang.Thread.State: TIMED_WAITING (on object monitor)
at java.lang.Object.wait(Native Method)
- waiting on <0x0000000742685290> (a java.util.TaskQueue)
at java.util.TimerThread.mainLoop(Timer.java:552)
- locked <0x0000000742685290> (a java.util.TaskQueue)
at java.util.TimerThread.run(Timer.java:505)
"process reaper" daemon prio=10 tid=0x00007fdab10f3800 nid=0x555b waiting on condition [0x00007fdaa3346000]
java.lang.Thread.State: TIMED_WAITING (parking)
at sun.misc.Unsafe.park(Native Method)
- parking to wait for <0x00000007d9051790> (a java.util.concurrent.SynchronousQueue$TransferStack)
at java.util.concurrent.locks.LockSupport.parkNanos(LockSupport.java:226)
at java.util.concurrent.SynchronousQueue$TransferStack.awaitFulfill(SynchronousQueue.java:460)
at java.util.concurrent.SynchronousQueue$TransferStack.transfer(SynchronousQueue.java:359)
at java.util.concurrent.SynchronousQueue.poll(SynchronousQueue.java:942)
at java.util.concurrent.ThreadPoolExecutor.getTask(ThreadPoolExecutor.java:1068)
at java.util.concurrent.ThreadPoolExecutor.runWorker(ThreadPoolExecutor.java:1130)
at java.util.concurrent.ThreadPoolExecutor$Worker.run(ThreadPoolExecutor.java:615)
at java.lang.Thread.run(Thread.java:745)
"Service Thread" daemon prio=10 tid=0x00007fdab02a1000 nid=0x5510 runnable [0x0000000000000000]
java.lang.Thread.State: RUNNABLE
"C2 CompilerThread1" daemon prio=10 tid=0x00007fdab029f000 nid=0x550f waiting on condition [0x0000000000000000]
java.lang.Thread.State: RUNNABLE
"C2 CompilerThread0" daemon prio=10 tid=0x00007fdab029c000 nid=0x550e waiting on condition [0x0000000000000000]
java.lang.Thread.State: RUNNABLE
"Signal Dispatcher" daemon prio=10 tid=0x00007fdab0299800 nid=0x550d runnable [0x0000000000000000]
java.lang.Thread.State: RUNNABLE
"Finalizer" daemon prio=10 tid=0x00007fdab0271000 nid=0x550c in Object.wait() [0x00007fdaa8ac1000]
java.lang.Thread.State: WAITING (on object monitor)
at java.lang.Object.wait(Native Method)
- waiting on <0x0000000745ce8b50> (a java.lang.ref.ReferenceQueue$Lock)
at java.lang.ref.ReferenceQueue.remove(ReferenceQueue.java:135)
- locked <0x0000000745ce8b50> (a java.lang.ref.ReferenceQueue$Lock)
at java.lang.ref.ReferenceQueue.remove(ReferenceQueue.java:151)
at java.lang.ref.Finalizer$FinalizerThread.run(Finalizer.java:209)
"Reference Handler" daemon prio=10 tid=0x00007fdab0269000 nid=0x550b in Object.wait() [0x00007fdaa8bc2000]
java.lang.Thread.State: WAITING (on object monitor)
at java.lang.Object.wait(Native Method)
- waiting on <0x0000000745ce8808> (a java.lang.ref.Reference$Lock)
at java.lang.Object.wait(Object.java:503)
at java.lang.ref.Reference$ReferenceHandler.run(Reference.java:133)
- locked <0x0000000745ce8808> (a java.lang.ref.Reference$Lock)
"main" prio=10 tid=0x00007fdab000a800 nid=0x54fc waiting on condition [0x00007fdab75de000]
java.lang.Thread.State: TIMED_WAITING (sleeping)
at java.lang.Thread.sleep(Native Method)
at org.apache.hadoop.mapreduce.Job.monitorAndPrintJob(Job.java:1348)
at org.apache.hadoop.mapreduce.Job.waitForCompletion(Job.java:1306)
at org.apache.hadoop.hbase.mapreduce.ImportTsv.run(ImportTsv.java:721)
at org.apache.hadoop.util.ToolRunner.run(ToolRunner.java:70)
at org.apache.hadoop.hbase.mapreduce.TestImportTsv.doMROnTableTest(TestImportTsv.java:343)
at org.apache.hadoop.hbase.mapreduce.TestImportTsv.doMROnTableTest(TestImportTsv.java:305)
at org.apache.hadoop.hbase.mapreduce.TestImportTsv.doMROnTableTest(TestImportTsv.java:300)
at org.apache.hadoop.hbase.mapreduce.IntegrationTestImportTsv.testGenerateAndLoad(IntegrationTestImportTsv.java:202)
at sun.reflect.NativeMethodAccessorImpl.invoke0(Native Method)
at sun.reflect.NativeMethodAccessorImpl.invoke(NativeMethodAccessorImpl.java:57)
at sun.reflect.DelegatingMethodAccessorImpl.invoke(DelegatingMethodAccessorImpl.java:43)
at java.lang.reflect.Method.invoke(Method.java:606)
at org.junit.runners.model.FrameworkMethod$1.runReflectiveCall(FrameworkMethod.java:50)
at org.junit.internal.runners.model.ReflectiveCallable.run(ReflectiveCallable.java:12)
at org.junit.runners.model.FrameworkMethod.invokeExplosively(FrameworkMethod.java:47)
at org.junit.internal.runners.statements.InvokeMethod.evaluate(InvokeMethod.java:17)
at org.junit.runners.ParentRunner.runLeaf(ParentRunner.java:325)
at org.junit.runners.BlockJUnit4ClassRunner.runChild(BlockJUnit4ClassRunner.java:78)
at org.junit.runners.BlockJUnit4ClassRunner.runChild(BlockJUnit4ClassRunner.java:57)
at org.junit.runners.ParentRunner$3.run(ParentRunner.java:290)
at org.junit.runners.ParentRunner$1.schedule(ParentRunner.java:71)
at org.junit.runners.ParentRunner.runChildren(ParentRunner.java:288)
at org.junit.runners.ParentRunner.access$000(ParentRunner.java:58)
at org.junit.runners.ParentRunner$2.evaluate(ParentRunner.java:268)
at org.junit.internal.runners.statements.RunBefores.evaluate(RunBefores.java:26)
at org.junit.internal.runners.statements.RunAfters.evaluate(RunAfters.java:27)
at org.junit.runners.ParentRunner.run(ParentRunner.java:363)
at org.apache.maven.surefire.junit4.JUnit4Provider.execute(JUnit4Provider.java:283)
at org.apache.maven.surefire.junit4.JUnit4Provider.executeWithRerun(JUnit4Provider.java:173)
at org.apache.maven.surefire.junit4.JUnit4Provider.executeTestSet(JUnit4Provider.java:153)
at org.apache.maven.surefire.junit4.JUnit4Provider.invoke(JUnit4Provider.java:128)
at org.apache.maven.surefire.booter.ForkedBooter.invokeProviderInSameClassLoader(ForkedBooter.java:203)
at org.apache.maven.surefire.booter.ForkedBooter.runSuitesInProcess(ForkedBooter.java:155)
at org.apache.maven.surefire.booter.ForkedBooter.main(ForkedBooter.java:103)
"VM Thread" prio=10 tid=0x00007fdab0265000 nid=0x550a runnable
"GC task thread#0 (ParallelGC)" prio=10 tid=0x00007fdab0020800 nid=0x54fd runnable
"GC task thread#1 (ParallelGC)" prio=10 tid=0x00007fdab0022000 nid=0x54fe runnable
"GC task thread#2 (ParallelGC)" prio=10 tid=0x00007fdab0024000 nid=0x54ff runnable
"GC task thread#3 (ParallelGC)" prio=10 tid=0x00007fdab0026000 nid=0x5500 runnable
"GC task thread#4 (ParallelGC)" prio=10 tid=0x00007fdab0028000 nid=0x5501 runnable
"GC task thread#5 (ParallelGC)" prio=10 tid=0x00007fdab0029800 nid=0x5502 runnable
"GC task thread#6 (ParallelGC)" prio=10 tid=0x00007fdab002b800 nid=0x5503 runnable
"GC task thread#7 (ParallelGC)" prio=10 tid=0x00007fdab002d800 nid=0x5504 runnable
"GC task thread#8 (ParallelGC)" prio=10 tid=0x00007fdab002f000 nid=0x5505 runnable
"GC task thread#9 (ParallelGC)" prio=10 tid=0x00007fdab0031000 nid=0x5506 runnable
"GC task thread#10 (ParallelGC)" prio=10 tid=0x00007fdab0033000 nid=0x5507 runnable
"GC task thread#11 (ParallelGC)" prio=10 tid=0x00007fdab0035000 nid=0x5508 runnable
"GC task thread#12 (ParallelGC)" prio=10 tid=0x00007fdab0036800 nid=0x5509 runnable
"VM Periodic Task Thread" prio=10 tid=0x00007fdab02ac000 nid=0x5511 waiting on condition
JNI global references: 152
+ echo '************ END zombies jstack extract'
************ END zombies jstack extract
+ JIRA_COMMENT='
{color:red}-1 core zombie tests{color}. There are 1 zombie test(s): at org.apache.hadoop.hbase.mapreduce.IntegrationTestImportTsv.testGenerateAndLoad(IntegrationTestImportTsv.java:202)'
+ BAD=1
+ jps
+ grep surefirebooter
+ xargs kill -9
+ cut -d ' ' -f 1
POST BUILD TASK : SUCCESS
END OF POST BUILD TASK : 0
Archiving artifacts
Build failed in Jenkins: HBase-1.2 » latest1.8,Hadoop #238
Posted by Apache Jenkins Server <je...@builds.apache.org>.
See <https://builds.apache.org/job/HBase-1.2/jdk=latest1.8,label=Hadoop/238/changes>
Changes:
[tedyu] HBASE-14581 Znode cleanup throws auth exception in secure mode
------------------------------------------
[...truncated 46931 lines...]
240/340 KB 224/345 KB
240/340 KB 228/345 KB
240/340 KB 232/345 KB
240/340 KB 232/345 KB
240/340 KB 232/345 KB
244/340 KB 232/345 KB
248/340 KB 232/345 KB
248/340 KB 236/345 KB
248/340 KB 240/345 KB
248/340 KB 240/345 KB
248/340 KB 240/345 KB
252/340 KB 240/345 KB
256/340 KB 240/345 KB
256/340 KB 244/345 KB
256/340 KB 248/345 KB
256/340 KB 248/345 KB
256/340 KB 248/345 KB
260/340 KB 248/345 KB
264/340 KB 248/345 KB
264/340 KB 252/345 KB
264/340 KB 256/345 KB
264/340 KB 256/345 KB
264/340 KB 256/345 KB
268/340 KB 256/345 KB
271/340 KB 256/345 KB
271/340 KB 260/345 KB
271/340 KB 264/345 KB
272/340 KB 264/345 KB
272/340 KB 264/345 KB
276/340 KB 264/345 KB
276/340 KB 268/345 KB
279/340 KB 268/345 KB
279/340 KB 271/345 KB
280/340 KB 271/345 KB
280/340 KB 272/345 KB
284/340 KB 272/345 KB
284/340 KB 276/345 KB
287/340 KB 276/345 KB
287/340 KB 279/345 KB
288/340 KB 279/345 KB
288/340 KB 280/345 KB
292/340 KB 280/345 KB
292/340 KB 284/345 KB
295/340 KB 284/345 KB
295/340 KB 287/345 KB
296/340 KB 287/345 KB
296/340 KB 288/345 KB
300/340 KB 288/345 KB
300/340 KB 292/345 KB
303/340 KB 292/345 KB
303/340 KB 295/345 KB
304/340 KB 295/345 KB
304/340 KB 296/345 KB
308/340 KB 296/345 KB
308/340 KB 300/345 KB
310/340 KB 300/345 KB
310/340 KB 303/345 KB
310/340 KB 304/345 KB
312/340 KB 304/345 KB
316/340 KB 304/345 KB
316/340 KB 308/345 KB
318/340 KB 308/345 KB
318/340 KB 310/345 KB
318/340 KB 312/345 KB
320/340 KB 312/345 KB
324/340 KB 316/345 KB
324/340 KB 316/345 KB
324/340 KB 318/345 KB
326/340 KB 318/345 KB
326/340 KB 320/345 KB
328/340 KB 320/345 KB
328/340 KB 324/345 KB
332/340 KB 324/345 KB
332/340 KB 326/345 KB
334/340 KB 326/345 KB
334/340 KB 328/345 KB
336/340 KB 328/345 KB
340/340 KB 328/345 KB
340/340 KB 332/345 KB
340/340 KB 334/345 KB
340/340 KB 336/345 KB
340/340 KB 340/345 KB
340/340 KB 342/345 KB
340/340 KB 344/345 KB
340/340 KB 345/345 KB
Downloaded: https://repository.apache.org/content/repositories/releases/org/apache/thrift/libthrift/0.9.0/libthrift-0.9.0.jar (340 KB at 337.0 KB/sec)
Downloaded: https://repository.apache.org/content/repositories/releases/org/apache/httpcomponents/httpclient/4.1.3/httpclient-4.1.3.jar (345 KB at 325.1 KB/sec)
[INFO]
[INFO] --- maven-enforcer-plugin:1.0.1:enforce (enforce) @ hbase-thrift ---
[INFO]
[INFO] --- buildnumber-maven-plugin:1.3:create-timestamp (default) @ hbase-thrift ---
[INFO]
[INFO] --- jacoco-maven-plugin:0.7.5.201505241946:prepare-agent (prepare-agent) @ hbase-thrift ---
[INFO] Skipping JaCoCo execution because property jacoco.skip is set.
[INFO] argLine set to empty
[INFO]
[INFO] --- maven-antrun-plugin:1.6:run (generate) @ hbase-thrift ---
[INFO] Executing tasks
main:
[mkdir] Created dir: <https://builds.apache.org/job/HBase-1.2/jdk=latest1.8,label=Hadoop/ws/hbase-thrift/target/hbase-webapps>
[copy] Copying 17 files to <https://builds.apache.org/job/HBase-1.2/jdk=latest1.8,label=Hadoop/ws/hbase-thrift/target/hbase-webapps>
log4j:WARN No appenders could be found for logger (org.mortbay.log).
log4j:WARN Please initialize the log4j system properly.
log4j:WARN See http://logging.apache.org/log4j/1.2/faq.html#noconfig for more info.
[mkdir] Created dir: <https://builds.apache.org/job/HBase-1.2/jdk=latest1.8,label=Hadoop/ws/hbase-thrift/target/hbase-webapps/thrift/WEB-INF>
[INFO] Executed tasks
[INFO]
[INFO] --- build-helper-maven-plugin:1.9.1:add-source (jspcSource-packageInfo-source) @ hbase-thrift ---
[INFO] Source directory: <https://builds.apache.org/job/HBase-1.2/jdk=latest1.8,label=Hadoop/ws/hbase-thrift/target/generated-sources/java> added.
[INFO]
[INFO] --- maven-remote-resources-plugin:1.5:process (default) @ hbase-thrift ---
[INFO]
[INFO] --- maven-resources-plugin:2.6:resources (default-resources) @ hbase-thrift ---
[INFO] Using 'UTF-8' encoding to copy filtered resources.
[INFO] Copying 18 resources
[INFO] Copying 3 resources
[INFO]
[INFO] --- maven-compiler-plugin:2.5.1:compile (default-compile) @ hbase-thrift ---
[INFO] Compiling 53 source files to <https://builds.apache.org/job/HBase-1.2/jdk=latest1.8,label=Hadoop/ws/hbase-thrift/target/classes>
[INFO]
[INFO] --- maven-dependency-plugin:2.1:build-classpath (create-mrapp-generated-classpath) @ hbase-thrift ---
[INFO] Wrote classpath file '<https://builds.apache.org/job/HBase-1.2/jdk=latest1.8,label=Hadoop/ws/hbase-thrift/target/test-classes/mrapp-generated-classpath'.>
[INFO]
[INFO] --- maven-resources-plugin:2.6:testResources (default-testResources) @ hbase-thrift ---
[INFO] Using 'UTF-8' encoding to copy filtered resources.
[INFO] Copying 2 resources to META-INF/
[INFO] Copying 3 resources
[INFO] Copying 3 resources
[INFO]
[INFO] --- maven-compiler-plugin:2.5.1:testCompile (default-testCompile) @ hbase-thrift ---
[INFO] Compiling 6 source files to <https://builds.apache.org/job/HBase-1.2/jdk=latest1.8,label=Hadoop/ws/hbase-thrift/target/test-classes>
[INFO]
[INFO] --- maven-surefire-plugin:2.18.1:test (default-test) @ hbase-thrift ---
[INFO] Surefire report directory: <https://builds.apache.org/job/HBase-1.2/jdk=latest1.8,label=Hadoop/ws/hbase-thrift/target/surefire-reports>
[INFO] Using configured provider org.apache.maven.surefire.junitcore.JUnitCoreProvider
[INFO] parallel='none', perCoreThreadCount=true, threadCount=0, useUnlimitedThreads=false, threadCountSuites=0, threadCountClasses=0, threadCountMethods=0, parallelOptimized=true
-------------------------------------------------------
T E S T S
-------------------------------------------------------
Java HotSpot(TM) 64-Bit Server VM warning: ignoring option MaxPermSize=256m; support was removed in 8.0
Running org.apache.hadoop.hbase.thrift.TestThriftHttpServer
Tests run: 2, Failures: 0, Errors: 0, Skipped: 0, Time elapsed: 5.053 sec - in org.apache.hadoop.hbase.thrift.TestThriftHttpServer
Java HotSpot(TM) 64-Bit Server VM warning: ignoring option MaxPermSize=256m; support was removed in 8.0
Running org.apache.hadoop.hbase.thrift.TestThriftServerCmdLine
Tests run: 32, Failures: 0, Errors: 0, Skipped: 0, Time elapsed: 51.585 sec - in org.apache.hadoop.hbase.thrift.TestThriftServerCmdLine
Java HotSpot(TM) 64-Bit Server VM warning: ignoring option MaxPermSize=256m; support was removed in 8.0
Running org.apache.hadoop.hbase.thrift.TestThriftServer
Killed
Java HotSpot(TM) 64-Bit Server VM warning: ignoring option MaxPermSize=256m; support was removed in 8.0
Running org.apache.hadoop.hbase.thrift.TestCallQueue
Tests run: 18, Failures: 0, Errors: 0, Skipped: 0, Time elapsed: 0.271 sec - in org.apache.hadoop.hbase.thrift.TestCallQueue
Java HotSpot(TM) 64-Bit Server VM warning: ignoring option MaxPermSize=256m; support was removed in 8.0
Running org.apache.hadoop.hbase.thrift2.TestThriftHBaseServiceHandler
Tests run: 21, Failures: 0, Errors: 0, Skipped: 0, Time elapsed: 2.119 sec - in org.apache.hadoop.hbase.thrift2.TestThriftHBaseServiceHandler
Java HotSpot(TM) 64-Bit Server VM warning: ignoring option MaxPermSize=256m; support was removed in 8.0
Running org.apache.hadoop.hbase.thrift2.TestThriftHBaseServiceHandlerWithLabels
Tests run: 6, Failures: 0, Errors: 0, Skipped: 0, Time elapsed: 1.613 sec - in org.apache.hadoop.hbase.thrift2.TestThriftHBaseServiceHandlerWithLabels
Results :
Tests run: 79, Failures: 0, Errors: 0, Skipped: 0
[INFO] ------------------------------------------------------------------------
[INFO] Reactor Summary:
[INFO]
[INFO] Apache HBase ...................................... SUCCESS [1:24.960s]
[INFO] Apache HBase - Checkstyle ......................... SUCCESS [8.490s]
[INFO] Apache HBase - Resource Bundle .................... SUCCESS [0.165s]
[INFO] Apache HBase - Annotations ........................ SUCCESS [0.975s]
[INFO] Apache HBase - Protocol ........................... SUCCESS [18.163s]
[INFO] Apache HBase - Common ............................. SUCCESS [3:20.752s]
[INFO] Apache HBase - Procedure .......................... SUCCESS [1:56.127s]
[INFO] Apache HBase - Client ............................. SUCCESS [1:50.822s]
[INFO] Apache HBase - Hadoop Compatibility ............... SUCCESS [14.094s]
[INFO] Apache HBase - Hadoop Two Compatibility ........... SUCCESS [8.271s]
[INFO] Apache HBase - Prefix Tree ........................ SUCCESS [7.847s]
[INFO] Apache HBase - Server ............................. SUCCESS [1:34:02.812s]
[INFO] Apache HBase - Testing Util ....................... SUCCESS [4.237s]
[INFO] Apache HBase - Thrift ............................. FAILURE [2:57.494s]
[INFO] Apache HBase - Rest ............................... SKIPPED
[INFO] Apache HBase - Shell .............................. SKIPPED
[INFO] Apache HBase - Integration Tests .................. SKIPPED
[INFO] Apache HBase - Examples ........................... SKIPPED
[INFO] Apache HBase - External Block Cache ............... SKIPPED
[INFO] Apache HBase - Assembly ........................... SKIPPED
[INFO] Apache HBase - Shaded ............................. SKIPPED
[INFO] Apache HBase - Shaded - Client .................... SKIPPED
[INFO] Apache HBase - Shaded - Server .................... SKIPPED
[INFO] ------------------------------------------------------------------------
[INFO] BUILD FAILURE
[INFO] ------------------------------------------------------------------------
[INFO] Total time: 1:46:58.307s
[INFO] Finished at: Sat Oct 10 16:38:23 UTC 2015
[INFO] Final Memory: 109M/600M
[INFO] ------------------------------------------------------------------------
[ERROR] Failed to execute goal org.apache.maven.plugins:maven-surefire-plugin:2.18.1:test (default-test) on project hbase-thrift: ExecutionException: java.lang.RuntimeException: The forked VM terminated without properly saying goodbye. VM crash or System.exit called?
[ERROR] Command was /bin/sh -c cd <https://builds.apache.org/job/HBase-1.2/jdk=latest1.8,label=Hadoop/ws/hbase-thrift> && /home/jenkins/jenkins-slave/tools/hudson.model.JDK/latest1.8/jre/bin/java -enableassertions -XX:MaxDirectMemorySize=1G -Xmx2800m -XX:MaxPermSize=256m -Djava.security.egd=file:/dev/./urandom -Djava.net.preferIPv4Stack=true -Djava.awt.headless=true -jar <https://builds.apache.org/job/HBase-1.2/jdk=latest1.8,label=Hadoop/ws/hbase-thrift/target/surefire/surefirebooter4076304904863685583.jar> <https://builds.apache.org/job/HBase-1.2/jdk=latest1.8,label=Hadoop/ws/hbase-thrift/target/surefire/surefire5743905653839620207tmp> <https://builds.apache.org/job/HBase-1.2/jdk=latest1.8,label=Hadoop/ws/hbase-thrift/target/surefire/surefire_13426830046125316790547tmp>
[ERROR] -> [Help 1]
[ERROR]
[ERROR] To see the full stack trace of the errors, re-run Maven with the -e switch.
[ERROR] Re-run Maven using the -X switch to enable full debug logging.
[ERROR]
[ERROR] For more information about the errors and possible solutions, please read the following articles:
[ERROR] [Help 1] http://cwiki.apache.org/confluence/display/MAVEN/MojoFailureException
[ERROR]
[ERROR] After correcting the problems, you can resume the build with the command
[ERROR] mvn <goals> -rf :hbase-thrift
Build step 'Invoke top-level Maven targets' marked build as failure
Performing Post build task...
Match found for :.* : True
Logical operation result is TRUE
Running script : ZOMBIE_TESTS_COUNT=`jps | grep surefirebooter | wc -l`
if [[ $ZOMBIE_TESTS_COUNT != 0 ]] ; then
#It seems sometimes the tests are not dying immediately. Let's give them 10s
echo "Suspicious java process found - waiting 10s to see if there are just slow to stop"
sleep 10
ZOMBIE_TESTS_COUNT=`jps | grep surefirebooter | wc -l`
if [[ $ZOMBIE_TESTS_COUNT != 0 ]] ; then
echo "There are $ZOMBIE_TESTS_COUNT zombie tests, they should have been killed by surefire but survived"
echo "************ BEGIN zombies jstack extract"
ZB_STACK=`jps | grep surefirebooter | cut -d ' ' -f 1 | xargs -n 1 jstack | grep ".test" | grep "\.java"`
jps | grep surefirebooter | cut -d ' ' -f 1 | xargs -n 1 jstack
echo "************ END zombies jstack extract"
JIRA_COMMENT="$JIRA_COMMENT
{color:red}-1 core zombie tests{color}. There are ${ZOMBIE_TESTS_COUNT} zombie test(s): ${ZB_STACK}"
BAD=1
jps | grep surefirebooter | cut -d ' ' -f 1 | xargs kill -9
else
echo "We're ok: there is no zombie test, but some tests took some time to stop"
fi
else
echo "We're ok: there is no zombie test"
fi
[Hadoop] $ /bin/bash -xe /tmp/hudson3167085814181703278.sh
++ jps
++ grep surefirebooter
++ wc -l
+ ZOMBIE_TESTS_COUNT=0
+ [[ 0 != 0 ]]
+ echo 'We'\''re ok: there is no zombie test'
We're ok: there is no zombie test
POST BUILD TASK : SUCCESS
END OF POST BUILD TASK : 0
Archiving artifacts
Build failed in Jenkins: HBase-1.2 » latest1.8,Hadoop #237
Posted by Apache Jenkins Server <je...@builds.apache.org>.
See <https://builds.apache.org/job/HBase-1.2/jdk=latest1.8,label=Hadoop/237/changes>
Changes:
[stack] HBASE-14517 Show regionserver's version in master status page (Liu
[stack] HBASE-13858 RS/MasterDumpServlet dumps threads before its âStacksâ
------------------------------------------
[...truncated 47079 lines...]
[INFO] --- maven-jar-plugin:2.4:jar (default-jar) @ hbase-thrift ---
[INFO] Building jar: <https://builds.apache.org/job/HBase-1.2/jdk=latest1.8,label=Hadoop/ws/hbase-thrift/target/hbase-thrift-1.2.0-SNAPSHOT.jar>
[INFO]
[INFO] --- maven-install-plugin:2.3.1:install (default-install) @ hbase-thrift ---
[INFO] Installing <https://builds.apache.org/job/HBase-1.2/jdk=latest1.8,label=Hadoop/ws/hbase-thrift/target/hbase-thrift-1.2.0-SNAPSHOT.jar> to <https://builds.apache.org/job/HBase-1.2/jdk=latest1.8,label=Hadoop/ws/.repository/org/apache/hbase/hbase-thrift/1.2.0-SNAPSHOT/hbase-thrift-1.2.0-SNAPSHOT.jar>
[INFO] Installing <https://builds.apache.org/job/HBase-1.2/jdk=latest1.8,label=Hadoop/ws/hbase-thrift/pom.xml> to <https://builds.apache.org/job/HBase-1.2/jdk=latest1.8,label=Hadoop/ws/.repository/org/apache/hbase/hbase-thrift/1.2.0-SNAPSHOT/hbase-thrift-1.2.0-SNAPSHOT.pom>
[INFO] Installing <https://builds.apache.org/job/HBase-1.2/jdk=latest1.8,label=Hadoop/ws/hbase-thrift/target/hbase-thrift-1.2.0-SNAPSHOT-sources.jar> to <https://builds.apache.org/job/HBase-1.2/jdk=latest1.8,label=Hadoop/ws/.repository/org/apache/hbase/hbase-thrift/1.2.0-SNAPSHOT/hbase-thrift-1.2.0-SNAPSHOT-sources.jar>
[INFO] Installing <https://builds.apache.org/job/HBase-1.2/jdk=latest1.8,label=Hadoop/ws/hbase-thrift/target/hbase-thrift-1.2.0-SNAPSHOT-tests.jar> to <https://builds.apache.org/job/HBase-1.2/jdk=latest1.8,label=Hadoop/ws/.repository/org/apache/hbase/hbase-thrift/1.2.0-SNAPSHOT/hbase-thrift-1.2.0-SNAPSHOT-tests.jar>
[INFO]
[INFO] ------------------------------------------------------------------------
[INFO] Building Apache HBase - Rest 1.2.0-SNAPSHOT
[INFO] ------------------------------------------------------------------------
[INFO]
[INFO] --- maven-enforcer-plugin:1.0.1:enforce (enforce) @ hbase-rest ---
[INFO]
[INFO] --- buildnumber-maven-plugin:1.3:create-timestamp (default) @ hbase-rest ---
[INFO]
[INFO] --- jacoco-maven-plugin:0.7.5.201505241946:prepare-agent (prepare-agent) @ hbase-rest ---
[INFO] Skipping JaCoCo execution because property jacoco.skip is set.
[INFO] argLine set to empty
[INFO]
[INFO] --- maven-antrun-plugin:1.6:run (generate) @ hbase-rest ---
[INFO] Executing tasks
main:
[mkdir] Created dir: <https://builds.apache.org/job/HBase-1.2/jdk=latest1.8,label=Hadoop/ws/hbase-rest/target/hbase-webapps>
[copy] Copying 1 file to <https://builds.apache.org/job/HBase-1.2/jdk=latest1.8,label=Hadoop/ws/hbase-rest/target/hbase-webapps>
log4j:WARN No appenders could be found for logger (org.mortbay.log).
log4j:WARN Please initialize the log4j system properly.
log4j:WARN See http://logging.apache.org/log4j/1.2/faq.html#noconfig for more info.
[mkdir] Created dir: <https://builds.apache.org/job/HBase-1.2/jdk=latest1.8,label=Hadoop/ws/hbase-rest/target/hbase-webapps/rest/WEB-INF>
[INFO] Executed tasks
[INFO]
[INFO] --- build-helper-maven-plugin:1.9.1:add-source (jspcSource-packageInfo-source) @ hbase-rest ---
[INFO] Source directory: <https://builds.apache.org/job/HBase-1.2/jdk=latest1.8,label=Hadoop/ws/hbase-rest/target/generated-sources/java> added.
[INFO]
[INFO] --- maven-remote-resources-plugin:1.5:process (default) @ hbase-rest ---
[INFO]
[INFO] --- maven-resources-plugin:2.6:resources (default-resources) @ hbase-rest ---
[INFO] Using 'UTF-8' encoding to copy filtered resources.
[INFO] Copying 2 resources
[INFO] Copying 3 resources
[INFO]
[INFO] --- maven-compiler-plugin:2.5.1:compile (default-compile) @ hbase-rest ---
[INFO] Compiling 71 source files to <https://builds.apache.org/job/HBase-1.2/jdk=latest1.8,label=Hadoop/ws/hbase-rest/target/classes>
[INFO]
[INFO] --- maven-resources-plugin:2.6:testResources (default-testResources) @ hbase-rest ---
[INFO] Using 'UTF-8' encoding to copy filtered resources.
[INFO] Copying 6 resources
[INFO] Copying 3 resources
[INFO]
[INFO] --- maven-compiler-plugin:2.5.1:testCompile (default-testCompile) @ hbase-rest ---
[INFO] Compiling 38 source files to <https://builds.apache.org/job/HBase-1.2/jdk=latest1.8,label=Hadoop/ws/hbase-rest/target/test-classes>
[INFO]
[INFO] --- maven-surefire-plugin:2.18.1:test (default-test) @ hbase-rest ---
[INFO] Surefire report directory: <https://builds.apache.org/job/HBase-1.2/jdk=latest1.8,label=Hadoop/ws/hbase-rest/target/surefire-reports>
[INFO] Using configured provider org.apache.maven.surefire.junitcore.JUnitCoreProvider
[INFO] parallel='none', perCoreThreadCount=true, threadCount=0, useUnlimitedThreads=false, threadCountSuites=0, threadCountClasses=0, threadCountMethods=0, parallelOptimized=true
-------------------------------------------------------
T E S T S
-------------------------------------------------------
Java HotSpot(TM) 64-Bit Server VM warning: ignoring option MaxPermSize=256m; support was removed in 8.0
Running org.apache.hadoop.hbase.rest.TestDeleteRow
Tests run: 2, Failures: 0, Errors: 0, Skipped: 0, Time elapsed: 11.909 sec - in org.apache.hadoop.hbase.rest.TestDeleteRow
Java HotSpot(TM) 64-Bit Server VM warning: ignoring option MaxPermSize=256m; support was removed in 8.0
Running org.apache.hadoop.hbase.rest.TestResourceFilter
Tests run: 1, Failures: 0, Errors: 0, Skipped: 0, Time elapsed: 2.295 sec - in org.apache.hadoop.hbase.rest.TestResourceFilter
Java HotSpot(TM) 64-Bit Server VM warning: ignoring option MaxPermSize=256m; support was removed in 8.0
Running org.apache.hadoop.hbase.rest.TestTableResource
Tests run: 8, Failures: 0, Errors: 0, Skipped: 0, Time elapsed: 3.89 sec - in org.apache.hadoop.hbase.rest.TestTableResource
Java HotSpot(TM) 64-Bit Server VM warning: ignoring option MaxPermSize=256m; support was removed in 8.0
Running org.apache.hadoop.hbase.rest.TestGZIPResponseWrapper
Tests run: 4, Failures: 0, Errors: 0, Skipped: 0, Time elapsed: 0.539 sec - in org.apache.hadoop.hbase.rest.TestGZIPResponseWrapper
Java HotSpot(TM) 64-Bit Server VM warning: ignoring option MaxPermSize=256m; support was removed in 8.0
Running org.apache.hadoop.hbase.rest.TestVersionResource
Tests run: 7, Failures: 0, Errors: 0, Skipped: 0, Time elapsed: 3.31 sec - in org.apache.hadoop.hbase.rest.TestVersionResource
Java HotSpot(TM) 64-Bit Server VM warning: ignoring option MaxPermSize=256m; support was removed in 8.0
Running org.apache.hadoop.hbase.rest.TestStatusResource
Tests run: 2, Failures: 0, Errors: 0, Skipped: 0, Time elapsed: 3.201 sec - in org.apache.hadoop.hbase.rest.TestStatusResource
Java HotSpot(TM) 64-Bit Server VM warning: ignoring option MaxPermSize=256m; support was removed in 8.0
Running org.apache.hadoop.hbase.rest.TestScannersWithFilters
Tests run: 10, Failures: 0, Errors: 0, Skipped: 0, Time elapsed: 5.671 sec - in org.apache.hadoop.hbase.rest.TestScannersWithFilters
Java HotSpot(TM) 64-Bit Server VM warning: ignoring option MaxPermSize=256m; support was removed in 8.0
Running org.apache.hadoop.hbase.rest.TestScannerResource
Tests run: 5, Failures: 0, Errors: 0, Skipped: 0, Time elapsed: 5.309 sec - in org.apache.hadoop.hbase.rest.TestScannerResource
Java HotSpot(TM) 64-Bit Server VM warning: ignoring option MaxPermSize=256m; support was removed in 8.0
Running org.apache.hadoop.hbase.rest.TestMultiRowResource
Tests run: 3, Failures: 0, Errors: 0, Skipped: 0, Time elapsed: 3.443 sec - in org.apache.hadoop.hbase.rest.TestMultiRowResource
Java HotSpot(TM) 64-Bit Server VM warning: ignoring option MaxPermSize=256m; support was removed in 8.0
Running org.apache.hadoop.hbase.rest.client.TestRemoteTable
Tests run: 9, Failures: 0, Errors: 0, Skipped: 0, Time elapsed: 38.104 sec - in org.apache.hadoop.hbase.rest.client.TestRemoteTable
Java HotSpot(TM) 64-Bit Server VM warning: ignoring option MaxPermSize=256m; support was removed in 8.0
Running org.apache.hadoop.hbase.rest.client.TestRemoteHTableRetries
Tests run: 7, Failures: 0, Errors: 0, Skipped: 0, Time elapsed: 1.705 sec - in org.apache.hadoop.hbase.rest.client.TestRemoteHTableRetries
Java HotSpot(TM) 64-Bit Server VM warning: ignoring option MaxPermSize=256m; support was removed in 8.0
Running org.apache.hadoop.hbase.rest.client.TestRemoteAdminRetries
Tests run: 7, Failures: 0, Errors: 0, Skipped: 0, Time elapsed: 1.706 sec - in org.apache.hadoop.hbase.rest.client.TestRemoteAdminRetries
Java HotSpot(TM) 64-Bit Server VM warning: ignoring option MaxPermSize=256m; support was removed in 8.0
Running org.apache.hadoop.hbase.rest.model.TestCellModel
Tests run: 5, Failures: 0, Errors: 0, Skipped: 0, Time elapsed: 0.921 sec - in org.apache.hadoop.hbase.rest.model.TestCellModel
Java HotSpot(TM) 64-Bit Server VM warning: ignoring option MaxPermSize=256m; support was removed in 8.0
Running org.apache.hadoop.hbase.rest.model.TestTableListModel
Tests run: 5, Failures: 0, Errors: 0, Skipped: 0, Time elapsed: 0.994 sec - in org.apache.hadoop.hbase.rest.model.TestTableListModel
Java HotSpot(TM) 64-Bit Server VM warning: ignoring option MaxPermSize=256m; support was removed in 8.0
Running org.apache.hadoop.hbase.rest.model.TestVersionModel
Tests run: 5, Failures: 0, Errors: 0, Skipped: 0, Time elapsed: 1.027 sec - in org.apache.hadoop.hbase.rest.model.TestVersionModel
Java HotSpot(TM) 64-Bit Server VM warning: ignoring option MaxPermSize=256m; support was removed in 8.0
Running org.apache.hadoop.hbase.rest.model.TestRowModel
Tests run: 5, Failures: 0, Errors: 0, Skipped: 0, Time elapsed: 0.533 sec - in org.apache.hadoop.hbase.rest.model.TestRowModel
Java HotSpot(TM) 64-Bit Server VM warning: ignoring option MaxPermSize=256m; support was removed in 8.0
Running org.apache.hadoop.hbase.rest.model.TestColumnSchemaModel
Tests run: 5, Failures: 0, Errors: 0, Skipped: 0, Time elapsed: 0.563 sec - in org.apache.hadoop.hbase.rest.model.TestColumnSchemaModel
Java HotSpot(TM) 64-Bit Server VM warning: ignoring option MaxPermSize=256m; support was removed in 8.0
Running org.apache.hadoop.hbase.rest.model.TestTableInfoModel
Tests run: 5, Failures: 0, Errors: 0, Skipped: 0, Time elapsed: 0.99 sec - in org.apache.hadoop.hbase.rest.model.TestTableInfoModel
Java HotSpot(TM) 64-Bit Server VM warning: ignoring option MaxPermSize=256m; support was removed in 8.0
Running org.apache.hadoop.hbase.rest.model.TestNamespacesModel
Tests run: 5, Failures: 0, Errors: 0, Skipped: 0, Time elapsed: 0.584 sec - in org.apache.hadoop.hbase.rest.model.TestNamespacesModel
Java HotSpot(TM) 64-Bit Server VM warning: ignoring option MaxPermSize=256m; support was removed in 8.0
Running org.apache.hadoop.hbase.rest.model.TestStorageClusterVersionModel
Tests run: 5, Failures: 0, Errors: 0, Skipped: 0, Time elapsed: 0.537 sec - in org.apache.hadoop.hbase.rest.model.TestStorageClusterVersionModel
Java HotSpot(TM) 64-Bit Server VM warning: ignoring option MaxPermSize=256m; support was removed in 8.0
Running org.apache.hadoop.hbase.rest.model.TestStorageClusterStatusModel
Tests run: 5, Failures: 0, Errors: 0, Skipped: 0, Time elapsed: 1.065 sec - in org.apache.hadoop.hbase.rest.model.TestStorageClusterStatusModel
Java HotSpot(TM) 64-Bit Server VM warning: ignoring option MaxPermSize=256m; support was removed in 8.0
Running org.apache.hadoop.hbase.rest.model.TestCellSetModel
Tests run: 5, Failures: 0, Errors: 0, Skipped: 0, Time elapsed: 0.98 sec - in org.apache.hadoop.hbase.rest.model.TestCellSetModel
Java HotSpot(TM) 64-Bit Server VM warning: ignoring option MaxPermSize=256m; support was removed in 8.0
Running org.apache.hadoop.hbase.rest.model.TestTableSchemaModel
Tests run: 5, Failures: 0, Errors: 0, Skipped: 0, Time elapsed: 1.023 sec - in org.apache.hadoop.hbase.rest.model.TestTableSchemaModel
Java HotSpot(TM) 64-Bit Server VM warning: ignoring option MaxPermSize=256m; support was removed in 8.0
Running org.apache.hadoop.hbase.rest.model.TestNamespacesInstanceModel
Tests run: 5, Failures: 0, Errors: 0, Skipped: 0, Time elapsed: 0.612 sec - in org.apache.hadoop.hbase.rest.model.TestNamespacesInstanceModel
Java HotSpot(TM) 64-Bit Server VM warning: ignoring option MaxPermSize=256m; support was removed in 8.0
Running org.apache.hadoop.hbase.rest.model.TestScannerModel
Tests run: 5, Failures: 0, Errors: 0, Skipped: 0, Time elapsed: 1.026 sec - in org.apache.hadoop.hbase.rest.model.TestScannerModel
Java HotSpot(TM) 64-Bit Server VM warning: ignoring option MaxPermSize=256m; support was removed in 8.0
Running org.apache.hadoop.hbase.rest.model.TestTableRegionModel
Tests run: 7, Failures: 0, Errors: 0, Skipped: 0, Time elapsed: 0.607 sec - in org.apache.hadoop.hbase.rest.model.TestTableRegionModel
Java HotSpot(TM) 64-Bit Server VM warning: ignoring option MaxPermSize=256m; support was removed in 8.0
Running org.apache.hadoop.hbase.rest.TestScannersWithLabels
Tests run: 2, Failures: 0, Errors: 0, Skipped: 0, Time elapsed: 2.403 sec - in org.apache.hadoop.hbase.rest.TestScannersWithLabels
Java HotSpot(TM) 64-Bit Server VM warning: ignoring option MaxPermSize=256m; support was removed in 8.0
Running org.apache.hadoop.hbase.rest.TestTableScan
Tests run: 10, Failures: 0, Errors: 0, Skipped: 0, Time elapsed: 10.807 sec - in org.apache.hadoop.hbase.rest.TestTableScan
Java HotSpot(TM) 64-Bit Server VM warning: ignoring option MaxPermSize=256m; support was removed in 8.0
Running org.apache.hadoop.hbase.rest.TestNamespacesResource
Tests run: 2, Failures: 0, Errors: 0, Skipped: 0, Time elapsed: 2.881 sec - in org.apache.hadoop.hbase.rest.TestNamespacesResource
Java HotSpot(TM) 64-Bit Server VM warning: ignoring option MaxPermSize=256m; support was removed in 8.0
Running org.apache.hadoop.hbase.rest.TestGzipFilter
Tests run: 2, Failures: 0, Errors: 0, Skipped: 0, Time elapsed: 3.481 sec - in org.apache.hadoop.hbase.rest.TestGzipFilter
Java HotSpot(TM) 64-Bit Server VM warning: ignoring option MaxPermSize=256m; support was removed in 8.0
Running org.apache.hadoop.hbase.rest.TestGetAndPutResource
Killed
Java HotSpot(TM) 64-Bit Server VM warning: ignoring option MaxPermSize=256m; support was removed in 8.0
Running org.apache.hadoop.hbase.rest.TestNamespacesInstanceResource
Tests run: 5, Failures: 0, Errors: 0, Skipped: 0, Time elapsed: 5.96 sec - in org.apache.hadoop.hbase.rest.TestNamespacesInstanceResource
Java HotSpot(TM) 64-Bit Server VM warning: ignoring option MaxPermSize=256m; support was removed in 8.0
Running org.apache.hadoop.hbase.rest.TestSchemaResource
Tests run: 2, Failures: 0, Errors: 0, Skipped: 0, Time elapsed: 12.258 sec - in org.apache.hadoop.hbase.rest.TestSchemaResource
Results :
Tests run: 160, Failures: 0, Errors: 0, Skipped: 0
[INFO] ------------------------------------------------------------------------
[INFO] Reactor Summary:
[INFO]
[INFO] Apache HBase ...................................... SUCCESS [1:03.214s]
[INFO] Apache HBase - Checkstyle ......................... SUCCESS [5.024s]
[INFO] Apache HBase - Resource Bundle .................... SUCCESS [0.149s]
[INFO] Apache HBase - Annotations ........................ SUCCESS [0.912s]
[INFO] Apache HBase - Protocol ........................... SUCCESS [16.433s]
[INFO] Apache HBase - Common ............................. SUCCESS [2:21.177s]
[INFO] Apache HBase - Procedure .......................... SUCCESS [1:52.904s]
[INFO] Apache HBase - Client ............................. SUCCESS [1:27.386s]
[INFO] Apache HBase - Hadoop Compatibility ............... SUCCESS [8.040s]
[INFO] Apache HBase - Hadoop Two Compatibility ........... SUCCESS [7.546s]
[INFO] Apache HBase - Prefix Tree ........................ SUCCESS [7.437s]
[INFO] Apache HBase - Server ............................. SUCCESS [1:36:46.145s]
[INFO] Apache HBase - Testing Util ....................... SUCCESS [3.989s]
[INFO] Apache HBase - Thrift ............................. SUCCESS [3:18.921s]
[INFO] Apache HBase - Rest ............................... FAILURE [5:26.612s]
[INFO] Apache HBase - Shell .............................. SKIPPED
[INFO] Apache HBase - Integration Tests .................. SKIPPED
[INFO] Apache HBase - Examples ........................... SKIPPED
[INFO] Apache HBase - External Block Cache ............... SKIPPED
[INFO] Apache HBase - Assembly ........................... SKIPPED
[INFO] Apache HBase - Shaded ............................. SKIPPED
[INFO] Apache HBase - Shaded - Client .................... SKIPPED
[INFO] Apache HBase - Shaded - Server .................... SKIPPED
[INFO] ------------------------------------------------------------------------
[INFO] BUILD FAILURE
[INFO] ------------------------------------------------------------------------
[INFO] Total time: 1:53:23.006s
[INFO] Finished at: Sat Oct 10 04:29:11 UTC 2015
[INFO] Final Memory: 113M/692M
[INFO] ------------------------------------------------------------------------
[ERROR] Failed to execute goal org.apache.maven.plugins:maven-surefire-plugin:2.18.1:test (default-test) on project hbase-rest: ExecutionException: java.lang.RuntimeException: The forked VM terminated without properly saying goodbye. VM crash or System.exit called?
[ERROR] Command was /bin/sh -c cd <https://builds.apache.org/job/HBase-1.2/jdk=latest1.8,label=Hadoop/ws/hbase-rest> && /home/jenkins/jenkins-slave/tools/hudson.model.JDK/latest1.8/jre/bin/java -enableassertions -XX:MaxDirectMemorySize=1G -Xmx2800m -XX:MaxPermSize=256m -Djava.security.egd=file:/dev/./urandom -Djava.net.preferIPv4Stack=true -Djava.awt.headless=true -jar <https://builds.apache.org/job/HBase-1.2/jdk=latest1.8,label=Hadoop/ws/hbase-rest/target/surefire/surefirebooter1466156098079555028.jar> <https://builds.apache.org/job/HBase-1.2/jdk=latest1.8,label=Hadoop/ws/hbase-rest/target/surefire/surefire7068779319125633046tmp> <https://builds.apache.org/job/HBase-1.2/jdk=latest1.8,label=Hadoop/ws/hbase-rest/target/surefire/surefire_13744312968171300551202tmp>
[ERROR] -> [Help 1]
[ERROR]
[ERROR] To see the full stack trace of the errors, re-run Maven with the -e switch.
[ERROR] Re-run Maven using the -X switch to enable full debug logging.
[ERROR]
[ERROR] For more information about the errors and possible solutions, please read the following articles:
[ERROR] [Help 1] http://cwiki.apache.org/confluence/display/MAVEN/MojoFailureException
[ERROR]
[ERROR] After correcting the problems, you can resume the build with the command
[ERROR] mvn <goals> -rf :hbase-rest
Build step 'Invoke top-level Maven targets' marked build as failure
Performing Post build task...
Match found for :.* : True
Logical operation result is TRUE
Running script : ZOMBIE_TESTS_COUNT=`jps | grep surefirebooter | wc -l`
if [[ $ZOMBIE_TESTS_COUNT != 0 ]] ; then
#It seems sometimes the tests are not dying immediately. Let's give them 10s
echo "Suspicious java process found - waiting 10s to see if there are just slow to stop"
sleep 10
ZOMBIE_TESTS_COUNT=`jps | grep surefirebooter | wc -l`
if [[ $ZOMBIE_TESTS_COUNT != 0 ]] ; then
echo "There are $ZOMBIE_TESTS_COUNT zombie tests, they should have been killed by surefire but survived"
echo "************ BEGIN zombies jstack extract"
ZB_STACK=`jps | grep surefirebooter | cut -d ' ' -f 1 | xargs -n 1 jstack | grep ".test" | grep "\.java"`
jps | grep surefirebooter | cut -d ' ' -f 1 | xargs -n 1 jstack
echo "************ END zombies jstack extract"
JIRA_COMMENT="$JIRA_COMMENT
{color:red}-1 core zombie tests{color}. There are ${ZOMBIE_TESTS_COUNT} zombie test(s): ${ZB_STACK}"
BAD=1
jps | grep surefirebooter | cut -d ' ' -f 1 | xargs kill -9
else
echo "We're ok: there is no zombie test, but some tests took some time to stop"
fi
else
echo "We're ok: there is no zombie test"
fi
[Hadoop] $ /bin/bash -xe /tmp/hudson8316662697358041040.sh
++ jps
++ grep surefirebooter
++ wc -l
+ ZOMBIE_TESTS_COUNT=0
+ [[ 0 != 0 ]]
+ echo 'We'\''re ok: there is no zombie test'
We're ok: there is no zombie test
POST BUILD TASK : SUCCESS
END OF POST BUILD TASK : 0
Archiving artifacts