You are viewing a plain text version of this content. The canonical link for it is here.
Posted to dev@hbase.apache.org by Apache Jenkins Server <je...@builds.apache.org> on 2011/06/11 05:16:31 UTC

Build failed in Jenkins: HBase-TRUNK #1964

See <https://builds.apache.org/job/HBase-TRUNK/1964/changes>

Changes:

[stack] HBASE-3923 HBASE-1502 Broke Shell's status 'simple' and 'detailed'

[nspiegelberg] HBASE-3794 : Ability to Discard Bad HTable Puts

[stack] HBASE-3979 Trivial fixes in code, document

------------------------------------------
[...truncated 3470 lines...]
Tests run: 8, Failures: 0, Errors: 0, Skipped: 0, Time elapsed: 86.035 sec
Running org.apache.hadoop.hbase.mapreduce.TestTableSplit
Tests run: 1, Failures: 0, Errors: 0, Skipped: 0, Time elapsed: 0.016 sec
Running org.apache.hadoop.hbase.filter.TestSingleColumnValueExcludeFilter
Tests run: 1, Failures: 0, Errors: 0, Skipped: 0, Time elapsed: 0.017 sec
Running org.apache.hadoop.hbase.TestHBaseTestingUtility
Tests run: 6, Failures: 0, Errors: 0, Skipped: 0, Time elapsed: 83.062 sec
Running org.apache.hadoop.hbase.mapreduce.TestLoadIncrementalHFiles
Tests run: 4, Failures: 0, Errors: 0, Skipped: 0, Time elapsed: 39.311 sec
Running org.apache.hadoop.hbase.regionserver.wal.TestWALReplay
Tests run: 4, Failures: 0, Errors: 0, Skipped: 0, Time elapsed: 35.151 sec
Running org.apache.hadoop.hbase.rest.TestSchemaResource
Tests run: 2, Failures: 0, Errors: 0, Skipped: 0, Time elapsed: 29.602 sec
Running org.apache.hadoop.hbase.regionserver.TestKeyValueScanFixture
Tests run: 1, Failures: 0, Errors: 0, Skipped: 0, Time elapsed: 0.015 sec
Running org.apache.hadoop.hbase.rest.model.TestTableListModel
Tests run: 3, Failures: 0, Errors: 0, Skipped: 0, Time elapsed: 0.127 sec
Running org.apache.hadoop.hbase.rest.model.TestColumnSchemaModel
Tests run: 2, Failures: 0, Errors: 0, Skipped: 0, Time elapsed: 0.03 sec
Running org.apache.hadoop.hbase.regionserver.TestStoreFile
Tests run: 8, Failures: 0, Errors: 0, Skipped: 0, Time elapsed: 44.673 sec
Running org.apache.hadoop.hbase.zookeeper.TestZooKeeperNodeTracker
Tests run: 2, Failures: 0, Errors: 0, Skipped: 0, Time elapsed: 0.342 sec
Running org.apache.hadoop.hbase.master.TestSplitLogManager
Tests run: 9, Failures: 0, Errors: 0, Skipped: 0, Time elapsed: 13.248 sec
Running org.apache.hadoop.hbase.regionserver.wal.TestHLogMethods
Tests run: 3, Failures: 0, Errors: 0, Skipped: 0, Time elapsed: 0.444 sec
Running org.apache.hadoop.hbase.rest.model.TestScannerModel
Tests run: 3, Failures: 0, Errors: 0, Skipped: 0, Time elapsed: 0.127 sec
Running org.apache.hadoop.hbase.rest.TestVersionResource
Tests run: 7, Failures: 0, Errors: 0, Skipped: 0, Time elapsed: 25.711 sec
Running org.apache.hadoop.hbase.filter.TestFilter
Tests run: 18, Failures: 0, Errors: 0, Skipped: 0, Time elapsed: 4.31 sec
Running org.apache.hadoop.hbase.TestServerName
Tests run: 2, Failures: 0, Errors: 0, Skipped: 0, Time elapsed: 0.017 sec
Running org.apache.hadoop.hbase.regionserver.TestWideScanner
Tests run: 1, Failures: 0, Errors: 0, Skipped: 0, Time elapsed: 17.936 sec
Running org.apache.hadoop.hbase.regionserver.TestSplitTransaction
Tests run: 5, Failures: 0, Errors: 0, Skipped: 0, Time elapsed: 3.229 sec
Running org.apache.hadoop.hbase.replication.regionserver.TestReplicationSink
Tests run: 5, Failures: 0, Errors: 0, Skipped: 0, Time elapsed: 26.754 sec
Running org.apache.hadoop.hbase.regionserver.TestGetClosestAtOrBefore
Tests run: 3, Failures: 0, Errors: 0, Skipped: 0, Time elapsed: 11.041 sec
Running org.apache.hadoop.hbase.regionserver.TestReadWriteConsistencyControl
Tests run: 1, Failures: 0, Errors: 0, Skipped: 0, Time elapsed: 10.02 sec
Running org.apache.hadoop.hbase.util.TestMergeTable
Tests run: 1, Failures: 0, Errors: 0, Skipped: 0, Time elapsed: 57.468 sec
Running org.apache.hadoop.hbase.coprocessor.TestMasterObserver
Tests run: 3, Failures: 0, Errors: 0, Skipped: 0, Time elapsed: 30.837 sec
Running org.apache.hadoop.hbase.rest.model.TestVersionModel
Tests run: 3, Failures: 0, Errors: 0, Skipped: 0, Time elapsed: 0.127 sec
Running org.apache.hadoop.hbase.rest.model.TestCellSetModel
Tests run: 3, Failures: 0, Errors: 0, Skipped: 0, Time elapsed: 0.134 sec
Running org.apache.hadoop.hbase.rest.client.TestRemoteTable
Tests run: 3, Failures: 0, Errors: 0, Skipped: 0, Time elapsed: 23.084 sec
Running org.apache.hadoop.hbase.rest.model.TestStorageClusterStatusModel
Tests run: 3, Failures: 0, Errors: 0, Skipped: 0, Time elapsed: 0.133 sec
Running org.apache.hadoop.hbase.monitoring.TestTaskMonitor
Tests run: 3, Failures: 0, Errors: 0, Skipped: 0, Time elapsed: 0.219 sec
Running org.apache.hadoop.hbase.avro.TestAvroServer
Tests run: 3, Failures: 0, Errors: 0, Skipped: 0, Time elapsed: 34.559 sec
Running org.apache.hadoop.hbase.TestFullLogReconstruction
Tests run: 1, Failures: 0, Errors: 0, Skipped: 0, Time elapsed: 60.92 sec
Running org.apache.hadoop.hbase.TestSerialization
Tests run: 18, Failures: 0, Errors: 0, Skipped: 0, Time elapsed: 0.054 sec
Running org.apache.hadoop.hbase.regionserver.TestKeyValueHeap
Tests run: 3, Failures: 0, Errors: 0, Skipped: 0, Time elapsed: 0.112 sec
Running org.apache.hadoop.hbase.regionserver.TestStoreScanner
Tests run: 14, Failures: 0, Errors: 0, Skipped: 0, Time elapsed: 0.031 sec
Running org.apache.hadoop.hbase.io.hfile.TestReseekTo
Tests run: 1, Failures: 0, Errors: 0, Skipped: 0, Time elapsed: 0.202 sec
Running org.apache.hadoop.hbase.regionserver.TestHRegionInfo
Tests run: 2, Failures: 0, Errors: 0, Skipped: 0, Time elapsed: 0.017 sec
Running org.apache.hadoop.hbase.regionserver.TestScanner
Tests run: 6, Failures: 0, Errors: 0, Skipped: 0, Time elapsed: 64.016 sec
Running org.apache.hadoop.hbase.util.TestIncrementingEnvironmentEdge
Tests run: 1, Failures: 0, Errors: 0, Skipped: 0, Time elapsed: 0.016 sec
Running org.apache.hadoop.hbase.util.TestKeying
Tests run: 1, Failures: 0, Errors: 0, Skipped: 0, Time elapsed: 0.016 sec
Running org.apache.hadoop.hbase.util.TestHBaseFsck
Tests run: 2, Failures: 0, Errors: 0, Skipped: 0, Time elapsed: 61.898 sec
Running org.apache.hadoop.hbase.master.TestRestartCluster
Tests run: 2, Failures: 0, Errors: 0, Skipped: 0, Time elapsed: 79.33 sec
Running org.apache.hadoop.hbase.client.TestShell
Tests run: 1, Failures: 0, Errors: 0, Skipped: 0, Time elapsed: 51.742 sec
Running org.apache.hadoop.hbase.rest.model.TestTableInfoModel
Tests run: 3, Failures: 0, Errors: 0, Skipped: 0, Time elapsed: 0.133 sec
Running org.apache.hadoop.hbase.TestInfoServers
Tests run: 2, Failures: 0, Errors: 0, Skipped: 0, Time elapsed: 47.173 sec
Running org.apache.hadoop.hbase.master.TestLogsCleaner
Tests run: 1, Failures: 0, Errors: 0, Skipped: 0, Time elapsed: 1.173 sec
Running org.apache.hadoop.hbase.client.TestAttributes
Tests run: 3, Failures: 0, Errors: 0, Skipped: 0, Time elapsed: 0.02 sec
Running org.apache.hadoop.hbase.regionserver.TestMasterAddressManager
Tests run: 1, Failures: 0, Errors: 0, Skipped: 0, Time elapsed: 0.316 sec
Running org.apache.hadoop.hbase.master.TestMasterStatusServlet
Tests run: 4, Failures: 0, Errors: 0, Skipped: 0, Time elapsed: 0.376 sec
Running org.apache.hadoop.hbase.catalog.TestCatalogTrackerOnCluster
Tests run: 1, Failures: 0, Errors: 0, Skipped: 0, Time elapsed: 212.617 sec
Running org.apache.hadoop.hbase.regionserver.TestQueryMatcher
Tests run: 4, Failures: 0, Errors: 0, Skipped: 0, Time elapsed: 0.108 sec
Running org.apache.hadoop.hbase.zookeeper.TestZKTable
Tests run: 1, Failures: 0, Errors: 0, Skipped: 0, Time elapsed: 0.334 sec
Running org.apache.hadoop.hbase.client.TestAdmin
Tests run: 19, Failures: 0, Errors: 0, Skipped: 0, Time elapsed: 266.458 sec
Running org.apache.hadoop.hbase.util.TestSortedCopyOnWriteSet
Tests run: 2, Failures: 0, Errors: 0, Skipped: 0, Time elapsed: 0.024 sec
Running org.apache.hadoop.hbase.util.TestMergeTool
Tests run: 1, Failures: 0, Errors: 0, Skipped: 0, Time elapsed: 40.187 sec
Running org.apache.hadoop.hbase.TestAcidGuarantees
Tests run: 3, Failures: 0, Errors: 0, Skipped: 3, Time elapsed: 0.015 sec
Running org.apache.hadoop.hbase.TestHRegionLocation
Tests run: 3, Failures: 0, Errors: 0, Skipped: 0, Time elapsed: 0.018 sec
Running org.apache.hadoop.hbase.util.TestBase64
Tests run: 1, Failures: 0, Errors: 0, Skipped: 0, Time elapsed: 0.017 sec
Running org.apache.hadoop.hbase.coprocessor.TestRegionObserverStacking
Tests run: 1, Failures: 0, Errors: 0, Skipped: 0, Time elapsed: 0.242 sec
Running org.apache.hadoop.hbase.regionserver.TestMemStore
Tests run: 21, Failures: 0, Errors: 0, Skipped: 0, Time elapsed: 51.059 sec
Running org.apache.hadoop.hbase.rest.TestScannerResource
Tests run: 5, Failures: 0, Errors: 0, Skipped: 0, Time elapsed: 60.572 sec
Running org.apache.hadoop.hbase.io.hfile.TestLruBlockCache
Tests run: 7, Failures: 0, Errors: 0, Skipped: 0, Time elapsed: 1.052 sec
Running org.apache.hadoop.hbase.master.TestDeadServer
Tests run: 1, Failures: 0, Errors: 0, Skipped: 0, Time elapsed: 0.018 sec
Running org.apache.hadoop.hbase.rest.TestGzipFilter
Tests run: 2, Failures: 0, Errors: 0, Skipped: 0, Time elapsed: 27.999 sec
Running org.apache.hadoop.hbase.mapreduce.TestTableMapReduce
Tests run: 2, Failures: 0, Errors: 0, Skipped: 0, Time elapsed: 112.443 sec
Running org.apache.hadoop.hbase.TestKeyValue
Tests run: 9, Failures: 0, Errors: 0, Skipped: 0, Time elapsed: 0.024 sec
Running org.apache.hadoop.hbase.filter.TestColumnRangeFilter
Tests run: 1, Failures: 0, Errors: 0, Skipped: 0, Time elapsed: 28.415 sec
Running org.apache.hadoop.hbase.client.TestMultiParallel
Tests run: 10, Failures: 0, Errors: 0, Skipped: 0, Time elapsed: 40.937 sec
Running org.apache.hadoop.hbase.master.TestMaster
Tests run: 1, Failures: 0, Errors: 0, Skipped: 0, Time elapsed: 98.532 sec
Running org.apache.hadoop.hbase.master.TestRollingRestart
Tests run: 1, Failures: 0, Errors: 0, Skipped: 0, Time elapsed: 116.632 sec
Running org.apache.hadoop.hbase.client.TestResult
Tests run: 2, Failures: 0, Errors: 0, Skipped: 0, Time elapsed: 0.038 sec
Running org.apache.hadoop.hbase.client.TestHTablePool
Tests run: 10, Failures: 0, Errors: 0, Skipped: 0, Time elapsed: 185.389 sec
Running org.apache.hadoop.hbase.regionserver.TestRSStatusServlet
Tests run: 2, Failures: 0, Errors: 0, Skipped: 0, Time elapsed: 0.274 sec
Running org.apache.hadoop.hbase.regionserver.TestCompactSelection
Tests run: 1, Failures: 0, Errors: 0, Skipped: 0, Time elapsed: 0.192 sec
Running org.apache.hadoop.hbase.util.TestByteBloomFilter
Tests run: 3, Failures: 0, Errors: 0, Skipped: 0, Time elapsed: 1.567 sec
Running org.apache.hadoop.hbase.rest.model.TestTableSchemaModel
Tests run: 3, Failures: 0, Errors: 0, Skipped: 0, Time elapsed: 0.134 sec
Running org.apache.hadoop.hbase.mapreduce.TestTableInputFormatScan
Tests run: 11, Failures: 0, Errors: 0, Skipped: 0, Time elapsed: 348.278 sec
Running org.apache.hadoop.hbase.filter.TestFilterList
Tests run: 4, Failures: 0, Errors: 0, Skipped: 0, Time elapsed: 0.041 sec
Running org.apache.hadoop.hbase.regionserver.TestHRegion
Tests run: 54, Failures: 0, Errors: 0, Skipped: 0, Time elapsed: 34.022 sec
Running org.apache.hadoop.hbase.master.TestMasterFailover
Tests run: 3, Failures: 0, Errors: 1, Skipped: 0, Time elapsed: 315.274 sec <<< FAILURE!
Running org.apache.hadoop.hbase.client.TestScan
Tests run: 2, Failures: 0, Errors: 0, Skipped: 0, Time elapsed: 0.018 sec
Running org.apache.hadoop.hbase.rest.model.TestTableRegionModel
Tests run: 4, Failures: 0, Errors: 0, Skipped: 0, Time elapsed: 0.033 sec
Running org.apache.hadoop.hbase.client.TestTimestampsFilter
Tests run: 3, Failures: 0, Errors: 0, Skipped: 0, Time elapsed: 33.464 sec
Running org.apache.hadoop.hbase.master.TestLoadBalancer
Tests run: 5, Failures: 0, Errors: 0, Skipped: 0, Time elapsed: 2.075 sec
Running org.apache.hadoop.hbase.util.TestRootPath
Tests run: 1, Failures: 0, Errors: 0, Skipped: 0, Time elapsed: 0.021 sec
Running org.apache.hadoop.hbase.client.TestScannerTimeout
Tests run: 4, Failures: 0, Errors: 0, Skipped: 0, Time elapsed: 65.053 sec
Running org.apache.hadoop.hbase.regionserver.wal.TestWALObserver
Tests run: 1, Failures: 0, Errors: 0, Skipped: 0, Time elapsed: 0.298 sec
Running org.apache.hadoop.hbase.mapred.TestTableMapReduce
Tests run: 1, Failures: 0, Errors: 0, Skipped: 0, Time elapsed: 52.315 sec
Running org.apache.hadoop.hbase.coprocessor.TestAggregateProtocol
Tests run: 44, Failures: 0, Errors: 0, Skipped: 0, Time elapsed: 21.674 sec
Running org.apache.hadoop.hbase.master.TestActiveMasterManager
Tests run: 2, Failures: 0, Errors: 0, Skipped: 0, Time elapsed: 0.576 sec
Running org.apache.hadoop.hbase.util.TestBytes
Tests run: 10, Failures: 0, Errors: 0, Skipped: 0, Time elapsed: 0.021 sec
Running org.apache.hadoop.hbase.filter.TestRandomRowFilter
Tests run: 2, Failures: 0, Errors: 0, Skipped: 0, Time elapsed: 0.417 sec
Running org.apache.hadoop.hbase.replication.regionserver.TestReplicationSourceManager
Tests run: 1, Failures: 0, Errors: 0, Skipped: 0, Time elapsed: 0.974 sec
Running org.apache.hadoop.hbase.util.TestCompressionTest
Tests run: 1, Failures: 0, Errors: 0, Skipped: 0, Time elapsed: 0.026 sec
Running org.apache.hadoop.hbase.client.TestGetRowVersions
Tests run: 1, Failures: 0, Errors: 0, Skipped: 0, Time elapsed: 33.284 sec
Running org.apache.hadoop.hbase.filter.TestDependentColumnFilter
Tests run: 2, Failures: 0, Errors: 0, Skipped: 0, Time elapsed: 0.38 sec
Running org.apache.hadoop.hbase.rest.model.TestCellModel
Tests run: 3, Failures: 0, Errors: 0, Skipped: 0, Time elapsed: 0.126 sec
Running org.apache.hadoop.hbase.master.TestCatalogJanitor
Tests run: 2, Failures: 0, Errors: 0, Skipped: 0, Time elapsed: 0.555 sec
Running org.apache.hadoop.hbase.catalog.TestCatalogTracker
Tests run: 8, Failures: 0, Errors: 0, Skipped: 0, Time elapsed: 2.967 sec
Running org.apache.hadoop.hbase.replication.TestReplicationSource
Tests run: 1, Failures: 0, Errors: 0, Skipped: 0, Time elapsed: 8.018 sec
Running org.apache.hadoop.hbase.coprocessor.TestWALObserver
Tests run: 3, Failures: 0, Errors: 0, Skipped: 0, Time elapsed: 44.38 sec
Running org.apache.hadoop.hbase.rest.TestRowResource
Tests run: 10, Failures: 0, Errors: 0, Skipped: 0, Time elapsed: 23.456 sec
Running org.apache.hadoop.hbase.io.hfile.TestHFile
Tests run: 7, Failures: 0, Errors: 0, Skipped: 0, Time elapsed: 0.326 sec
Running org.apache.hadoop.hbase.catalog.TestMetaReaderEditor
Tests run: 4, Failures: 0, Errors: 0, Skipped: 0, Time elapsed: 26.903 sec
Running org.apache.hadoop.hbase.mapreduce.TestImportTsv
Tests run: 8, Failures: 0, Errors: 0, Skipped: 0, Time elapsed: 44.768 sec
Running org.apache.hadoop.hbase.rest.client.TestRemoteAdmin
Tests run: 2, Failures: 0, Errors: 0, Skipped: 0, Time elapsed: 27.735 sec
Running org.apache.hadoop.hbase.regionserver.wal.TestHLog
Tests run: 9, Failures: 0, Errors: 0, Skipped: 0, Time elapsed: 87.634 sec
Running org.apache.hadoop.hbase.client.TestTimestamp
Tests run: 1, Failures: 0, Errors: 0, Skipped: 0, Time elapsed: 19.748 sec
Running org.apache.hadoop.hbase.TestScanMultipleVersions
Tests run: 1, Failures: 0, Errors: 0, Skipped: 0, Time elapsed: 24.556 sec
Running org.apache.hadoop.hbase.util.TestPoolMap
Tests run: 9, Failures: 0, Errors: 0, Skipped: 0, Time elapsed: 0.029 sec
Running org.apache.hadoop.hbase.TestGlobalMemStoreSize
Tests run: 1, Failures: 0, Errors: 0, Skipped: 0, Time elapsed: 30.737 sec
Running org.apache.hadoop.hbase.rest.model.TestStorageClusterVersionModel
Tests run: 2, Failures: 0, Errors: 0, Skipped: 0, Time elapsed: 0.03 sec
Running org.apache.hadoop.hbase.client.TestHCM
Tests run: 3, Failures: 0, Errors: 0, Skipped: 0, Time elapsed: 32.682 sec

Results :

Tests in error: 

Tests run: 801, Failures: 0, Errors: 1, Skipped: 9

[INFO] ------------------------------------------------------------------------
[ERROR] BUILD FAILURE
[INFO] ------------------------------------------------------------------------
[INFO] There are test failures.

Please refer to <https://builds.apache.org/job/HBase-TRUNK/ws/trunk/target/surefire-reports> for the individual test results.
[INFO] ------------------------------------------------------------------------
[INFO] For more information, run Maven with the -e switch
[INFO] ------------------------------------------------------------------------
[INFO] Total time: 100 minutes 3 seconds
[INFO] Finished at: Sat Jun 11 03:15:59 UTC 2011
[INFO] Final Memory: 97M/905M
[INFO] ------------------------------------------------------------------------
[locks-and-latches] Releasing all the locks
[locks-and-latches] All the locks released
Archiving artifacts
Recording test results


Build failed in Jenkins: HBase-TRUNK #1971

Posted by Apache Jenkins Server <je...@builds.apache.org>.
See <https://builds.apache.org/job/HBase-TRUNK/1971/changes>

Changes:

[stack] HBASE-3940 HBase daemons should log version info at startup and possibly periodically

------------------------------------------
[...truncated 3479 lines...]
Tests run: 1, Failures: 0, Errors: 0, Skipped: 0, Time elapsed: 0.016 sec
Running org.apache.hadoop.hbase.TestHBaseTestingUtility
Tests run: 6, Failures: 0, Errors: 0, Skipped: 0, Time elapsed: 79.505 sec
Running org.apache.hadoop.hbase.mapreduce.TestLoadIncrementalHFiles
Tests run: 4, Failures: 0, Errors: 0, Skipped: 0, Time elapsed: 50.952 sec
Running org.apache.hadoop.hbase.regionserver.wal.TestWALReplay
Tests run: 4, Failures: 0, Errors: 0, Skipped: 0, Time elapsed: 42.841 sec
Running org.apache.hadoop.hbase.rest.TestSchemaResource
Tests run: 2, Failures: 0, Errors: 0, Skipped: 0, Time elapsed: 28.958 sec
Running org.apache.hadoop.hbase.regionserver.TestKeyValueScanFixture
Tests run: 1, Failures: 0, Errors: 0, Skipped: 0, Time elapsed: 0.022 sec
Running org.apache.hadoop.hbase.rest.model.TestTableListModel
Tests run: 3, Failures: 0, Errors: 0, Skipped: 0, Time elapsed: 0.131 sec
Running org.apache.hadoop.hbase.rest.model.TestColumnSchemaModel
Tests run: 2, Failures: 0, Errors: 0, Skipped: 0, Time elapsed: 0.031 sec
Running org.apache.hadoop.hbase.regionserver.TestStoreFile
Tests run: 8, Failures: 0, Errors: 0, Skipped: 0, Time elapsed: 46.189 sec
Running org.apache.hadoop.hbase.zookeeper.TestZooKeeperNodeTracker
Tests run: 2, Failures: 0, Errors: 0, Skipped: 0, Time elapsed: 0.412 sec
Running org.apache.hadoop.hbase.master.TestSplitLogManager
Tests run: 9, Failures: 0, Errors: 0, Skipped: 0, Time elapsed: 13.714 sec
Running org.apache.hadoop.hbase.regionserver.wal.TestHLogMethods
Tests run: 3, Failures: 0, Errors: 0, Skipped: 0, Time elapsed: 0.416 sec
Running org.apache.hadoop.hbase.rest.model.TestScannerModel
Tests run: 3, Failures: 0, Errors: 0, Skipped: 0, Time elapsed: 0.127 sec
Running org.apache.hadoop.hbase.rest.TestVersionResource
Tests run: 7, Failures: 0, Errors: 0, Skipped: 0, Time elapsed: 24.857 sec
Running org.apache.hadoop.hbase.filter.TestFilter
Tests run: 18, Failures: 0, Errors: 0, Skipped: 0, Time elapsed: 4.519 sec
Running org.apache.hadoop.hbase.TestServerName
Tests run: 2, Failures: 0, Errors: 0, Skipped: 0, Time elapsed: 0.016 sec
Running org.apache.hadoop.hbase.regionserver.TestWideScanner
Tests run: 1, Failures: 0, Errors: 0, Skipped: 0, Time elapsed: 18.623 sec
Running org.apache.hadoop.hbase.regionserver.TestSplitTransaction
Tests run: 5, Failures: 0, Errors: 0, Skipped: 0, Time elapsed: 3.7 sec
Running org.apache.hadoop.hbase.replication.regionserver.TestReplicationSink
Tests run: 5, Failures: 0, Errors: 0, Skipped: 0, Time elapsed: 27.424 sec
Running org.apache.hadoop.hbase.regionserver.TestGetClosestAtOrBefore
Tests run: 3, Failures: 0, Errors: 0, Skipped: 0, Time elapsed: 14.991 sec
Running org.apache.hadoop.hbase.regionserver.TestReadWriteConsistencyControl
Tests run: 1, Failures: 0, Errors: 0, Skipped: 0, Time elapsed: 10.02 sec
Running org.apache.hadoop.hbase.util.TestMergeTable
Tests run: 1, Failures: 0, Errors: 0, Skipped: 0, Time elapsed: 56.507 sec
Running org.apache.hadoop.hbase.coprocessor.TestMasterObserver
Tests run: 3, Failures: 0, Errors: 0, Skipped: 0, Time elapsed: 27.751 sec
Running org.apache.hadoop.hbase.rest.model.TestVersionModel
Tests run: 3, Failures: 0, Errors: 0, Skipped: 0, Time elapsed: 0.127 sec
Running org.apache.hadoop.hbase.rest.model.TestCellSetModel
Tests run: 3, Failures: 0, Errors: 0, Skipped: 0, Time elapsed: 0.134 sec
Running org.apache.hadoop.hbase.rest.client.TestRemoteTable
Tests run: 3, Failures: 0, Errors: 0, Skipped: 0, Time elapsed: 22.474 sec
Running org.apache.hadoop.hbase.rest.model.TestStorageClusterStatusModel
Tests run: 3, Failures: 0, Errors: 0, Skipped: 0, Time elapsed: 0.133 sec
Running org.apache.hadoop.hbase.monitoring.TestTaskMonitor
Tests run: 3, Failures: 0, Errors: 0, Skipped: 0, Time elapsed: 0.225 sec
Running org.apache.hadoop.hbase.avro.TestAvroServer
Tests run: 3, Failures: 0, Errors: 0, Skipped: 0, Time elapsed: 33.061 sec
Running org.apache.hadoop.hbase.TestFullLogReconstruction
Tests run: 1, Failures: 0, Errors: 0, Skipped: 0, Time elapsed: 62.51 sec
Running org.apache.hadoop.hbase.TestSerialization
Tests run: 18, Failures: 0, Errors: 0, Skipped: 0, Time elapsed: 0.055 sec
Running org.apache.hadoop.hbase.regionserver.TestKeyValueHeap
Tests run: 3, Failures: 0, Errors: 0, Skipped: 0, Time elapsed: 0.098 sec
Running org.apache.hadoop.hbase.regionserver.TestStoreScanner
Tests run: 14, Failures: 0, Errors: 0, Skipped: 0, Time elapsed: 0.031 sec
Running org.apache.hadoop.hbase.io.hfile.TestReseekTo
Tests run: 1, Failures: 0, Errors: 0, Skipped: 0, Time elapsed: 0.208 sec
Running org.apache.hadoop.hbase.regionserver.TestHRegionInfo
Tests run: 2, Failures: 0, Errors: 0, Skipped: 0, Time elapsed: 0.017 sec
Running org.apache.hadoop.hbase.regionserver.TestScanner
Tests run: 6, Failures: 0, Errors: 0, Skipped: 0, Time elapsed: 64.199 sec
Running org.apache.hadoop.hbase.util.TestIncrementingEnvironmentEdge
Tests run: 1, Failures: 0, Errors: 0, Skipped: 0, Time elapsed: 0.016 sec
Running org.apache.hadoop.hbase.util.TestKeying
Tests run: 1, Failures: 0, Errors: 0, Skipped: 0, Time elapsed: 0.016 sec
Running org.apache.hadoop.hbase.util.TestHBaseFsck
Tests run: 2, Failures: 0, Errors: 0, Skipped: 0, Time elapsed: 37.04 sec
Running org.apache.hadoop.hbase.master.TestRestartCluster
Tests run: 2, Failures: 0, Errors: 0, Skipped: 0, Time elapsed: 62.395 sec
Running org.apache.hadoop.hbase.client.TestShell
Tests run: 1, Failures: 0, Errors: 0, Skipped: 0, Time elapsed: 51.463 sec
Running org.apache.hadoop.hbase.rest.model.TestTableInfoModel
Tests run: 3, Failures: 0, Errors: 0, Skipped: 0, Time elapsed: 0.13 sec
Running org.apache.hadoop.hbase.TestInfoServers
Tests run: 2, Failures: 0, Errors: 0, Skipped: 0, Time elapsed: 37.232 sec
Running org.apache.hadoop.hbase.master.TestLogsCleaner
Tests run: 1, Failures: 0, Errors: 0, Skipped: 0, Time elapsed: 1.338 sec
Running org.apache.hadoop.hbase.client.TestAttributes
Tests run: 3, Failures: 0, Errors: 0, Skipped: 0, Time elapsed: 0.02 sec
Running org.apache.hadoop.hbase.regionserver.TestMasterAddressManager
Tests run: 1, Failures: 0, Errors: 0, Skipped: 0, Time elapsed: 0.3 sec
Running org.apache.hadoop.hbase.master.TestMasterStatusServlet
Tests run: 4, Failures: 0, Errors: 0, Skipped: 0, Time elapsed: 0.535 sec
Running org.apache.hadoop.hbase.catalog.TestCatalogTrackerOnCluster
Tests run: 1, Failures: 0, Errors: 0, Skipped: 0, Time elapsed: 211.29 sec
Running org.apache.hadoop.hbase.regionserver.TestQueryMatcher
Tests run: 4, Failures: 0, Errors: 0, Skipped: 0, Time elapsed: 0.105 sec
Running org.apache.hadoop.hbase.zookeeper.TestZKTable
Tests run: 1, Failures: 0, Errors: 0, Skipped: 0, Time elapsed: 0.403 sec
Running org.apache.hadoop.hbase.client.TestAdmin
Tests run: 19, Failures: 0, Errors: 0, Skipped: 0, Time elapsed: 321.401 sec
Running org.apache.hadoop.hbase.util.TestSortedCopyOnWriteSet
Tests run: 2, Failures: 0, Errors: 0, Skipped: 0, Time elapsed: 0.024 sec
Running org.apache.hadoop.hbase.util.TestMergeTool
Tests run: 1, Failures: 0, Errors: 0, Skipped: 0, Time elapsed: 38.498 sec
Running org.apache.hadoop.hbase.TestAcidGuarantees
Tests run: 3, Failures: 0, Errors: 0, Skipped: 3, Time elapsed: 0.015 sec
Running org.apache.hadoop.hbase.TestHRegionLocation
Tests run: 3, Failures: 0, Errors: 0, Skipped: 0, Time elapsed: 0.019 sec
Running org.apache.hadoop.hbase.util.TestBase64
Tests run: 1, Failures: 0, Errors: 0, Skipped: 0, Time elapsed: 0.017 sec
Running org.apache.hadoop.hbase.coprocessor.TestRegionObserverStacking
Tests run: 1, Failures: 0, Errors: 0, Skipped: 0, Time elapsed: 0.276 sec
Running org.apache.hadoop.hbase.regionserver.TestMemStore
Tests run: 21, Failures: 0, Errors: 0, Skipped: 0, Time elapsed: 43.779 sec
Running org.apache.hadoop.hbase.rest.TestScannerResource
Tests run: 5, Failures: 0, Errors: 0, Skipped: 0, Time elapsed: 65.446 sec
Running org.apache.hadoop.hbase.io.hfile.TestLruBlockCache
Tests run: 7, Failures: 0, Errors: 0, Skipped: 0, Time elapsed: 1.052 sec
Running org.apache.hadoop.hbase.master.TestDeadServer
Tests run: 1, Failures: 0, Errors: 0, Skipped: 0, Time elapsed: 0.017 sec
Running org.apache.hadoop.hbase.rest.TestGzipFilter
Tests run: 2, Failures: 0, Errors: 0, Skipped: 0, Time elapsed: 28.098 sec
Running org.apache.hadoop.hbase.mapreduce.TestTableMapReduce
Tests run: 2, Failures: 0, Errors: 0, Skipped: 0, Time elapsed: 105.714 sec
Running org.apache.hadoop.hbase.TestKeyValue
Tests run: 9, Failures: 0, Errors: 0, Skipped: 0, Time elapsed: 0.024 sec
Running org.apache.hadoop.hbase.filter.TestColumnRangeFilter
Tests run: 1, Failures: 0, Errors: 0, Skipped: 0, Time elapsed: 43.518 sec
Running org.apache.hadoop.hbase.client.TestMultiParallel
Tests run: 10, Failures: 0, Errors: 0, Skipped: 0, Time elapsed: 34.545 sec
Running org.apache.hadoop.hbase.master.TestMaster
Tests run: 1, Failures: 0, Errors: 0, Skipped: 0, Time elapsed: 80.234 sec
Running org.apache.hadoop.hbase.master.TestRollingRestart
Tests run: 1, Failures: 0, Errors: 0, Skipped: 0, Time elapsed: 80.088 sec
Running org.apache.hadoop.hbase.client.TestResult
Tests run: 2, Failures: 0, Errors: 0, Skipped: 0, Time elapsed: 0.038 sec
Running org.apache.hadoop.hbase.client.TestHTablePool
Tests run: 10, Failures: 0, Errors: 0, Skipped: 0, Time elapsed: 208.427 sec
Running org.apache.hadoop.hbase.regionserver.TestRSStatusServlet
Tests run: 2, Failures: 0, Errors: 0, Skipped: 0, Time elapsed: 0.299 sec
Running org.apache.hadoop.hbase.regionserver.TestCompactSelection
Tests run: 1, Failures: 0, Errors: 0, Skipped: 0, Time elapsed: 0.329 sec
Running org.apache.hadoop.hbase.util.TestByteBloomFilter
Tests run: 3, Failures: 0, Errors: 0, Skipped: 0, Time elapsed: 1.571 sec
Running org.apache.hadoop.hbase.rest.model.TestTableSchemaModel
Tests run: 3, Failures: 0, Errors: 0, Skipped: 0, Time elapsed: 0.138 sec
Running org.apache.hadoop.hbase.mapreduce.TestTableInputFormatScan
Tests run: 11, Failures: 0, Errors: 0, Skipped: 0, Time elapsed: 342.229 sec
Running org.apache.hadoop.hbase.filter.TestFilterList
Tests run: 4, Failures: 0, Errors: 0, Skipped: 0, Time elapsed: 0.041 sec
Running org.apache.hadoop.hbase.regionserver.TestHRegion
Tests run: 54, Failures: 0, Errors: 0, Skipped: 0, Time elapsed: 40.227 sec
Running org.apache.hadoop.hbase.master.TestMasterFailover
Tests run: 3, Failures: 0, Errors: 1, Skipped: 0, Time elapsed: 242.958 sec <<< FAILURE!
Running org.apache.hadoop.hbase.client.TestScan
Tests run: 2, Failures: 0, Errors: 0, Skipped: 0, Time elapsed: 0.018 sec
Running org.apache.hadoop.hbase.rest.model.TestTableRegionModel
Tests run: 4, Failures: 0, Errors: 0, Skipped: 0, Time elapsed: 0.032 sec
Running org.apache.hadoop.hbase.client.TestTimestampsFilter
Tests run: 3, Failures: 0, Errors: 0, Skipped: 0, Time elapsed: 32.58 sec
Running org.apache.hadoop.hbase.master.TestLoadBalancer
Tests run: 5, Failures: 0, Errors: 0, Skipped: 0, Time elapsed: 2.067 sec
Running org.apache.hadoop.hbase.util.TestRootPath
Tests run: 1, Failures: 0, Errors: 0, Skipped: 0, Time elapsed: 0.021 sec
Running org.apache.hadoop.hbase.client.TestScannerTimeout
Tests run: 4, Failures: 0, Errors: 0, Skipped: 0, Time elapsed: 52.305 sec
Running org.apache.hadoop.hbase.regionserver.wal.TestWALObserver
Tests run: 1, Failures: 0, Errors: 0, Skipped: 0, Time elapsed: 0.321 sec
Running org.apache.hadoop.hbase.mapred.TestTableMapReduce
Tests run: 1, Failures: 0, Errors: 0, Skipped: 0, Time elapsed: 71.277 sec
Running org.apache.hadoop.hbase.coprocessor.TestAggregateProtocol
Tests run: 44, Failures: 0, Errors: 0, Skipped: 0, Time elapsed: 26.619 sec
Running org.apache.hadoop.hbase.master.TestActiveMasterManager
Tests run: 2, Failures: 0, Errors: 0, Skipped: 0, Time elapsed: 0.684 sec
Running org.apache.hadoop.hbase.util.TestBytes
Tests run: 10, Failures: 0, Errors: 0, Skipped: 0, Time elapsed: 0.021 sec
Running org.apache.hadoop.hbase.filter.TestRandomRowFilter
Tests run: 2, Failures: 0, Errors: 0, Skipped: 0, Time elapsed: 0.431 sec
Running org.apache.hadoop.hbase.replication.regionserver.TestReplicationSourceManager
Tests run: 1, Failures: 0, Errors: 0, Skipped: 0, Time elapsed: 0.951 sec
Running org.apache.hadoop.hbase.util.TestCompressionTest
Tests run: 1, Failures: 0, Errors: 0, Skipped: 0, Time elapsed: 0.026 sec
Running org.apache.hadoop.hbase.client.TestMetaMigration
Tests run: 3, Failures: 0, Errors: 0, Skipped: 0, Time elapsed: 18.873 sec
Running org.apache.hadoop.hbase.client.TestGetRowVersions
Tests run: 1, Failures: 0, Errors: 0, Skipped: 0, Time elapsed: 64.925 sec
Running org.apache.hadoop.hbase.filter.TestDependentColumnFilter
Tests run: 2, Failures: 0, Errors: 0, Skipped: 0, Time elapsed: 0.445 sec
Running org.apache.hadoop.hbase.rest.model.TestCellModel
Tests run: 3, Failures: 0, Errors: 0, Skipped: 0, Time elapsed: 0.127 sec
Running org.apache.hadoop.hbase.master.TestCatalogJanitor
Tests run: 2, Failures: 0, Errors: 0, Skipped: 0, Time elapsed: 0.657 sec
Running org.apache.hadoop.hbase.catalog.TestCatalogTracker
Tests run: 8, Failures: 0, Errors: 0, Skipped: 0, Time elapsed: 2.959 sec
Running org.apache.hadoop.hbase.replication.TestReplicationSource
Tests run: 1, Failures: 0, Errors: 0, Skipped: 0, Time elapsed: 2.541 sec
Running org.apache.hadoop.hbase.coprocessor.TestWALObserver
Tests run: 3, Failures: 0, Errors: 0, Skipped: 0, Time elapsed: 23.928 sec
Running org.apache.hadoop.hbase.rest.TestRowResource
Tests run: 10, Failures: 0, Errors: 0, Skipped: 0, Time elapsed: 26.923 sec
Running org.apache.hadoop.hbase.io.hfile.TestHFile
Tests run: 7, Failures: 0, Errors: 0, Skipped: 0, Time elapsed: 0.335 sec
Running org.apache.hadoop.hbase.catalog.TestMetaReaderEditor
Tests run: 4, Failures: 0, Errors: 0, Skipped: 0, Time elapsed: 27.617 sec
Running org.apache.hadoop.hbase.mapreduce.TestImportTsv
Tests run: 8, Failures: 0, Errors: 0, Skipped: 0, Time elapsed: 45.779 sec
Running org.apache.hadoop.hbase.rest.client.TestRemoteAdmin
Tests run: 2, Failures: 0, Errors: 0, Skipped: 0, Time elapsed: 27.671 sec
Running org.apache.hadoop.hbase.regionserver.wal.TestHLog
Tests run: 9, Failures: 0, Errors: 0, Skipped: 0, Time elapsed: 88.238 sec
Running org.apache.hadoop.hbase.client.TestTimestamp
Tests run: 1, Failures: 0, Errors: 0, Skipped: 0, Time elapsed: 21.405 sec
Running org.apache.hadoop.hbase.TestScanMultipleVersions
Tests run: 1, Failures: 0, Errors: 0, Skipped: 0, Time elapsed: 22.727 sec
Running org.apache.hadoop.hbase.util.TestPoolMap
Tests run: 9, Failures: 0, Errors: 0, Skipped: 0, Time elapsed: 0.041 sec
Running org.apache.hadoop.hbase.TestGlobalMemStoreSize
Tests run: 1, Failures: 1, Errors: 0, Skipped: 0, Time elapsed: 18.975 sec <<< FAILURE!
Running org.apache.hadoop.hbase.rest.model.TestStorageClusterVersionModel
Tests run: 2, Failures: 0, Errors: 0, Skipped: 0, Time elapsed: 0.03 sec
Running org.apache.hadoop.hbase.client.TestHCM
Tests run: 3, Failures: 0, Errors: 0, Skipped: 0, Time elapsed: 24.543 sec

Results :

Failed tests: 

Tests in error: 

Tests run: 805, Failures: 1, Errors: 1, Skipped: 9

[INFO] ------------------------------------------------------------------------
[ERROR] BUILD FAILURE
[INFO] ------------------------------------------------------------------------
[INFO] There are test failures.

Please refer to <https://builds.apache.org/job/HBase-TRUNK/ws/trunk/target/surefire-reports> for the individual test results.
[INFO] ------------------------------------------------------------------------
[INFO] For more information, run Maven with the -e switch
[INFO] ------------------------------------------------------------------------
[INFO] Total time: 104 minutes 5 seconds
[INFO] Finished at: Wed Jun 15 00:26:25 UTC 2011
[INFO] Final Memory: 96M/869M
[INFO] ------------------------------------------------------------------------
[locks-and-latches] Releasing all the locks
[locks-and-latches] All the locks released
Archiving artifacts
Recording test results


Build failed in Jenkins: HBase-TRUNK #1970

Posted by Apache Jenkins Server <je...@builds.apache.org>.
See <https://builds.apache.org/job/HBase-TRUNK/1970/changes>

Changes:

[stack] doc fix from leif wickland up on mailing list

[todd] HBASE-3982. Improvements to TestHFileSeek.

------------------------------------------
[...truncated 3328 lines...]
[INFO] Copying 4 resources
[INFO] Copying 3 resources
[INFO] [compiler:testCompile {execution: default-testCompile}]
[INFO] Compiling 219 source files to <https://builds.apache.org/job/HBase-TRUNK/ws/trunk/target/test-classes>
[INFO] [surefire:test {execution: default-test}]
[INFO] Surefire report directory: <https://builds.apache.org/job/HBase-TRUNK/ws/trunk/target/surefire-reports>

-------------------------------------------------------
 T E S T S
-------------------------------------------------------
Running org.apache.hadoop.hbase.master.TestHMasterRPCException
Tests run: 1, Failures: 0, Errors: 0, Skipped: 0, Time elapsed: 0.47 sec
Running org.apache.hadoop.hbase.regionserver.TestColumnSeeking
Tests run: 2, Failures: 0, Errors: 0, Skipped: 0, Time elapsed: 14.919 sec
Running org.apache.hadoop.hbase.client.TestMultipleTimestamps
Tests run: 8, Failures: 0, Errors: 0, Skipped: 0, Time elapsed: 66.904 sec
Running org.apache.hadoop.hbase.regionserver.TestMemStoreLAB
Tests run: 3, Failures: 0, Errors: 0, Skipped: 0, Time elapsed: 1.302 sec
Running org.apache.hadoop.hbase.coprocessor.TestRegionObserverInterface
Tests run: 4, Failures: 0, Errors: 0, Skipped: 0, Time elapsed: 39.298 sec
Running org.apache.hadoop.hbase.coprocessor.TestCoprocessorInterface
Tests run: 1, Failures: 0, Errors: 0, Skipped: 0, Time elapsed: 3.297 sec
Running org.apache.hadoop.hbase.TestZooKeeper
Tests run: 7, Failures: 0, Errors: 0, Skipped: 0, Time elapsed: 90.837 sec
Running org.apache.hadoop.hbase.regionserver.wal.TestLogRolling
Tests run: 2, Failures: 0, Errors: 0, Skipped: 0, Time elapsed: 135.35 sec
Running org.apache.hadoop.hbase.io.hfile.TestCachedBlockQueue
Tests run: 2, Failures: 0, Errors: 0, Skipped: 0, Time elapsed: 0.017 sec
Running org.apache.hadoop.hbase.filter.TestPrefixFilter
Tests run: 3, Failures: 0, Errors: 0, Skipped: 0, Time elapsed: 0.018 sec
Running org.apache.hadoop.hbase.io.TestImmutableBytesWritable
Tests run: 3, Failures: 0, Errors: 0, Skipped: 0, Time elapsed: 0.016 sec
Running org.apache.hadoop.hbase.io.TestHeapSize
Tests run: 2, Failures: 0, Errors: 0, Skipped: 0, Time elapsed: 0.034 sec
Running org.apache.hadoop.hbase.rest.model.TestRowModel
Tests run: 2, Failures: 0, Errors: 0, Skipped: 0, Time elapsed: 0.038 sec
Running org.apache.hadoop.hbase.io.hfile.TestHFileSeek
Tests run: 1, Failures: 0, Errors: 0, Skipped: 0, Time elapsed: 5.065 sec
Running org.apache.hadoop.hbase.regionserver.TestStore
Tests run: 11, Failures: 0, Errors: 0, Skipped: 0, Time elapsed: 1.63 sec
Running org.apache.hadoop.hbase.regionserver.TestSplitTransactionOnCluster
Tests run: 5, Failures: 0, Errors: 0, Skipped: 0, Time elapsed: 63.83 sec
Running org.apache.hadoop.hbase.zookeeper.TestHQuorumPeer
Tests run: 3, Failures: 0, Errors: 0, Skipped: 0, Time elapsed: 0.34 sec
Running org.apache.hadoop.hbase.rest.TestScannersWithFilters
Tests run: 10, Failures: 0, Errors: 0, Skipped: 0, Time elapsed: 33.908 sec
Running org.apache.hadoop.hbase.io.hfile.TestHFilePerformance
Tests run: 1, Failures: 0, Errors: 0, Skipped: 0, Time elapsed: 8.98 sec
Running org.apache.hadoop.hbase.regionserver.TestResettingCounters
Tests run: 1, Failures: 0, Errors: 0, Skipped: 0, Time elapsed: 0.288 sec
Running org.apache.hadoop.hbase.regionserver.handler.TestOpenRegionHandler
Tests run: 1, Failures: 0, Errors: 0, Skipped: 0, Time elapsed: 0.525 sec
Running org.apache.hadoop.hbase.io.TestHbaseObjectWritable
Tests run: 3, Failures: 0, Errors: 0, Skipped: 0, Time elapsed: 0.073 sec
Running org.apache.hadoop.hbase.regionserver.wal.TestHLogSplit
Tests run: 27, Failures: 0, Errors: 0, Skipped: 0, Time elapsed: 214.363 sec
Running org.apache.hadoop.hbase.thrift.TestThriftServer
Tests run: 1, Failures: 0, Errors: 0, Skipped: 0, Time elapsed: 42.404 sec
Running org.apache.hadoop.hbase.master.TestDistributedLogSplitting
Tests run: 4, Failures: 0, Errors: 0, Skipped: 0, Time elapsed: 152.131 sec
Running org.apache.hadoop.hbase.TestHServerInfo
Tests run: 6, Failures: 0, Errors: 0, Skipped: 0, Time elapsed: 0.024 sec
Running org.apache.hadoop.hbase.regionserver.TestRpcMetrics
Tests run: 1, Failures: 0, Errors: 0, Skipped: 0, Time elapsed: 1.248 sec
Running org.apache.hadoop.hbase.filter.TestColumnPrefixFilter
Tests run: 2, Failures: 0, Errors: 0, Skipped: 0, Time elapsed: 2.245 sec
Running org.apache.hadoop.hbase.master.TestZKBasedOpenCloseRegion
Tests run: 3, Failures: 0, Errors: 0, Skipped: 0, Time elapsed: 41.119 sec
Running org.apache.hadoop.hbase.regionserver.TestServerCustomProtocol
Tests run: 6, Failures: 0, Errors: 0, Skipped: 0, Time elapsed: 28.303 sec
Running org.apache.hadoop.hbase.TestCompare
Tests run: 1, Failures: 0, Errors: 0, Skipped: 0, Time elapsed: 0.015 sec
Running org.apache.hadoop.hbase.regionserver.TestExplicitColumnTracker
Tests run: 4, Failures: 0, Errors: 0, Skipped: 0, Time elapsed: 0.366 sec
Running org.apache.hadoop.hbase.util.TestEnvironmentEdgeManager
Tests run: 2, Failures: 0, Errors: 0, Skipped: 0, Time elapsed: 0.177 sec
Running org.apache.hadoop.hbase.io.TestHalfStoreFileReader
Tests run: 1, Failures: 0, Errors: 0, Skipped: 0, Time elapsed: 0.214 sec
Running org.apache.hadoop.hbase.util.TestDefaultEnvironmentEdge
Tests run: 1, Failures: 0, Errors: 0, Skipped: 0, Time elapsed: 0.016 sec
Running org.apache.hadoop.hbase.rest.TestTransform
Tests run: 1, Failures: 0, Errors: 0, Skipped: 0, Time elapsed: 24.593 sec
Running org.apache.hadoop.hbase.util.TestFSUtils
Tests run: 1, Failures: 0, Errors: 0, Skipped: 0, Time elapsed: 9.885 sec
Running org.apache.hadoop.hbase.filter.TestBitComparator
Tests run: 3, Failures: 0, Errors: 0, Skipped: 0, Time elapsed: 0.018 sec
Running org.apache.hadoop.hbase.security.TestUser
Tests run: 2, Failures: 0, Errors: 0, Skipped: 0, Time elapsed: 0.034 sec
Running org.apache.hadoop.hbase.master.TestMasterTransitions
Tests run: 3, Failures: 0, Errors: 0, Skipped: 3, Time elapsed: 28.747 sec
Running org.apache.hadoop.hbase.regionserver.TestScanWildcardColumnTracker
Tests run: 2, Failures: 0, Errors: 0, Skipped: 0, Time elapsed: 0.086 sec
Running org.apache.hadoop.hbase.regionserver.TestKeyValueSkipListSet
Tests run: 4, Failures: 0, Errors: 0, Skipped: 0, Time elapsed: 0.02 sec
Running org.apache.hadoop.hbase.filter.TestPageFilter
Tests run: 2, Failures: 0, Errors: 0, Skipped: 0, Time elapsed: 0.016 sec
Running org.apache.hadoop.hbase.io.hfile.TestSeekTo
Tests run: 3, Failures: 0, Errors: 0, Skipped: 0, Time elapsed: 0.201 sec
Running org.apache.hadoop.hbase.filter.TestColumnPaginationFilter
Tests run: 1, Failures: 0, Errors: 0, Skipped: 0, Time elapsed: 0.015 sec
Running org.apache.hadoop.hbase.rest.TestStatusResource
Tests run: 2, Failures: 0, Errors: 0, Skipped: 0, Time elapsed: 30.886 sec
Running org.apache.hadoop.hbase.coprocessor.TestCoprocessorEndpoint
Tests run: 2, Failures: 0, Errors: 0, Skipped: 0, Time elapsed: 36.413 sec
Running org.apache.hadoop.hbase.executor.TestExecutorService
Tests run: 1, Failures: 0, Errors: 0, Skipped: 0, Time elapsed: 2.175 sec
Running org.apache.hadoop.hbase.client.TestFromClientSide
Tests run: 45, Failures: 0, Errors: 0, Skipped: 3, Time elapsed: 149.245 sec
Running org.apache.hadoop.hbase.replication.TestReplication
Tests run: 7, Failures: 0, Errors: 0, Skipped: 0, Time elapsed: 143.396 sec
Running org.apache.hadoop.hbase.regionserver.TestCompaction
Tests run: 9, Failures: 0, Errors: 0, Skipped: 0, Time elapsed: 141.128 sec
Running org.apache.hadoop.hbase.filter.TestSingleColumnValueFilter
Tests run: 2, Failures: 0, Errors: 0, Skipped: 0, Time elapsed: 0.035 sec
Running org.apache.hadoop.hbase.mapreduce.TestTimeRangeMapRed
Tests run: 1, Failures: 0, Errors: 0, Skipped: 0, Time elapsed: 35.657 sec
Running org.apache.hadoop.hbase.TestHServerAddress
Tests run: 6, Failures: 0, Errors: 0, Skipped: 0, Time elapsed: 0.024 sec
Running org.apache.hadoop.hbase.zookeeper.TestZooKeeperMainServerArg
Tests run: 1, Failures: 0, Errors: 0, Skipped: 0, Time elapsed: 0.025 sec
Running org.apache.hadoop.hbase.mapreduce.TestSimpleTotalOrderPartitioner
Tests run: 1, Failures: 0, Errors: 0, Skipped: 0, Time elapsed: 0.089 sec
Running org.apache.hadoop.hbase.master.TestClockSkewDetection
Tests run: 1, Failures: 0, Errors: 0, Skipped: 0, Time elapsed: 0.057 sec
Running org.apache.hadoop.hbase.mapreduce.TestHFileOutputFormat
Tests run: 7, Failures: 0, Errors: 0, Skipped: 0, Time elapsed: 148.798 sec
Running org.apache.hadoop.hbase.regionserver.TestFSErrorsExposed
Tests run: 3, Failures: 0, Errors: 0, Skipped: 0, Time elapsed: 50.97 sec
Running org.apache.hadoop.hbase.client.replication.TestReplicationAdmin
Tests run: 1, Failures: 0, Errors: 0, Skipped: 0, Time elapsed: 1.956 sec
Running org.apache.hadoop.hbase.client.TestGet
Tests run: 2, Failures: 0, Errors: 0, Skipped: 0, Time elapsed: 0.018 sec
Running org.apache.hadoop.hbase.regionserver.TestScanDeleteTracker
Tests run: 6, Failures: 0, Errors: 0, Skipped: 0, Time elapsed: 0.127 sec
Running org.apache.hadoop.hbase.client.TestMetaScanner
Tests run: 1, Failures: 0, Errors: 0, Skipped: 0, Time elapsed: 30.299 sec
Running org.apache.hadoop.hbase.metrics.TestMetricsMBeanBase
Tests run: 2, Failures: 0, Errors: 0, Skipped: 0, Time elapsed: 0.037 sec
Running org.apache.hadoop.hbase.TestRegionRebalancing
Tests run: 1, Failures: 0, Errors: 0, Skipped: 0, Time elapsed: 83.231 sec
Running org.apache.hadoop.hbase.regionserver.TestSplitLogWorker
Tests run: 5, Failures: 0, Errors: 0, Skipped: 0, Time elapsed: 3.239 sec
Running org.apache.hadoop.hbase.rest.TestMultiRowResource
Tests run: 3, Failures: 0, Errors: 0, Skipped: 0, Time elapsed: 34.433 sec
Running org.apache.hadoop.hbase.filter.TestInclusiveStopFilter
Tests run: 2, Failures: 0, Errors: 0, Skipped: 0, Time elapsed: 0.016 sec
Running org.apache.hadoop.hbase.rest.TestTableResource
Tests run: 8, Failures: 0, Errors: 0, Skipped: 0, Time elapsed: 76.778 sec
Running org.apache.hadoop.hbase.mapreduce.TestTableSplit
Tests run: 1, Failures: 0, Errors: 0, Skipped: 0, Time elapsed: 0.027 sec
Running org.apache.hadoop.hbase.filter.TestSingleColumnValueExcludeFilter
Tests run: 1, Failures: 0, Errors: 0, Skipped: 0, Time elapsed: 0.016 sec
Running org.apache.hadoop.hbase.TestHBaseTestingUtility
Tests run: 6, Failures: 0, Errors: 0, Skipped: 0, Time elapsed: 75.974 sec
Running org.apache.hadoop.hbase.mapreduce.TestLoadIncrementalHFiles
Tests run: 4, Failures: 0, Errors: 0, Skipped: 0, Time elapsed: 43.811 sec
Running org.apache.hadoop.hbase.regionserver.wal.TestWALReplay
Tests run: 4, Failures: 0, Errors: 0, Skipped: 0, Time elapsed: 40.619 sec
Running org.apache.hadoop.hbase.rest.TestSchemaResource
Tests run: 2, Failures: 0, Errors: 0, Skipped: 0, Time elapsed: 32.102 sec
Running org.apache.hadoop.hbase.regionserver.TestKeyValueScanFixture
Tests run: 1, Failures: 0, Errors: 0, Skipped: 0, Time elapsed: 0.023 sec
Running org.apache.hadoop.hbase.rest.model.TestTableListModel
Tests run: 3, Failures: 0, Errors: 0, Skipped: 0, Time elapsed: 0.131 sec
Running org.apache.hadoop.hbase.rest.model.TestColumnSchemaModel
Tests run: 2, Failures: 0, Errors: 0, Skipped: 0, Time elapsed: 0.037 sec
Running org.apache.hadoop.hbase.regionserver.TestStoreFile
Tests run: 8, Failures: 0, Errors: 0, Skipped: 0, Time elapsed: 52.735 sec
Running org.apache.hadoop.hbase.zookeeper.TestZooKeeperNodeTracker
Tests run: 2, Failures: 0, Errors: 0, Skipped: 0, Time elapsed: 0.41 sec
Running org.apache.hadoop.hbase.master.TestSplitLogManager
Tests run: 9, Failures: 0, Errors: 0, Skipped: 0, Time elapsed: 14.75 sec
Running org.apache.hadoop.hbase.regionserver.wal.TestHLogMethods
Tests run: 3, Failures: 0, Errors: 0, Skipped: 0, Time elapsed: 0.418 sec
Running org.apache.hadoop.hbase.rest.model.TestScannerModel
Tests run: 3, Failures: 0, Errors: 0, Skipped: 0, Time elapsed: 0.149 sec
Running org.apache.hadoop.hbase.rest.TestVersionResource
Tests run: 7, Failures: 0, Errors: 0, Skipped: 0, Time elapsed: 21.45 sec
Running org.apache.hadoop.hbase.filter.TestFilter
Tests run: 18, Failures: 0, Errors: 0, Skipped: 0, Time elapsed: 5.082 sec
Running org.apache.hadoop.hbase.TestServerName
Tests run: 2, Failures: 0, Errors: 0, Skipped: 0, Time elapsed: 0.016 sec
Running org.apache.hadoop.hbase.regionserver.TestWideScanner
Tests run: 1, Failures: 0, Errors: 0, Skipped: 0, Time elapsed: 23.123 sec
Running org.apache.hadoop.hbase.regionserver.TestSplitTransaction
Tests run: 5, Failures: 0, Errors: 0, Skipped: 0, Time elapsed: 3.487 sec
Running org.apache.hadoop.hbase.replication.regionserver.TestReplicationSink
Tests run: 5, Failures: 0, Errors: 0, Skipped: 0, Time elapsed: 29.103 sec
Running org.apache.hadoop.hbase.regionserver.TestGetClosestAtOrBefore
Tests run: 3, Failures: 0, Errors: 0, Skipped: 0, Time elapsed: 15.07 sec
Running org.apache.hadoop.hbase.regionserver.TestReadWriteConsistencyControl
Tests run: 1, Failures: 0, Errors: 0, Skipped: 0, Time elapsed: 10.024 sec
Running org.apache.hadoop.hbase.util.TestMergeTable
Tests run: 1, Failures: 0, Errors: 0, Skipped: 0, Time elapsed: 64.783 sec
Running org.apache.hadoop.hbase.coprocessor.TestMasterObserver
Tests run: 3, Failures: 0, Errors: 0, Skipped: 0, Time elapsed: 28.884 sec
Running org.apache.hadoop.hbase.rest.model.TestVersionModel
Tests run: 3, Failures: 0, Errors: 0, Skipped: 0, Time elapsed: 0.127 sec
Running org.apache.hadoop.hbase.rest.model.TestCellSetModel
Tests run: 3, Failures: 0, Errors: 0, Skipped: 0, Time elapsed: 0.134 sec
Running org.apache.hadoop.hbase.rest.client.TestRemoteTable
Tests run: 3, Failures: 0, Errors: 0, Skipped: 0, Time elapsed: 24.286 sec
Running org.apache.hadoop.hbase.rest.model.TestStorageClusterStatusModel
Tests run: 3, Failures: 0, Errors: 0, Skipped: 0, Time elapsed: 0.139 sec
Running org.apache.hadoop.hbase.monitoring.TestTaskMonitor
Tests run: 3, Failures: 0, Errors: 0, Skipped: 0, Time elapsed: 0.22 sec
Running org.apache.hadoop.hbase.avro.TestAvroServer
Tests run: 3, Failures: 0, Errors: 0, Skipped: 0, Time elapsed: 37.594 sec
Running org.apache.hadoop.hbase.TestFullLogReconstruction
Tests run: 1, Failures: 0, Errors: 0, Skipped: 0, Time elapsed: 67.893 sec
Running org.apache.hadoop.hbase.TestSerialization
Tests run: 18, Failures: 0, Errors: 0, Skipped: 0, Time elapsed: 0.054 sec
Running org.apache.hadoop.hbase.regionserver.TestKeyValueHeap
Tests run: 3, Failures: 0, Errors: 0, Skipped: 0, Time elapsed: 0.096 sec
Running org.apache.hadoop.hbase.regionserver.TestStoreScanner
Tests run: 14, Failures: 0, Errors: 0, Skipped: 0, Time elapsed: 0.031 sec
Running org.apache.hadoop.hbase.io.hfile.TestReseekTo
Tests run: 1, Failures: 0, Errors: 0, Skipped: 0, Time elapsed: 0.194 sec
Running org.apache.hadoop.hbase.regionserver.TestHRegionInfo
Tests run: 2, Failures: 0, Errors: 0, Skipped: 0, Time elapsed: 0.017 sec
Running org.apache.hadoop.hbase.regionserver.TestScanner
Tests run: 6, Failures: 0, Errors: 0, Skipped: 0, Time elapsed: 72.907 sec
Running org.apache.hadoop.hbase.util.TestIncrementingEnvironmentEdge
Tests run: 1, Failures: 0, Errors: 0, Skipped: 0, Time elapsed: 0.016 sec
Running org.apache.hadoop.hbase.util.TestKeying
Tests run: 1, Failures: 0, Errors: 0, Skipped: 0, Time elapsed: 0.016 sec
Running org.apache.hadoop.hbase.util.TestHBaseFsck
Tests run: 2, Failures: 0, Errors: 0, Skipped: 0, Time elapsed: 37.39 sec
Running org.apache.hadoop.hbase.master.TestRestartCluster
Tests run: 2, Failures: 0, Errors: 0, Skipped: 0, Time elapsed: 58.267 sec
Running org.apache.hadoop.hbase.client.TestShell
killed.
[INFO] ------------------------------------------------------------------------
[ERROR] BUILD ERROR
[INFO] ------------------------------------------------------------------------
[INFO] Error while executing forked tests.; nested exception is org.apache.maven.surefire.booter.shade.org.codehaus.plexus.util.cli.CommandLineException: Error while executing external command, process killed.

Process timeout out after 900 seconds
[INFO] ------------------------------------------------------------------------
[INFO] For more information, run Maven with the -e switch
[INFO] ------------------------------------------------------------------------
[INFO] Total time: 75 minutes 19 seconds
[INFO] Finished at: Tue Jun 14 21:34:36 UTC 2011
[INFO] Final Memory: 94M/1073M
[INFO] ------------------------------------------------------------------------
[locks-and-latches] Releasing all the locks
[locks-and-latches] All the locks released
Archiving artifacts
Recording test results


Build failed in Jenkins: HBase-TRUNK #1969

Posted by Apache Jenkins Server <je...@builds.apache.org>.
See <https://builds.apache.org/job/HBase-TRUNK/1969/changes>

Changes:

[stack] HBASE-451 Remove HTableDescriptor from HRegionInfo

[stack] HBASE-3963  Schedule all log-spliiting at startup all at once -- reverse test for wals with no server (was wrong)

------------------------------------------
[...truncated 3478 lines...]
Tests run: 1, Failures: 0, Errors: 0, Skipped: 0, Time elapsed: 0.021 sec
Running org.apache.hadoop.hbase.TestHBaseTestingUtility
Tests run: 6, Failures: 0, Errors: 0, Skipped: 0, Time elapsed: 82.196 sec
Running org.apache.hadoop.hbase.mapreduce.TestLoadIncrementalHFiles
Tests run: 4, Failures: 0, Errors: 0, Skipped: 0, Time elapsed: 72.754 sec
Running org.apache.hadoop.hbase.regionserver.wal.TestWALReplay
Tests run: 4, Failures: 0, Errors: 0, Skipped: 0, Time elapsed: 49.327 sec
Running org.apache.hadoop.hbase.rest.TestSchemaResource
Tests run: 2, Failures: 0, Errors: 0, Skipped: 0, Time elapsed: 30.662 sec
Running org.apache.hadoop.hbase.regionserver.TestKeyValueScanFixture
Tests run: 1, Failures: 0, Errors: 0, Skipped: 0, Time elapsed: 0.025 sec
Running org.apache.hadoop.hbase.rest.model.TestTableListModel
Tests run: 3, Failures: 0, Errors: 0, Skipped: 0, Time elapsed: 0.14 sec
Running org.apache.hadoop.hbase.rest.model.TestColumnSchemaModel
Tests run: 2, Failures: 0, Errors: 0, Skipped: 0, Time elapsed: 0.031 sec
Running org.apache.hadoop.hbase.regionserver.TestStoreFile
Tests run: 8, Failures: 0, Errors: 0, Skipped: 0, Time elapsed: 45.144 sec
Running org.apache.hadoop.hbase.zookeeper.TestZooKeeperNodeTracker
Tests run: 2, Failures: 0, Errors: 0, Skipped: 0, Time elapsed: 0.418 sec
Running org.apache.hadoop.hbase.master.TestSplitLogManager
Tests run: 9, Failures: 0, Errors: 0, Skipped: 0, Time elapsed: 13.589 sec
Running org.apache.hadoop.hbase.regionserver.wal.TestHLogMethods
Tests run: 3, Failures: 0, Errors: 0, Skipped: 0, Time elapsed: 0.446 sec
Running org.apache.hadoop.hbase.rest.model.TestScannerModel
Tests run: 3, Failures: 0, Errors: 0, Skipped: 0, Time elapsed: 0.132 sec
Running org.apache.hadoop.hbase.rest.TestVersionResource
Tests run: 7, Failures: 0, Errors: 0, Skipped: 0, Time elapsed: 33.472 sec
Running org.apache.hadoop.hbase.filter.TestFilter
Tests run: 18, Failures: 0, Errors: 0, Skipped: 0, Time elapsed: 4.866 sec
Running org.apache.hadoop.hbase.TestServerName
Tests run: 2, Failures: 0, Errors: 0, Skipped: 0, Time elapsed: 0.017 sec
Running org.apache.hadoop.hbase.regionserver.TestWideScanner
Tests run: 1, Failures: 0, Errors: 0, Skipped: 0, Time elapsed: 30.377 sec
Running org.apache.hadoop.hbase.regionserver.TestSplitTransaction
Tests run: 5, Failures: 0, Errors: 0, Skipped: 0, Time elapsed: 3.688 sec
Running org.apache.hadoop.hbase.replication.regionserver.TestReplicationSink
Tests run: 5, Failures: 0, Errors: 0, Skipped: 0, Time elapsed: 37.125 sec
Running org.apache.hadoop.hbase.regionserver.TestGetClosestAtOrBefore
Tests run: 3, Failures: 0, Errors: 0, Skipped: 0, Time elapsed: 14.272 sec
Running org.apache.hadoop.hbase.regionserver.TestReadWriteConsistencyControl
Tests run: 1, Failures: 0, Errors: 0, Skipped: 0, Time elapsed: 10.031 sec
Running org.apache.hadoop.hbase.util.TestMergeTable
Tests run: 1, Failures: 0, Errors: 0, Skipped: 0, Time elapsed: 57.4 sec
Running org.apache.hadoop.hbase.coprocessor.TestMasterObserver
Tests run: 3, Failures: 0, Errors: 0, Skipped: 0, Time elapsed: 30.738 sec
Running org.apache.hadoop.hbase.rest.model.TestVersionModel
Tests run: 3, Failures: 0, Errors: 0, Skipped: 0, Time elapsed: 0.146 sec
Running org.apache.hadoop.hbase.rest.model.TestCellSetModel
Tests run: 3, Failures: 0, Errors: 0, Skipped: 0, Time elapsed: 0.133 sec
Running org.apache.hadoop.hbase.rest.client.TestRemoteTable
Tests run: 3, Failures: 0, Errors: 0, Skipped: 0, Time elapsed: 23.305 sec
Running org.apache.hadoop.hbase.rest.model.TestStorageClusterStatusModel
Tests run: 3, Failures: 0, Errors: 0, Skipped: 0, Time elapsed: 0.133 sec
Running org.apache.hadoop.hbase.monitoring.TestTaskMonitor
Tests run: 3, Failures: 0, Errors: 0, Skipped: 0, Time elapsed: 0.217 sec
Running org.apache.hadoop.hbase.avro.TestAvroServer
Tests run: 3, Failures: 0, Errors: 0, Skipped: 0, Time elapsed: 49.978 sec
Running org.apache.hadoop.hbase.TestFullLogReconstruction
Tests run: 1, Failures: 0, Errors: 0, Skipped: 0, Time elapsed: 58.342 sec
Running org.apache.hadoop.hbase.TestSerialization
Tests run: 18, Failures: 0, Errors: 0, Skipped: 0, Time elapsed: 0.058 sec
Running org.apache.hadoop.hbase.regionserver.TestKeyValueHeap
Tests run: 3, Failures: 0, Errors: 0, Skipped: 0, Time elapsed: 2.755 sec
Running org.apache.hadoop.hbase.regionserver.TestStoreScanner
Tests run: 14, Failures: 0, Errors: 0, Skipped: 0, Time elapsed: 0.121 sec
Running org.apache.hadoop.hbase.io.hfile.TestReseekTo
Tests run: 1, Failures: 0, Errors: 0, Skipped: 0, Time elapsed: 0.285 sec
Running org.apache.hadoop.hbase.regionserver.TestHRegionInfo
Tests run: 2, Failures: 0, Errors: 0, Skipped: 0, Time elapsed: 0.017 sec
Running org.apache.hadoop.hbase.regionserver.TestScanner
Tests run: 6, Failures: 0, Errors: 0, Skipped: 0, Time elapsed: 120.907 sec
Running org.apache.hadoop.hbase.util.TestIncrementingEnvironmentEdge
Tests run: 1, Failures: 0, Errors: 0, Skipped: 0, Time elapsed: 0.028 sec
Running org.apache.hadoop.hbase.util.TestKeying
Tests run: 1, Failures: 0, Errors: 0, Skipped: 0, Time elapsed: 0.028 sec
Running org.apache.hadoop.hbase.util.TestHBaseFsck
Tests run: 2, Failures: 0, Errors: 0, Skipped: 0, Time elapsed: 40.558 sec
Running org.apache.hadoop.hbase.master.TestRestartCluster
Tests run: 2, Failures: 0, Errors: 0, Skipped: 0, Time elapsed: 58.662 sec
Running org.apache.hadoop.hbase.client.TestShell
Tests run: 1, Failures: 0, Errors: 0, Skipped: 0, Time elapsed: 42.621 sec
Running org.apache.hadoop.hbase.rest.model.TestTableInfoModel
Tests run: 3, Failures: 0, Errors: 0, Skipped: 0, Time elapsed: 0.133 sec
Running org.apache.hadoop.hbase.TestInfoServers
Tests run: 2, Failures: 0, Errors: 0, Skipped: 0, Time elapsed: 40.372 sec
Running org.apache.hadoop.hbase.master.TestLogsCleaner
Tests run: 1, Failures: 0, Errors: 0, Skipped: 0, Time elapsed: 1.369 sec
Running org.apache.hadoop.hbase.client.TestAttributes
Tests run: 3, Failures: 0, Errors: 0, Skipped: 0, Time elapsed: 0.024 sec
Running org.apache.hadoop.hbase.regionserver.TestMasterAddressManager
Tests run: 1, Failures: 0, Errors: 0, Skipped: 0, Time elapsed: 0.298 sec
Running org.apache.hadoop.hbase.master.TestMasterStatusServlet
Tests run: 4, Failures: 0, Errors: 0, Skipped: 0, Time elapsed: 0.646 sec
Running org.apache.hadoop.hbase.catalog.TestCatalogTrackerOnCluster
Tests run: 1, Failures: 0, Errors: 0, Skipped: 0, Time elapsed: 210.7 sec
Running org.apache.hadoop.hbase.regionserver.TestQueryMatcher
Tests run: 4, Failures: 0, Errors: 0, Skipped: 0, Time elapsed: 0.106 sec
Running org.apache.hadoop.hbase.zookeeper.TestZKTable
Tests run: 1, Failures: 0, Errors: 0, Skipped: 0, Time elapsed: 0.343 sec
Running org.apache.hadoop.hbase.client.TestAdmin
Tests run: 19, Failures: 1, Errors: 0, Skipped: 0, Time elapsed: 345.406 sec <<< FAILURE!
Running org.apache.hadoop.hbase.util.TestSortedCopyOnWriteSet
Tests run: 2, Failures: 0, Errors: 0, Skipped: 0, Time elapsed: 0.029 sec
Running org.apache.hadoop.hbase.util.TestMergeTool
Tests run: 1, Failures: 0, Errors: 0, Skipped: 0, Time elapsed: 29.8 sec
Running org.apache.hadoop.hbase.TestAcidGuarantees
Tests run: 3, Failures: 0, Errors: 0, Skipped: 3, Time elapsed: 0.015 sec
Running org.apache.hadoop.hbase.TestHRegionLocation
Tests run: 3, Failures: 0, Errors: 0, Skipped: 0, Time elapsed: 0.018 sec
Running org.apache.hadoop.hbase.util.TestBase64
Tests run: 1, Failures: 0, Errors: 0, Skipped: 0, Time elapsed: 0.017 sec
Running org.apache.hadoop.hbase.coprocessor.TestRegionObserverStacking
Tests run: 1, Failures: 0, Errors: 0, Skipped: 0, Time elapsed: 0.367 sec
Running org.apache.hadoop.hbase.regionserver.TestMemStore
Tests run: 21, Failures: 0, Errors: 0, Skipped: 0, Time elapsed: 45.331 sec
Running org.apache.hadoop.hbase.rest.TestScannerResource
Tests run: 5, Failures: 0, Errors: 0, Skipped: 0, Time elapsed: 100.357 sec
Running org.apache.hadoop.hbase.io.hfile.TestLruBlockCache
Tests run: 7, Failures: 0, Errors: 0, Skipped: 0, Time elapsed: 1.056 sec
Running org.apache.hadoop.hbase.master.TestDeadServer
Tests run: 1, Failures: 0, Errors: 0, Skipped: 0, Time elapsed: 0.019 sec
Running org.apache.hadoop.hbase.rest.TestGzipFilter
Tests run: 2, Failures: 0, Errors: 0, Skipped: 0, Time elapsed: 24.942 sec
Running org.apache.hadoop.hbase.mapreduce.TestTableMapReduce
Tests run: 2, Failures: 0, Errors: 0, Skipped: 0, Time elapsed: 123.212 sec
Running org.apache.hadoop.hbase.TestKeyValue
Tests run: 9, Failures: 0, Errors: 0, Skipped: 0, Time elapsed: 0.025 sec
Running org.apache.hadoop.hbase.filter.TestColumnRangeFilter
Tests run: 1, Failures: 0, Errors: 0, Skipped: 0, Time elapsed: 40.949 sec
Running org.apache.hadoop.hbase.client.TestMultiParallel
Tests run: 10, Failures: 0, Errors: 0, Skipped: 0, Time elapsed: 34.328 sec
Running org.apache.hadoop.hbase.master.TestMaster
Tests run: 1, Failures: 0, Errors: 0, Skipped: 0, Time elapsed: 89.076 sec
Running org.apache.hadoop.hbase.master.TestRollingRestart
Tests run: 1, Failures: 0, Errors: 0, Skipped: 0, Time elapsed: 85.339 sec
Running org.apache.hadoop.hbase.client.TestResult
Tests run: 2, Failures: 0, Errors: 0, Skipped: 0, Time elapsed: 0.038 sec
Running org.apache.hadoop.hbase.client.TestHTablePool
Tests run: 10, Failures: 0, Errors: 0, Skipped: 0, Time elapsed: 186.803 sec
Running org.apache.hadoop.hbase.regionserver.TestRSStatusServlet
Tests run: 2, Failures: 0, Errors: 0, Skipped: 0, Time elapsed: 0.275 sec
Running org.apache.hadoop.hbase.regionserver.TestCompactSelection
Tests run: 1, Failures: 0, Errors: 0, Skipped: 0, Time elapsed: 0.306 sec
Running org.apache.hadoop.hbase.util.TestByteBloomFilter
Tests run: 3, Failures: 0, Errors: 0, Skipped: 0, Time elapsed: 1.577 sec
Running org.apache.hadoop.hbase.rest.model.TestTableSchemaModel
Tests run: 3, Failures: 0, Errors: 0, Skipped: 0, Time elapsed: 0.144 sec
Running org.apache.hadoop.hbase.mapreduce.TestTableInputFormatScan
Tests run: 11, Failures: 0, Errors: 0, Skipped: 0, Time elapsed: 334.239 sec
Running org.apache.hadoop.hbase.filter.TestFilterList
Tests run: 4, Failures: 0, Errors: 0, Skipped: 0, Time elapsed: 0.052 sec
Running org.apache.hadoop.hbase.regionserver.TestHRegion
Tests run: 54, Failures: 0, Errors: 0, Skipped: 0, Time elapsed: 37.734 sec
Running org.apache.hadoop.hbase.master.TestMasterFailover
Tests run: 3, Failures: 0, Errors: 1, Skipped: 0, Time elapsed: 236.042 sec <<< FAILURE!
Running org.apache.hadoop.hbase.client.TestScan
Tests run: 2, Failures: 0, Errors: 0, Skipped: 0, Time elapsed: 0.019 sec
Running org.apache.hadoop.hbase.rest.model.TestTableRegionModel
Tests run: 4, Failures: 0, Errors: 0, Skipped: 0, Time elapsed: 0.032 sec
Running org.apache.hadoop.hbase.client.TestTimestampsFilter
Tests run: 3, Failures: 0, Errors: 0, Skipped: 0, Time elapsed: 32.634 sec
Running org.apache.hadoop.hbase.master.TestLoadBalancer
Tests run: 5, Failures: 0, Errors: 0, Skipped: 0, Time elapsed: 2.131 sec
Running org.apache.hadoop.hbase.util.TestRootPath
Tests run: 1, Failures: 0, Errors: 0, Skipped: 0, Time elapsed: 0.021 sec
Running org.apache.hadoop.hbase.client.TestScannerTimeout
Tests run: 4, Failures: 0, Errors: 0, Skipped: 0, Time elapsed: 50.009 sec
Running org.apache.hadoop.hbase.regionserver.wal.TestWALObserver
Tests run: 1, Failures: 0, Errors: 0, Skipped: 0, Time elapsed: 0.394 sec
Running org.apache.hadoop.hbase.mapred.TestTableMapReduce
Tests run: 1, Failures: 0, Errors: 0, Skipped: 0, Time elapsed: 57.314 sec
Running org.apache.hadoop.hbase.coprocessor.TestAggregateProtocol
Tests run: 44, Failures: 0, Errors: 0, Skipped: 0, Time elapsed: 21.885 sec
Running org.apache.hadoop.hbase.master.TestActiveMasterManager
Tests run: 2, Failures: 0, Errors: 0, Skipped: 0, Time elapsed: 0.657 sec
Running org.apache.hadoop.hbase.util.TestBytes
Tests run: 10, Failures: 0, Errors: 0, Skipped: 0, Time elapsed: 0.021 sec
Running org.apache.hadoop.hbase.filter.TestRandomRowFilter
Tests run: 2, Failures: 0, Errors: 0, Skipped: 0, Time elapsed: 0.432 sec
Running org.apache.hadoop.hbase.replication.regionserver.TestReplicationSourceManager
Tests run: 1, Failures: 0, Errors: 0, Skipped: 0, Time elapsed: 0.997 sec
Running org.apache.hadoop.hbase.util.TestCompressionTest
Tests run: 1, Failures: 0, Errors: 0, Skipped: 0, Time elapsed: 0.032 sec
Running org.apache.hadoop.hbase.client.TestMetaMigration
Tests run: 3, Failures: 0, Errors: 0, Skipped: 0, Time elapsed: 29.265 sec
Running org.apache.hadoop.hbase.client.TestGetRowVersions
Tests run: 1, Failures: 0, Errors: 0, Skipped: 0, Time elapsed: 33.473 sec
Running org.apache.hadoop.hbase.filter.TestDependentColumnFilter
Tests run: 2, Failures: 0, Errors: 0, Skipped: 0, Time elapsed: 0.449 sec
Running org.apache.hadoop.hbase.rest.model.TestCellModel
Tests run: 3, Failures: 0, Errors: 0, Skipped: 0, Time elapsed: 0.127 sec
Running org.apache.hadoop.hbase.master.TestCatalogJanitor
Tests run: 2, Failures: 0, Errors: 0, Skipped: 0, Time elapsed: 0.627 sec
Running org.apache.hadoop.hbase.catalog.TestCatalogTracker
Tests run: 8, Failures: 0, Errors: 0, Skipped: 0, Time elapsed: 3.023 sec
Running org.apache.hadoop.hbase.replication.TestReplicationSource
Tests run: 1, Failures: 0, Errors: 0, Skipped: 0, Time elapsed: 11.158 sec
Running org.apache.hadoop.hbase.coprocessor.TestWALObserver
Tests run: 3, Failures: 0, Errors: 0, Skipped: 0, Time elapsed: 29.718 sec
Running org.apache.hadoop.hbase.rest.TestRowResource
Tests run: 10, Failures: 0, Errors: 0, Skipped: 0, Time elapsed: 26.85 sec
Running org.apache.hadoop.hbase.io.hfile.TestHFile
Tests run: 7, Failures: 0, Errors: 0, Skipped: 0, Time elapsed: 0.356 sec
Running org.apache.hadoop.hbase.catalog.TestMetaReaderEditor
Tests run: 4, Failures: 0, Errors: 0, Skipped: 0, Time elapsed: 28.897 sec
Running org.apache.hadoop.hbase.mapreduce.TestImportTsv
Tests run: 8, Failures: 0, Errors: 0, Skipped: 0, Time elapsed: 45.164 sec
Running org.apache.hadoop.hbase.rest.client.TestRemoteAdmin
Tests run: 2, Failures: 0, Errors: 0, Skipped: 0, Time elapsed: 28.042 sec
Running org.apache.hadoop.hbase.regionserver.wal.TestHLog
Tests run: 9, Failures: 0, Errors: 0, Skipped: 0, Time elapsed: 83.072 sec
Running org.apache.hadoop.hbase.client.TestTimestamp
Tests run: 1, Failures: 0, Errors: 0, Skipped: 0, Time elapsed: 35.588 sec
Running org.apache.hadoop.hbase.TestScanMultipleVersions
Tests run: 1, Failures: 0, Errors: 0, Skipped: 0, Time elapsed: 33.833 sec
Running org.apache.hadoop.hbase.util.TestPoolMap
Tests run: 9, Failures: 0, Errors: 0, Skipped: 0, Time elapsed: 0.033 sec
Running org.apache.hadoop.hbase.TestGlobalMemStoreSize
Tests run: 1, Failures: 0, Errors: 0, Skipped: 0, Time elapsed: 17.914 sec
Running org.apache.hadoop.hbase.rest.model.TestStorageClusterVersionModel
Tests run: 2, Failures: 0, Errors: 0, Skipped: 0, Time elapsed: 0.03 sec
Running org.apache.hadoop.hbase.client.TestHCM
Tests run: 3, Failures: 0, Errors: 0, Skipped: 0, Time elapsed: 24.788 sec

Results :

Failed tests: 

Tests in error: 

Tests run: 805, Failures: 1, Errors: 1, Skipped: 9

[INFO] ------------------------------------------------------------------------
[ERROR] BUILD FAILURE
[INFO] ------------------------------------------------------------------------
[INFO] There are test failures.

Please refer to <https://builds.apache.org/job/HBase-TRUNK/ws/trunk/target/surefire-reports> for the individual test results.
[INFO] ------------------------------------------------------------------------
[INFO] For more information, run Maven with the -e switch
[INFO] ------------------------------------------------------------------------
[INFO] Total time: 111 minutes 18 seconds
[INFO] Finished at: Tue Jun 14 08:25:17 UTC 2011
[INFO] Final Memory: 91M/1054M
[INFO] ------------------------------------------------------------------------
[locks-and-latches] Releasing all the locks
[locks-and-latches] All the locks released
Archiving artifacts
Recording test results


Build failed in Jenkins: HBase-TRUNK #1968

Posted by Apache Jenkins Server <je...@builds.apache.org>.
See <https://builds.apache.org/job/HBase-TRUNK/1968/changes>

Changes:

[todd] HBASE-3916. Fix the default bind address of ThriftServer to be wildcard instead of localhost. Contributed by Li Pi

[stack] HBASE-3793 HBASE-3468 Broke checkAndPut with null value

[stack] HBASE-3983 list command in shell seems broken -- Changed @mac_width to @max_width -- noticed by Todd

[stack] HBASE-3983 list command in shell seems broken

------------------------------------------
[...truncated 3108 lines...]
Generating <https://builds.apache.org/job/HBase-TRUNK/ws/trunk/target/site/apidocs/org/apache/hbase/tmpl/common//class-use/TaskMonitorTmpl.html...>
Generating <https://builds.apache.org/job/HBase-TRUNK/ws/trunk/target/site/apidocs/org/apache/hbase/tmpl/common//class-use/TaskMonitorTmpl.Intf.html...>
Generating <https://builds.apache.org/job/HBase-TRUNK/ws/trunk/target/site/apidocs/org/apache/hbase/tmpl/common//class-use/TaskMonitorTmpl.ImplData.html...>
Generating <https://builds.apache.org/job/HBase-TRUNK/ws/trunk/target/site/apidocs/org/apache/hbase/tmpl/common//class-use/TaskMonitorTmplImpl.html...>
Generating <https://builds.apache.org/job/HBase-TRUNK/ws/trunk/target/site/apidocs/org/apache/hadoop/hbase//package-use.html...>
Generating <https://builds.apache.org/job/HBase-TRUNK/ws/trunk/target/site/apidocs/org/apache/hadoop/hbase/avro//package-use.html...>
Generating <https://builds.apache.org/job/HBase-TRUNK/ws/trunk/target/site/apidocs/org/apache/hadoop/hbase/avro/generated//package-use.html...>
Generating <https://builds.apache.org/job/HBase-TRUNK/ws/trunk/target/site/apidocs/org/apache/hadoop/hbase/catalog//package-use.html...>
Generating <https://builds.apache.org/job/HBase-TRUNK/ws/trunk/target/site/apidocs/org/apache/hadoop/hbase/client//package-use.html...>
Generating <https://builds.apache.org/job/HBase-TRUNK/ws/trunk/target/site/apidocs/org/apache/hadoop/hbase/client/coprocessor//package-use.html...>
Generating <https://builds.apache.org/job/HBase-TRUNK/ws/trunk/target/site/apidocs/org/apache/hadoop/hbase/client/replication//package-use.html...>
Generating <https://builds.apache.org/job/HBase-TRUNK/ws/trunk/target/site/apidocs/org/apache/hadoop/hbase/coprocessor//package-use.html...>
Generating <https://builds.apache.org/job/HBase-TRUNK/ws/trunk/target/site/apidocs/org/apache/hadoop/hbase/executor//package-use.html...>
Generating <https://builds.apache.org/job/HBase-TRUNK/ws/trunk/target/site/apidocs/org/apache/hadoop/hbase/filter//package-use.html...>
Generating <https://builds.apache.org/job/HBase-TRUNK/ws/trunk/target/site/apidocs/org/apache/hadoop/hbase/generated/master//package-use.html...>
Generating <https://builds.apache.org/job/HBase-TRUNK/ws/trunk/target/site/apidocs/org/apache/hadoop/hbase/generated/regionserver//package-use.html...>
Generating <https://builds.apache.org/job/HBase-TRUNK/ws/trunk/target/site/apidocs/org/apache/hadoop/hbase/io//package-use.html...>
Generating <https://builds.apache.org/job/HBase-TRUNK/ws/trunk/target/site/apidocs/org/apache/hadoop/hbase/io/hfile//package-use.html...>
Generating <https://builds.apache.org/job/HBase-TRUNK/ws/trunk/target/site/apidocs/org/apache/hadoop/hbase/ipc//package-use.html...>
Generating <https://builds.apache.org/job/HBase-TRUNK/ws/trunk/target/site/apidocs/org/apache/hadoop/hbase/mapred//package-use.html...>
Generating <https://builds.apache.org/job/HBase-TRUNK/ws/trunk/target/site/apidocs/org/apache/hadoop/hbase/mapreduce//package-use.html...>
Generating <https://builds.apache.org/job/HBase-TRUNK/ws/trunk/target/site/apidocs/org/apache/hadoop/hbase/mapreduce/hadoopbackport//package-use.html...>
Generating <https://builds.apache.org/job/HBase-TRUNK/ws/trunk/target/site/apidocs/org/apache/hadoop/hbase/mapreduce/replication//package-use.html...>
Generating <https://builds.apache.org/job/HBase-TRUNK/ws/trunk/target/site/apidocs/org/apache/hadoop/hbase/master//package-use.html...>
Generating <https://builds.apache.org/job/HBase-TRUNK/ws/trunk/target/site/apidocs/org/apache/hadoop/hbase/master/handler//package-use.html...>
Generating <https://builds.apache.org/job/HBase-TRUNK/ws/trunk/target/site/apidocs/org/apache/hadoop/hbase/master/metrics//package-use.html...>
Generating <https://builds.apache.org/job/HBase-TRUNK/ws/trunk/target/site/apidocs/org/apache/hadoop/hbase/metrics//package-use.html...>
Generating <https://builds.apache.org/job/HBase-TRUNK/ws/trunk/target/site/apidocs/org/apache/hadoop/hbase/metrics/file//package-use.html...>
Generating <https://builds.apache.org/job/HBase-TRUNK/ws/trunk/target/site/apidocs/org/apache/hadoop/hbase/monitoring//package-use.html...>
Generating <https://builds.apache.org/job/HBase-TRUNK/ws/trunk/target/site/apidocs/org/apache/hadoop/hbase/regionserver//package-use.html...>
Generating <https://builds.apache.org/job/HBase-TRUNK/ws/trunk/target/site/apidocs/org/apache/hadoop/hbase/regionserver/compactions//package-use.html...>
Generating <https://builds.apache.org/job/HBase-TRUNK/ws/trunk/target/site/apidocs/org/apache/hadoop/hbase/regionserver/handler//package-use.html...>
Generating <https://builds.apache.org/job/HBase-TRUNK/ws/trunk/target/site/apidocs/org/apache/hadoop/hbase/regionserver/metrics//package-use.html...>
Generating <https://builds.apache.org/job/HBase-TRUNK/ws/trunk/target/site/apidocs/org/apache/hadoop/hbase/regionserver/wal//package-use.html...>
Generating <https://builds.apache.org/job/HBase-TRUNK/ws/trunk/target/site/apidocs/org/apache/hadoop/hbase/replication//package-use.html...>
Generating <https://builds.apache.org/job/HBase-TRUNK/ws/trunk/target/site/apidocs/org/apache/hadoop/hbase/replication/master//package-use.html...>
Generating <https://builds.apache.org/job/HBase-TRUNK/ws/trunk/target/site/apidocs/org/apache/hadoop/hbase/replication/regionserver//package-use.html...>
Generating <https://builds.apache.org/job/HBase-TRUNK/ws/trunk/target/site/apidocs/org/apache/hadoop/hbase/rest//package-use.html...>
Generating <https://builds.apache.org/job/HBase-TRUNK/ws/trunk/target/site/apidocs/org/apache/hadoop/hbase/rest/client//package-use.html...>
Generating <https://builds.apache.org/job/HBase-TRUNK/ws/trunk/target/site/apidocs/org/apache/hadoop/hbase/rest/filter//package-use.html...>
Generating <https://builds.apache.org/job/HBase-TRUNK/ws/trunk/target/site/apidocs/org/apache/hadoop/hbase/rest/metrics//package-use.html...>
Generating <https://builds.apache.org/job/HBase-TRUNK/ws/trunk/target/site/apidocs/org/apache/hadoop/hbase/rest/model//package-use.html...>
Generating <https://builds.apache.org/job/HBase-TRUNK/ws/trunk/target/site/apidocs/org/apache/hadoop/hbase/rest/protobuf/generated//package-use.html...>
Generating <https://builds.apache.org/job/HBase-TRUNK/ws/trunk/target/site/apidocs/org/apache/hadoop/hbase/rest/provider//package-use.html...>
Generating <https://builds.apache.org/job/HBase-TRUNK/ws/trunk/target/site/apidocs/org/apache/hadoop/hbase/rest/provider/consumer//package-use.html...>
Generating <https://builds.apache.org/job/HBase-TRUNK/ws/trunk/target/site/apidocs/org/apache/hadoop/hbase/rest/provider/producer//package-use.html...>
Generating <https://builds.apache.org/job/HBase-TRUNK/ws/trunk/target/site/apidocs/org/apache/hadoop/hbase/rest/transform//package-use.html...>
Generating <https://builds.apache.org/job/HBase-TRUNK/ws/trunk/target/site/apidocs/org/apache/hadoop/hbase/security//package-use.html...>
Generating <https://builds.apache.org/job/HBase-TRUNK/ws/trunk/target/site/apidocs/org/apache/hadoop/hbase/thrift//package-use.html...>
Generating <https://builds.apache.org/job/HBase-TRUNK/ws/trunk/target/site/apidocs/org/apache/hadoop/hbase/thrift/generated//package-use.html...>
Generating <https://builds.apache.org/job/HBase-TRUNK/ws/trunk/target/site/apidocs/org/apache/hadoop/hbase/util//package-use.html...>
Generating <https://builds.apache.org/job/HBase-TRUNK/ws/trunk/target/site/apidocs/org/apache/hadoop/hbase/zookeeper//package-use.html...>
Generating <https://builds.apache.org/job/HBase-TRUNK/ws/trunk/target/site/apidocs/org/apache/hbase/tmpl/common//package-use.html...>
Generating <https://builds.apache.org/job/HBase-TRUNK/ws/trunk/target/site/apidocs/org/apache/hbase/tmpl/master//package-use.html...>
Generating <https://builds.apache.org/job/HBase-TRUNK/ws/trunk/target/site/apidocs/org/apache/hbase/tmpl/regionserver//package-use.html...>
Building index for all the packages and classes...
Generating <https://builds.apache.org/job/HBase-TRUNK/ws/trunk/target/site/apidocs/overview-tree.html...>
Generating <https://builds.apache.org/job/HBase-TRUNK/ws/trunk/target/site/apidocs/index-all.html...>
Generating <https://builds.apache.org/job/HBase-TRUNK/ws/trunk/target/site/apidocs/deprecated-list.html...>
Building index for all classes...
Generating <https://builds.apache.org/job/HBase-TRUNK/ws/trunk/target/site/apidocs/allclasses-frame.html...>
Generating <https://builds.apache.org/job/HBase-TRUNK/ws/trunk/target/site/apidocs/allclasses-noframe.html...>
Generating <https://builds.apache.org/job/HBase-TRUNK/ws/trunk/target/site/apidocs/index.html...>
Generating <https://builds.apache.org/job/HBase-TRUNK/ws/trunk/target/site/apidocs/overview-summary.html...>
Generating <https://builds.apache.org/job/HBase-TRUNK/ws/trunk/target/site/apidocs/help-doc.html...>
Generating <https://builds.apache.org/job/HBase-TRUNK/ws/trunk/target/site/apidocs/stylesheet.css...>
78 warnings
[WARNING] Javadoc Warnings
[WARNING] <https://builds.apache.org/job/HBase-TRUNK/ws/trunk/src/main/java/org/apache/hadoop/hbase/HConstants.java>:434: warning - Tag @link: reference not found: Configuration
[WARNING] <https://builds.apache.org/job/HBase-TRUNK/ws/trunk/src/main/java/org/apache/hadoop/hbase/HConstants.java>:434: warning - Tag @link: reference not found: Configuration
[WARNING] <https://builds.apache.org/job/HBase-TRUNK/ws/trunk/src/main/java/org/apache/hadoop/hbase/HConstants.java>:434: warning - Tag @link: reference not found: Configuration
[WARNING] <https://builds.apache.org/job/HBase-TRUNK/ws/trunk/src/main/java/org/apache/hadoop/hbase/HConstants.java>:434: warning - Tag @link: reference not found: Connection
[WARNING] <https://builds.apache.org/job/HBase-TRUNK/ws/trunk/src/main/java/org/apache/hadoop/hbase/HConstants.java>:434: warning - Tag @link: reference not found: Connection
[WARNING] <https://builds.apache.org/job/HBase-TRUNK/ws/trunk/src/main/java/org/apache/hadoop/hbase/HServerAddress.java>:89: warning - Tag @link: can't find getAddress()#getHostAddress() in java.net.InetSocketAddress
[WARNING] <https://builds.apache.org/job/HBase-TRUNK/ws/trunk/src/main/java/org/apache/hadoop/hbase/HServerInfo.java>:111: warning - Tag @see: can't find getServerName() in org.apache.hadoop.hbase.HServerInfo
[WARNING] <https://builds.apache.org/job/HBase-TRUNK/ws/trunk/src/main/java/org/apache/hadoop/hbase/HServerInfo.java>:111: warning - Tag @see: can't find getLoad() in org.apache.hadoop.hbase.HServerInfo
[WARNING] <https://builds.apache.org/job/HBase-TRUNK/ws/trunk/src/main/java/org/apache/hadoop/hbase/ServerName.java>:42: warning - Tag @link:illegal character: "34" in "#SERVERNAME_SEPARATOR""
[WARNING] <https://builds.apache.org/job/HBase-TRUNK/ws/trunk/src/main/java/org/apache/hadoop/hbase/ServerName.java>:42: warning - Tag @link: can't find SERVERNAME_SEPARATOR" in org.apache.hadoop.hbase.ServerName
[WARNING] <https://builds.apache.org/job/HBase-TRUNK/ws/trunk/src/main/java/org/apache/hadoop/hbase/ServerName.java>:42: warning - @ink is an unknown tag.
[WARNING] <https://builds.apache.org/job/HBase-TRUNK/ws/trunk/src/main/java/org/apache/hadoop/hbase/ServerName.java>:42: warning - @ink is an unknown tag.
[WARNING] <https://builds.apache.org/job/HBase-TRUNK/ws/trunk/src/main/java/org/apache/hadoop/hbase/ServerName.java>:224: warning - @param argument "rigth" is not a parameter name.
[WARNING] <https://builds.apache.org/job/HBase-TRUNK/ws/trunk/src/main/java/org/apache/hadoop/hbase/catalog/CatalogTracker.java>:106: warning - @param argument "connection" is not a parameter name.
[WARNING] <https://builds.apache.org/job/HBase-TRUNK/ws/trunk/src/main/java/org/apache/hadoop/hbase/catalog/CatalogTracker.java>:122: warning - @param argument "connection" is not a parameter name.
[WARNING] <https://builds.apache.org/job/HBase-TRUNK/ws/trunk/src/main/java/org/apache/hadoop/hbase/catalog/MetaReader.java>:559: warning - @param argument "hsi" is not a parameter name.
[WARNING] <https://builds.apache.org/job/HBase-TRUNK/ws/trunk/src/main/java/org/apache/hadoop/hbase/mapreduce/hadoopbackport/InputSampler.java>:165: warning - @return tag has no arguments.
[WARNING] <https://builds.apache.org/job/HBase-TRUNK/ws/trunk/src/main/java/org/apache/hadoop/hbase/client/HTableInterface.java>:371: warning - @return tag has no arguments.
[WARNING] <https://builds.apache.org/job/HBase-TRUNK/ws/trunk/src/main/java/org/apache/hadoop/hbase/client/HTableInterface.java>:396: warning - Tag @link: reference not found: Batch.Call#call(Object)
[WARNING] <https://builds.apache.org/job/HBase-TRUNK/ws/trunk/src/main/java/org/apache/hadoop/hbase/client/HTableInterface.java>:432: warning - Tag @link: reference not found: Batch.Callback#update(byte[], byte[], Object)
[WARNING] <https://builds.apache.org/job/HBase-TRUNK/ws/trunk/src/main/java/org/apache/hadoop/hbase/client/HTableInterface.java>:432: warning - Tag @link: reference not found: Batch.Callback#update(byte[], byte[], Object)
[WARNING] <https://builds.apache.org/job/HBase-TRUNK/ws/trunk/src/main/java/org/apache/hadoop/hbase/zookeeper/RegionServerTracker.java>:46: warning - Tag @link: can't find expireServer(org.apache.hadoop.hbase.HServerInfo) in org.apache.hadoop.hbase.master.ServerManager
[WARNING] <https://builds.apache.org/job/HBase-TRUNK/ws/trunk/src/main/java/org/apache/hadoop/hbase/filter/BitComparator.java>:52: warning - @param argument "BitwiseOp" is not a parameter name.
[WARNING] <https://builds.apache.org/job/HBase-TRUNK/ws/trunk/src/main/java/org/apache/hadoop/hbase/executor/RegionTransitionData.java>:115: warning - @param argument "origin" is not a parameter name.
[WARNING] <https://builds.apache.org/job/HBase-TRUNK/ws/trunk/src/main/java/org/apache/hadoop/hbase/io/hfile/BlockCache.java>:65: warning - @return tag has no arguments.
[WARNING] <https://builds.apache.org/job/HBase-TRUNK/ws/trunk/src/main/java/org/apache/hadoop/hbase/coprocessor/AggregateProtocol.java>:110: warning - @return tag has no arguments.
[WARNING] <https://builds.apache.org/job/HBase-TRUNK/ws/trunk/src/main/java/org/apache/hadoop/hbase/coprocessor/AggregateProtocol.java>:90: warning - @return tag has no arguments.
[WARNING] <https://builds.apache.org/job/HBase-TRUNK/ws/trunk/src/main/java/org/apache/hadoop/hbase/coprocessor/AggregateProtocol.java>:126: warning - @return tag has no arguments.
[WARNING] <https://builds.apache.org/job/HBase-TRUNK/ws/trunk/src/main/java/org/apache/hadoop/hbase/coprocessor/ColumnInterpreter.java>:66: warning - @return tag has no arguments.
[WARNING] <https://builds.apache.org/job/HBase-TRUNK/ws/trunk/src/main/java/org/apache/hadoop/hbase/coprocessor/ColumnInterpreter.java>:99: warning - @return tag has no arguments.
[WARNING] <https://builds.apache.org/job/HBase-TRUNK/ws/trunk/src/main/java/org/apache/hadoop/hbase/coprocessor/ColumnInterpreter.java>:117: warning - @return tag has no arguments.
[WARNING] <https://builds.apache.org/job/HBase-TRUNK/ws/trunk/src/main/java/org/apache/hadoop/hbase/coprocessor/ColumnInterpreter.java>:73: warning - @return tag has no arguments.
[WARNING] <https://builds.apache.org/job/HBase-TRUNK/ws/trunk/src/main/java/org/apache/hadoop/hbase/coprocessor/ColumnInterpreter.java>:79: warning - @return tag has no arguments.
[WARNING] <https://builds.apache.org/job/HBase-TRUNK/ws/trunk/src/main/java/org/apache/hadoop/hbase/coprocessor/ColumnInterpreter.java>:92: warning - @return tag has no arguments.
[WARNING] <https://builds.apache.org/job/HBase-TRUNK/ws/trunk/src/main/java/org/apache/hadoop/hbase/coprocessor/ColumnInterpreter.java>:86: warning - @return tag has no arguments.
[WARNING] <https://builds.apache.org/job/HBase-TRUNK/ws/trunk/src/main/java/org/apache/hadoop/hbase/coprocessor/ColumnInterpreter.java>:56: warning - @param argument "value" is not a parameter name.
[WARNING] <https://builds.apache.org/job/HBase-TRUNK/ws/trunk/src/main/java/org/apache/hadoop/hbase/util/Bytes.java>:740: warning - @return tag has no arguments.
[WARNING] <https://builds.apache.org/job/HBase-TRUNK/ws/trunk/src/main/java/org/apache/hadoop/hbase/util/FSUtils.java>:147: warning - @return tag cannot be used in method with void return type.
[WARNING] <https://builds.apache.org/job/HBase-TRUNK/ws/trunk/src/main/java/org/apache/hadoop/hbase/util/Writables.java>:71: warning - @param argument "w" is not a parameter name.
[WARNING] <https://builds.apache.org/job/HBase-TRUNK/ws/trunk/src/main/java/org/apache/hadoop/hbase/regionserver/HRegion.java>:309: warning - Tag @see: can't find newHRegion(Path, HLog, FileSystem, Configuration, org.apache.hadoop.hbase.HRegionInfo, FlushRequester) in org.apache.hadoop.hbase.regionserver.HRegion
[WARNING] <https://builds.apache.org/job/HBase-TRUNK/ws/trunk/src/main/java/org/apache/hadoop/hbase/regionserver/HRegion.java>:309: warning - Tag @link: can't find newHRegion(Path, HLog, FileSystem, Configuration, org.apache.hadoop.hbase.HRegionInfo, FlushRequester) in org.apache.hadoop.hbase.regionserver.HRegion
[WARNING] <https://builds.apache.org/job/HBase-TRUNK/ws/trunk/src/main/java/org/apache/hadoop/hbase/regionserver/HRegion.java>:1055: warning - Tag @see: can't find internalFlushcache() in org.apache.hadoop.hbase.regionserver.HRegion
[WARNING] <https://builds.apache.org/job/HBase-TRUNK/ws/trunk/src/main/java/org/apache/hadoop/hbase/regionserver/HRegion.java>:2427: warning - @param argument "lockid" is not a parameter name.
[WARNING] <https://builds.apache.org/job/HBase-TRUNK/ws/trunk/src/main/java/org/apache/hadoop/hbase/regionserver/HRegion.java>:2812: warning - @param argument "flusher" is not a parameter name.
[WARNING] <https://builds.apache.org/job/HBase-TRUNK/ws/trunk/src/main/java/org/apache/hadoop/hbase/regionserver/RegionCoprocessorHost.java>:409: warning - @return tag cannot be used in method with void return type.
[WARNING] <https://builds.apache.org/job/HBase-TRUNK/ws/trunk/src/main/java/org/apache/hadoop/hbase/regionserver/SplitLogWorker.java>:546: warning - Tag @link: reference not found: SplitLogManager.TaskFinisher
[WARNING] <https://builds.apache.org/job/HBase-TRUNK/ws/trunk/src/main/java/org/apache/hadoop/hbase/regionserver/SplitTransaction.java>:84: warning - Tag @link: can't find execute(OnlineRegions) in org.apache.hadoop.hbase.regionserver.SplitTransaction
[WARNING] <https://builds.apache.org/job/HBase-TRUNK/ws/trunk/src/main/java/org/apache/hadoop/hbase/regionserver/SplitTransaction.java>:84: warning - Tag @link: can't find rollback(OnlineRegions) in org.apache.hadoop.hbase.regionserver.SplitTransaction
[WARNING] <https://builds.apache.org/job/HBase-TRUNK/ws/trunk/src/main/java/org/apache/hadoop/hbase/regionserver/SplitTransaction.java>:207: warning - Tag @see: can't find rollback(OnlineRegions) in org.apache.hadoop.hbase.regionserver.SplitTransaction
[WARNING] <https://builds.apache.org/job/HBase-TRUNK/ws/trunk/src/main/java/org/apache/hadoop/hbase/regionserver/SplitTransaction.java>:146: warning - @param argument "services" is not a parameter name.
[WARNING] <https://builds.apache.org/job/HBase-TRUNK/ws/trunk/src/main/java/org/apache/hadoop/hbase/regionserver/SplitTransaction.java>:146: warning - @param argument "c" is not a parameter name.
[WARNING] <https://builds.apache.org/job/HBase-TRUNK/ws/trunk/src/main/java/org/apache/hadoop/hbase/regionserver/SplitTransaction.java>:207: warning - Tag @link: can't find rollback(OnlineRegions) in org.apache.hadoop.hbase.regionserver.SplitTransaction
[WARNING] <https://builds.apache.org/job/HBase-TRUNK/ws/trunk/src/main/java/org/apache/hadoop/hbase/regionserver/SplitTransaction.java>:207: warning - Tag @link: can't find rollback(OnlineRegions) in org.apache.hadoop.hbase.regionserver.SplitTransaction
[WARNING] <https://builds.apache.org/job/HBase-TRUNK/ws/trunk/src/main/java/org/apache/hadoop/hbase/regionserver/SplitTransaction.java>:584: warning - @return tag cannot be used in method with void return type.
[WARNING] <https://builds.apache.org/job/HBase-TRUNK/ws/trunk/src/main/java/org/apache/hadoop/hbase/client/HConnection.java>:195: warning - Tag @link: can't find getHRegionConnection(InetSocketAddress) in org.apache.hadoop.hbase.client.HConnection
[WARNING] <https://builds.apache.org/job/HBase-TRUNK/ws/trunk/src/main/java/org/apache/hadoop/hbase/client/HConnectionManager.java>:297: warning - Tag @link: reference not found: Connection
[WARNING] <https://builds.apache.org/job/HBase-TRUNK/ws/trunk/src/main/java/org/apache/hadoop/hbase/client/HTable.java>:962: warning - End Delimiter } missing for possible See Tag in comment string: "Turns 'auto-flush' on or off.
[WARNING] <p>
[WARNING] When enabled (default), {@link Put} operations don't get buffered/delayed
[WARNING] and are immediately executed. Failed operations are not retried. This is
[WARNING] slower but safer.
[WARNING] <p>
[WARNING] Turning off {@link #autoFlush} means that multiple {@link Put}s will be
[WARNING] accepted before any RPC is actually sent to do the write operations. If the
[WARNING] application dies before pending writes get flushed to HBase, data will be
[WARNING] lost.
[WARNING] <p>
[WARNING] When you turn {@link #autoFlush} off, you should also consider the
[WARNING] {@link #clearBufferOnFail} option. By default, asynchronous {@link Put)
[WARNING] requests will be retried on failure until successful. However, this can
[WARNING] pollute the writeBuffer and slow down batching performance. Additionally,
[WARNING] you may want to issue a number of Put requests and call
[WARNING] {@link #flushCommits()} as a barrier. In both use cases, consider setting
[WARNING] clearBufferOnFail to true to erase the buffer after {@link #flushCommits()}
[WARNING] has been called, regardless of success."
[WARNING] <https://builds.apache.org/job/HBase-TRUNK/ws/trunk/src/main/java/org/apache/hadoop/hbase/client/HTableInterface.java>:396: warning - Tag @link: reference not found: Batch.Call#call(Object)
[WARNING] <https://builds.apache.org/job/HBase-TRUNK/ws/trunk/src/main/java/org/apache/hadoop/hbase/client/HTableInterface.java>:432: warning - Tag @link: reference not found: Batch.Callback#update(byte[], byte[], Object)
[WARNING] <https://builds.apache.org/job/HBase-TRUNK/ws/trunk/src/main/java/org/apache/hadoop/hbase/client/HTableInterface.java>:432: warning - Tag @link: reference not found: Batch.Callback#update(byte[], byte[], Object)
[WARNING] <https://builds.apache.org/job/HBase-TRUNK/ws/trunk/src/main/java/org/apache/hadoop/hbase/client/HTableInterface.java>:396: warning - Tag @link: reference not found: Batch.Call#call(Object)
[WARNING] <https://builds.apache.org/job/HBase-TRUNK/ws/trunk/src/main/java/org/apache/hadoop/hbase/client/HTableInterface.java>:432: warning - Tag @link: reference not found: Batch.Callback#update(byte[], byte[], Object)
[WARNING] <https://builds.apache.org/job/HBase-TRUNK/ws/trunk/src/main/java/org/apache/hadoop/hbase/client/HTableInterface.java>:432: warning - Tag @link: reference not found: Batch.Callback#update(byte[], byte[], Object)
[WARNING] <https://builds.apache.org/job/HBase-TRUNK/ws/trunk/src/main/java/org/apache/hadoop/hbase/client/HTablePool.java>:98: warning - @param argument "tableFactory" is not a parameter name.
[WARNING] <https://builds.apache.org/job/HBase-TRUNK/ws/trunk/src/main/java/org/apache/hadoop/hbase/client/RetriesExhaustedWithDetailsException.java>:83: warning - @return tag has no arguments.
[WARNING] <https://builds.apache.org/job/HBase-TRUNK/ws/trunk/src/main/java/org/apache/hadoop/hbase/client/coprocessor/AggregationClient.java>:288: warning - @return tag has no arguments.
[WARNING] <https://builds.apache.org/job/HBase-TRUNK/ws/trunk/src/main/java/org/apache/hadoop/hbase/client/coprocessor/AggregationClient.java>:176: warning - @return tag has no arguments.
[WARNING] <https://builds.apache.org/job/HBase-TRUNK/ws/trunk/src/main/java/org/apache/hadoop/hbase/client/coprocessor/AggregationClient.java>:354: warning - @return tag has no arguments.
[WARNING] <https://builds.apache.org/job/HBase-TRUNK/ws/trunk/src/main/java/org/apache/hadoop/hbase/client/coprocessor/LongColumnInterpreter.java>:38: warning - Tag @link: reference not found: TestAggregateProtocol
[WARNING] <https://builds.apache.org/job/HBase-TRUNK/ws/trunk/src/main/java/org/apache/hadoop/hbase/master/HMaster.java>:274: warning - Tag @link: can't find finishInitialization() in org.apache.hadoop.hbase.master.HMaster
[WARNING] <https://builds.apache.org/job/HBase-TRUNK/ws/trunk/src/main/java/org/apache/hadoop/hbase/master/MasterFileSystem.java>:173: warning - @return tag has no arguments.
[WARNING] <https://builds.apache.org/job/HBase-TRUNK/ws/trunk/src/main/java/org/apache/hadoop/hbase/master/ServerManager.java>:250: warning - @param argument "serverName" is not a parameter name.
[WARNING] <https://builds.apache.org/job/HBase-TRUNK/ws/trunk/src/main/java/org/apache/hadoop/hbase/master/SplitLogManager.java>:120: warning - @param argument "services" is not a parameter name.
[WARNING] <https://builds.apache.org/job/HBase-TRUNK/ws/trunk/src/main/java/org/apache/hadoop/hbase/master/SplitLogManager.java>:120: warning - @param argument "service" is not a parameter name.
[WARNING] <https://builds.apache.org/job/HBase-TRUNK/ws/trunk/src/main/java/org/apache/hadoop/hbase/master/SplitLogManager.java>:218: warning - @param argument "logDir" is not a parameter name.
[WARNING] <https://builds.apache.org/job/HBase-TRUNK/ws/trunk/src/main/java/org/apache/hadoop/hbase/coprocessor/package-info.java>:367: warning - @Override is an unknown tag.
[WARNING] <https://builds.apache.org/job/HBase-TRUNK/ws/trunk/src/main/java/org/apache/hadoop/hbase/coprocessor/package-info.java>:367: warning - @Override is an unknown tag.
[WARNING] <https://builds.apache.org/job/HBase-TRUNK/ws/trunk/src/main/java/org/apache/hadoop/hbase/HConstants.java>:434: warning - Tag @link: reference not found: Configuration
[INFO] Generating "Project License" report.
[INFO] Generating "Source Xref" report.
[INFO] Generating "RAT Report" report.
[INFO] No excludes
[INFO] ------------------------------------------------------------------------
[INFO] Building HBase
[INFO]    task-segment: [assembly:assembly] (aggregator-style)
[INFO] ------------------------------------------------------------------------
[INFO] Preparing assembly:assembly
[INFO] ------------------------------------------------------------------------
[INFO] Building HBase
[INFO] ------------------------------------------------------------------------
[WARNING] DEPRECATED [tasks]: Use target instead
[INFO] [antrun:run {execution: generate}]
[WARNING] Parameter tasks is deprecated, use target instead
[INFO] Executing tasks

main:
SLF4J: Failed to load class "org.slf4j.impl.StaticLoggerBinder".
SLF4J: See http://www.slf4j.org/codes.html#StaticLoggerBinder for further details.
2011-06-14 03:19:45.593:INFO::Logging to STDERR via org.mortbay.log.StdErrLog
[INFO] Executed tasks
[INFO] [build-helper:add-source {execution: add-jspc-source}]
[INFO] Source directory: <https://builds.apache.org/job/HBase-TRUNK/ws/trunk/target/jspc> added.
[INFO] [build-helper:add-source {execution: add-package-info}]
[INFO] Source directory: <https://builds.apache.org/job/HBase-TRUNK/ws/trunk/target/generated-sources> added.
[INFO] [jamon:translate {execution: default}]
[INFO] Setting property: classpath.resource.loader.class => 'org.codehaus.plexus.velocity.ContextClassLoaderResourceLoader'.
[INFO] Setting property: velocimacro.messages.on => 'false'.
[INFO] Setting property: resource.loader => 'classpath'.
[INFO] Setting property: resource.manager.logwhenfound => 'false'.
[INFO] [remote-resources:process {execution: default}]
[INFO] [resources:resources {execution: default-resources}]
[INFO] Using 'UTF-8' encoding to copy filtered resources.
[INFO] Copying 1 resource
[INFO] Copying 6 resources
[INFO] Copying 3 resources
[WARNING] DEPRECATED [tasks]: Use target instead
[INFO] [antrun:run {execution: default}]
[WARNING] Parameter tasks is deprecated, use target instead
[INFO] Executing tasks

main:
    [mkdir] Created dir: <https://builds.apache.org/job/HBase-TRUNK/ws/trunk/target/nativelib>
     [exec] tar: hadoop-snappy-nativelibs.tar: Cannot open: No such file or directory
     [exec] tar: Error is not recoverable: exiting now
     [exec] Result: 2
[INFO] Executed tasks
[INFO] [compiler:compile {execution: default-compile}]
[INFO] Compiling 524 source files to <https://builds.apache.org/job/HBase-TRUNK/ws/trunk/target/classes>
[INFO] [resources:testResources {execution: default-testResources}]
[INFO] Using 'UTF-8' encoding to copy filtered resources.
[INFO] Copying 4 resources
[INFO] Copying 3 resources
[INFO] [compiler:testCompile {execution: default-testCompile}]
[INFO] Compiling 218 source files to <https://builds.apache.org/job/HBase-TRUNK/ws/trunk/target/test-classes>
[INFO] [surefire:test {execution: default-test}]
[INFO] Surefire report directory: <https://builds.apache.org/job/HBase-TRUNK/ws/trunk/target/surefire-reports>

-------------------------------------------------------
 T E S T S
-------------------------------------------------------
Running org.apache.hadoop.hbase.master.TestHMasterRPCException
Tests run: 1, Failures: 0, Errors: 0, Skipped: 0, Time elapsed: 0.402 sec
Running org.apache.hadoop.hbase.regionserver.TestColumnSeeking
Tests run: 2, Failures: 0, Errors: 0, Skipped: 0, Time elapsed: 19.627 sec
Running org.apache.hadoop.hbase.client.TestMultipleTimestamps
killed.
[INFO] ------------------------------------------------------------------------
[ERROR] BUILD ERROR
[INFO] ------------------------------------------------------------------------
[INFO] Error while executing forked tests.; nested exception is org.apache.maven.surefire.booter.shade.org.codehaus.plexus.util.cli.CommandLineException: Error while executing external command, process killed.

Process timeout out after 900 seconds
[INFO] ------------------------------------------------------------------------
[INFO] For more information, run Maven with the -e switch
[INFO] ------------------------------------------------------------------------
[INFO] Total time: 17 minutes 22 seconds
[INFO] Finished at: Tue Jun 14 03:35:26 UTC 2011
[INFO] Final Memory: 118M/1083M
[INFO] ------------------------------------------------------------------------
[locks-and-latches] Releasing all the locks
[locks-and-latches] All the locks released
Archiving artifacts
Recording test results


Build failed in Jenkins: HBase-TRUNK #1967

Posted by Apache Jenkins Server <je...@builds.apache.org>.
See <https://builds.apache.org/job/HBase-TRUNK/1967/changes>

Changes:

[stack] HBASE-3928 Some potential performance improvements to Bytes/KeyValue

[stack] HBASE-3963 Schedule all log-spliiting at startup all at once

------------------------------------------
[...truncated 3107 lines...]
Generating <https://builds.apache.org/job/HBase-TRUNK/ws/trunk/target/site/apidocs/org/apache/hbase/tmpl/common//class-use/TaskMonitorTmpl.html...>
Generating <https://builds.apache.org/job/HBase-TRUNK/ws/trunk/target/site/apidocs/org/apache/hbase/tmpl/common//class-use/TaskMonitorTmpl.Intf.html...>
Generating <https://builds.apache.org/job/HBase-TRUNK/ws/trunk/target/site/apidocs/org/apache/hbase/tmpl/common//class-use/TaskMonitorTmpl.ImplData.html...>
Generating <https://builds.apache.org/job/HBase-TRUNK/ws/trunk/target/site/apidocs/org/apache/hbase/tmpl/common//class-use/TaskMonitorTmplImpl.html...>
Generating <https://builds.apache.org/job/HBase-TRUNK/ws/trunk/target/site/apidocs/org/apache/hadoop/hbase//package-use.html...>
Generating <https://builds.apache.org/job/HBase-TRUNK/ws/trunk/target/site/apidocs/org/apache/hadoop/hbase/avro//package-use.html...>
Generating <https://builds.apache.org/job/HBase-TRUNK/ws/trunk/target/site/apidocs/org/apache/hadoop/hbase/avro/generated//package-use.html...>
Generating <https://builds.apache.org/job/HBase-TRUNK/ws/trunk/target/site/apidocs/org/apache/hadoop/hbase/catalog//package-use.html...>
Generating <https://builds.apache.org/job/HBase-TRUNK/ws/trunk/target/site/apidocs/org/apache/hadoop/hbase/client//package-use.html...>
Generating <https://builds.apache.org/job/HBase-TRUNK/ws/trunk/target/site/apidocs/org/apache/hadoop/hbase/client/coprocessor//package-use.html...>
Generating <https://builds.apache.org/job/HBase-TRUNK/ws/trunk/target/site/apidocs/org/apache/hadoop/hbase/client/replication//package-use.html...>
Generating <https://builds.apache.org/job/HBase-TRUNK/ws/trunk/target/site/apidocs/org/apache/hadoop/hbase/coprocessor//package-use.html...>
Generating <https://builds.apache.org/job/HBase-TRUNK/ws/trunk/target/site/apidocs/org/apache/hadoop/hbase/executor//package-use.html...>
Generating <https://builds.apache.org/job/HBase-TRUNK/ws/trunk/target/site/apidocs/org/apache/hadoop/hbase/filter//package-use.html...>
Generating <https://builds.apache.org/job/HBase-TRUNK/ws/trunk/target/site/apidocs/org/apache/hadoop/hbase/generated/master//package-use.html...>
Generating <https://builds.apache.org/job/HBase-TRUNK/ws/trunk/target/site/apidocs/org/apache/hadoop/hbase/generated/regionserver//package-use.html...>
Generating <https://builds.apache.org/job/HBase-TRUNK/ws/trunk/target/site/apidocs/org/apache/hadoop/hbase/io//package-use.html...>
Generating <https://builds.apache.org/job/HBase-TRUNK/ws/trunk/target/site/apidocs/org/apache/hadoop/hbase/io/hfile//package-use.html...>
Generating <https://builds.apache.org/job/HBase-TRUNK/ws/trunk/target/site/apidocs/org/apache/hadoop/hbase/ipc//package-use.html...>
Generating <https://builds.apache.org/job/HBase-TRUNK/ws/trunk/target/site/apidocs/org/apache/hadoop/hbase/mapred//package-use.html...>
Generating <https://builds.apache.org/job/HBase-TRUNK/ws/trunk/target/site/apidocs/org/apache/hadoop/hbase/mapreduce//package-use.html...>
Generating <https://builds.apache.org/job/HBase-TRUNK/ws/trunk/target/site/apidocs/org/apache/hadoop/hbase/mapreduce/hadoopbackport//package-use.html...>
Generating <https://builds.apache.org/job/HBase-TRUNK/ws/trunk/target/site/apidocs/org/apache/hadoop/hbase/mapreduce/replication//package-use.html...>
Generating <https://builds.apache.org/job/HBase-TRUNK/ws/trunk/target/site/apidocs/org/apache/hadoop/hbase/master//package-use.html...>
Generating <https://builds.apache.org/job/HBase-TRUNK/ws/trunk/target/site/apidocs/org/apache/hadoop/hbase/master/handler//package-use.html...>
Generating <https://builds.apache.org/job/HBase-TRUNK/ws/trunk/target/site/apidocs/org/apache/hadoop/hbase/master/metrics//package-use.html...>
Generating <https://builds.apache.org/job/HBase-TRUNK/ws/trunk/target/site/apidocs/org/apache/hadoop/hbase/metrics//package-use.html...>
Generating <https://builds.apache.org/job/HBase-TRUNK/ws/trunk/target/site/apidocs/org/apache/hadoop/hbase/metrics/file//package-use.html...>
Generating <https://builds.apache.org/job/HBase-TRUNK/ws/trunk/target/site/apidocs/org/apache/hadoop/hbase/monitoring//package-use.html...>
Generating <https://builds.apache.org/job/HBase-TRUNK/ws/trunk/target/site/apidocs/org/apache/hadoop/hbase/regionserver//package-use.html...>
Generating <https://builds.apache.org/job/HBase-TRUNK/ws/trunk/target/site/apidocs/org/apache/hadoop/hbase/regionserver/compactions//package-use.html...>
Generating <https://builds.apache.org/job/HBase-TRUNK/ws/trunk/target/site/apidocs/org/apache/hadoop/hbase/regionserver/handler//package-use.html...>
Generating <https://builds.apache.org/job/HBase-TRUNK/ws/trunk/target/site/apidocs/org/apache/hadoop/hbase/regionserver/metrics//package-use.html...>
Generating <https://builds.apache.org/job/HBase-TRUNK/ws/trunk/target/site/apidocs/org/apache/hadoop/hbase/regionserver/wal//package-use.html...>
Generating <https://builds.apache.org/job/HBase-TRUNK/ws/trunk/target/site/apidocs/org/apache/hadoop/hbase/replication//package-use.html...>
Generating <https://builds.apache.org/job/HBase-TRUNK/ws/trunk/target/site/apidocs/org/apache/hadoop/hbase/replication/master//package-use.html...>
Generating <https://builds.apache.org/job/HBase-TRUNK/ws/trunk/target/site/apidocs/org/apache/hadoop/hbase/replication/regionserver//package-use.html...>
Generating <https://builds.apache.org/job/HBase-TRUNK/ws/trunk/target/site/apidocs/org/apache/hadoop/hbase/rest//package-use.html...>
Generating <https://builds.apache.org/job/HBase-TRUNK/ws/trunk/target/site/apidocs/org/apache/hadoop/hbase/rest/client//package-use.html...>
Generating <https://builds.apache.org/job/HBase-TRUNK/ws/trunk/target/site/apidocs/org/apache/hadoop/hbase/rest/filter//package-use.html...>
Generating <https://builds.apache.org/job/HBase-TRUNK/ws/trunk/target/site/apidocs/org/apache/hadoop/hbase/rest/metrics//package-use.html...>
Generating <https://builds.apache.org/job/HBase-TRUNK/ws/trunk/target/site/apidocs/org/apache/hadoop/hbase/rest/model//package-use.html...>
Generating <https://builds.apache.org/job/HBase-TRUNK/ws/trunk/target/site/apidocs/org/apache/hadoop/hbase/rest/protobuf/generated//package-use.html...>
Generating <https://builds.apache.org/job/HBase-TRUNK/ws/trunk/target/site/apidocs/org/apache/hadoop/hbase/rest/provider//package-use.html...>
Generating <https://builds.apache.org/job/HBase-TRUNK/ws/trunk/target/site/apidocs/org/apache/hadoop/hbase/rest/provider/consumer//package-use.html...>
Generating <https://builds.apache.org/job/HBase-TRUNK/ws/trunk/target/site/apidocs/org/apache/hadoop/hbase/rest/provider/producer//package-use.html...>
Generating <https://builds.apache.org/job/HBase-TRUNK/ws/trunk/target/site/apidocs/org/apache/hadoop/hbase/rest/transform//package-use.html...>
Generating <https://builds.apache.org/job/HBase-TRUNK/ws/trunk/target/site/apidocs/org/apache/hadoop/hbase/security//package-use.html...>
Generating <https://builds.apache.org/job/HBase-TRUNK/ws/trunk/target/site/apidocs/org/apache/hadoop/hbase/thrift//package-use.html...>
Generating <https://builds.apache.org/job/HBase-TRUNK/ws/trunk/target/site/apidocs/org/apache/hadoop/hbase/thrift/generated//package-use.html...>
Generating <https://builds.apache.org/job/HBase-TRUNK/ws/trunk/target/site/apidocs/org/apache/hadoop/hbase/util//package-use.html...>
Generating <https://builds.apache.org/job/HBase-TRUNK/ws/trunk/target/site/apidocs/org/apache/hadoop/hbase/zookeeper//package-use.html...>
Generating <https://builds.apache.org/job/HBase-TRUNK/ws/trunk/target/site/apidocs/org/apache/hbase/tmpl/common//package-use.html...>
Generating <https://builds.apache.org/job/HBase-TRUNK/ws/trunk/target/site/apidocs/org/apache/hbase/tmpl/master//package-use.html...>
Generating <https://builds.apache.org/job/HBase-TRUNK/ws/trunk/target/site/apidocs/org/apache/hbase/tmpl/regionserver//package-use.html...>
Building index for all the packages and classes...
Generating <https://builds.apache.org/job/HBase-TRUNK/ws/trunk/target/site/apidocs/overview-tree.html...>
Generating <https://builds.apache.org/job/HBase-TRUNK/ws/trunk/target/site/apidocs/index-all.html...>
Generating <https://builds.apache.org/job/HBase-TRUNK/ws/trunk/target/site/apidocs/deprecated-list.html...>
Building index for all classes...
Generating <https://builds.apache.org/job/HBase-TRUNK/ws/trunk/target/site/apidocs/allclasses-frame.html...>
Generating <https://builds.apache.org/job/HBase-TRUNK/ws/trunk/target/site/apidocs/allclasses-noframe.html...>
Generating <https://builds.apache.org/job/HBase-TRUNK/ws/trunk/target/site/apidocs/index.html...>
Generating <https://builds.apache.org/job/HBase-TRUNK/ws/trunk/target/site/apidocs/overview-summary.html...>
Generating <https://builds.apache.org/job/HBase-TRUNK/ws/trunk/target/site/apidocs/help-doc.html...>
Generating <https://builds.apache.org/job/HBase-TRUNK/ws/trunk/target/site/apidocs/stylesheet.css...>
78 warnings
[WARNING] Javadoc Warnings
[WARNING] <https://builds.apache.org/job/HBase-TRUNK/ws/trunk/src/main/java/org/apache/hadoop/hbase/HConstants.java>:434: warning - Tag @link: reference not found: Configuration
[WARNING] <https://builds.apache.org/job/HBase-TRUNK/ws/trunk/src/main/java/org/apache/hadoop/hbase/HConstants.java>:434: warning - Tag @link: reference not found: Configuration
[WARNING] <https://builds.apache.org/job/HBase-TRUNK/ws/trunk/src/main/java/org/apache/hadoop/hbase/HConstants.java>:434: warning - Tag @link: reference not found: Configuration
[WARNING] <https://builds.apache.org/job/HBase-TRUNK/ws/trunk/src/main/java/org/apache/hadoop/hbase/HConstants.java>:434: warning - Tag @link: reference not found: Connection
[WARNING] <https://builds.apache.org/job/HBase-TRUNK/ws/trunk/src/main/java/org/apache/hadoop/hbase/HConstants.java>:434: warning - Tag @link: reference not found: Connection
[WARNING] <https://builds.apache.org/job/HBase-TRUNK/ws/trunk/src/main/java/org/apache/hadoop/hbase/HServerAddress.java>:89: warning - Tag @link: can't find getAddress()#getHostAddress() in java.net.InetSocketAddress
[WARNING] <https://builds.apache.org/job/HBase-TRUNK/ws/trunk/src/main/java/org/apache/hadoop/hbase/HServerInfo.java>:111: warning - Tag @see: can't find getServerName() in org.apache.hadoop.hbase.HServerInfo
[WARNING] <https://builds.apache.org/job/HBase-TRUNK/ws/trunk/src/main/java/org/apache/hadoop/hbase/HServerInfo.java>:111: warning - Tag @see: can't find getLoad() in org.apache.hadoop.hbase.HServerInfo
[WARNING] <https://builds.apache.org/job/HBase-TRUNK/ws/trunk/src/main/java/org/apache/hadoop/hbase/ServerName.java>:42: warning - Tag @link:illegal character: "34" in "#SERVERNAME_SEPARATOR""
[WARNING] <https://builds.apache.org/job/HBase-TRUNK/ws/trunk/src/main/java/org/apache/hadoop/hbase/ServerName.java>:42: warning - Tag @link: can't find SERVERNAME_SEPARATOR" in org.apache.hadoop.hbase.ServerName
[WARNING] <https://builds.apache.org/job/HBase-TRUNK/ws/trunk/src/main/java/org/apache/hadoop/hbase/ServerName.java>:42: warning - @ink is an unknown tag.
[WARNING] <https://builds.apache.org/job/HBase-TRUNK/ws/trunk/src/main/java/org/apache/hadoop/hbase/ServerName.java>:42: warning - @ink is an unknown tag.
[WARNING] <https://builds.apache.org/job/HBase-TRUNK/ws/trunk/src/main/java/org/apache/hadoop/hbase/ServerName.java>:224: warning - @param argument "rigth" is not a parameter name.
[WARNING] <https://builds.apache.org/job/HBase-TRUNK/ws/trunk/src/main/java/org/apache/hadoop/hbase/catalog/CatalogTracker.java>:106: warning - @param argument "connection" is not a parameter name.
[WARNING] <https://builds.apache.org/job/HBase-TRUNK/ws/trunk/src/main/java/org/apache/hadoop/hbase/catalog/CatalogTracker.java>:122: warning - @param argument "connection" is not a parameter name.
[WARNING] <https://builds.apache.org/job/HBase-TRUNK/ws/trunk/src/main/java/org/apache/hadoop/hbase/catalog/MetaReader.java>:559: warning - @param argument "hsi" is not a parameter name.
[WARNING] <https://builds.apache.org/job/HBase-TRUNK/ws/trunk/src/main/java/org/apache/hadoop/hbase/mapreduce/hadoopbackport/InputSampler.java>:165: warning - @return tag has no arguments.
[WARNING] <https://builds.apache.org/job/HBase-TRUNK/ws/trunk/src/main/java/org/apache/hadoop/hbase/client/HTableInterface.java>:371: warning - @return tag has no arguments.
[WARNING] <https://builds.apache.org/job/HBase-TRUNK/ws/trunk/src/main/java/org/apache/hadoop/hbase/client/HTableInterface.java>:396: warning - Tag @link: reference not found: Batch.Call#call(Object)
[WARNING] <https://builds.apache.org/job/HBase-TRUNK/ws/trunk/src/main/java/org/apache/hadoop/hbase/client/HTableInterface.java>:432: warning - Tag @link: reference not found: Batch.Callback#update(byte[], byte[], Object)
[WARNING] <https://builds.apache.org/job/HBase-TRUNK/ws/trunk/src/main/java/org/apache/hadoop/hbase/client/HTableInterface.java>:432: warning - Tag @link: reference not found: Batch.Callback#update(byte[], byte[], Object)
[WARNING] <https://builds.apache.org/job/HBase-TRUNK/ws/trunk/src/main/java/org/apache/hadoop/hbase/zookeeper/RegionServerTracker.java>:46: warning - Tag @link: can't find expireServer(org.apache.hadoop.hbase.HServerInfo) in org.apache.hadoop.hbase.master.ServerManager
[WARNING] <https://builds.apache.org/job/HBase-TRUNK/ws/trunk/src/main/java/org/apache/hadoop/hbase/filter/BitComparator.java>:52: warning - @param argument "BitwiseOp" is not a parameter name.
[WARNING] <https://builds.apache.org/job/HBase-TRUNK/ws/trunk/src/main/java/org/apache/hadoop/hbase/executor/RegionTransitionData.java>:115: warning - @param argument "origin" is not a parameter name.
[WARNING] <https://builds.apache.org/job/HBase-TRUNK/ws/trunk/src/main/java/org/apache/hadoop/hbase/io/hfile/BlockCache.java>:65: warning - @return tag has no arguments.
[WARNING] <https://builds.apache.org/job/HBase-TRUNK/ws/trunk/src/main/java/org/apache/hadoop/hbase/coprocessor/AggregateProtocol.java>:110: warning - @return tag has no arguments.
[WARNING] <https://builds.apache.org/job/HBase-TRUNK/ws/trunk/src/main/java/org/apache/hadoop/hbase/coprocessor/AggregateProtocol.java>:90: warning - @return tag has no arguments.
[WARNING] <https://builds.apache.org/job/HBase-TRUNK/ws/trunk/src/main/java/org/apache/hadoop/hbase/coprocessor/AggregateProtocol.java>:126: warning - @return tag has no arguments.
[WARNING] <https://builds.apache.org/job/HBase-TRUNK/ws/trunk/src/main/java/org/apache/hadoop/hbase/coprocessor/ColumnInterpreter.java>:66: warning - @return tag has no arguments.
[WARNING] <https://builds.apache.org/job/HBase-TRUNK/ws/trunk/src/main/java/org/apache/hadoop/hbase/coprocessor/ColumnInterpreter.java>:99: warning - @return tag has no arguments.
[WARNING] <https://builds.apache.org/job/HBase-TRUNK/ws/trunk/src/main/java/org/apache/hadoop/hbase/coprocessor/ColumnInterpreter.java>:117: warning - @return tag has no arguments.
[WARNING] <https://builds.apache.org/job/HBase-TRUNK/ws/trunk/src/main/java/org/apache/hadoop/hbase/coprocessor/ColumnInterpreter.java>:73: warning - @return tag has no arguments.
[WARNING] <https://builds.apache.org/job/HBase-TRUNK/ws/trunk/src/main/java/org/apache/hadoop/hbase/coprocessor/ColumnInterpreter.java>:79: warning - @return tag has no arguments.
[WARNING] <https://builds.apache.org/job/HBase-TRUNK/ws/trunk/src/main/java/org/apache/hadoop/hbase/coprocessor/ColumnInterpreter.java>:92: warning - @return tag has no arguments.
[WARNING] <https://builds.apache.org/job/HBase-TRUNK/ws/trunk/src/main/java/org/apache/hadoop/hbase/coprocessor/ColumnInterpreter.java>:86: warning - @return tag has no arguments.
[WARNING] <https://builds.apache.org/job/HBase-TRUNK/ws/trunk/src/main/java/org/apache/hadoop/hbase/coprocessor/ColumnInterpreter.java>:56: warning - @param argument "value" is not a parameter name.
[WARNING] <https://builds.apache.org/job/HBase-TRUNK/ws/trunk/src/main/java/org/apache/hadoop/hbase/util/Bytes.java>:740: warning - @return tag has no arguments.
[WARNING] <https://builds.apache.org/job/HBase-TRUNK/ws/trunk/src/main/java/org/apache/hadoop/hbase/util/FSUtils.java>:147: warning - @return tag cannot be used in method with void return type.
[WARNING] <https://builds.apache.org/job/HBase-TRUNK/ws/trunk/src/main/java/org/apache/hadoop/hbase/util/Writables.java>:71: warning - @param argument "w" is not a parameter name.
[WARNING] <https://builds.apache.org/job/HBase-TRUNK/ws/trunk/src/main/java/org/apache/hadoop/hbase/regionserver/HRegion.java>:309: warning - Tag @see: can't find newHRegion(Path, HLog, FileSystem, Configuration, org.apache.hadoop.hbase.HRegionInfo, FlushRequester) in org.apache.hadoop.hbase.regionserver.HRegion
[WARNING] <https://builds.apache.org/job/HBase-TRUNK/ws/trunk/src/main/java/org/apache/hadoop/hbase/regionserver/HRegion.java>:309: warning - Tag @link: can't find newHRegion(Path, HLog, FileSystem, Configuration, org.apache.hadoop.hbase.HRegionInfo, FlushRequester) in org.apache.hadoop.hbase.regionserver.HRegion
[WARNING] <https://builds.apache.org/job/HBase-TRUNK/ws/trunk/src/main/java/org/apache/hadoop/hbase/regionserver/HRegion.java>:1055: warning - Tag @see: can't find internalFlushcache() in org.apache.hadoop.hbase.regionserver.HRegion
[WARNING] <https://builds.apache.org/job/HBase-TRUNK/ws/trunk/src/main/java/org/apache/hadoop/hbase/regionserver/HRegion.java>:2426: warning - @param argument "lockid" is not a parameter name.
[WARNING] <https://builds.apache.org/job/HBase-TRUNK/ws/trunk/src/main/java/org/apache/hadoop/hbase/regionserver/HRegion.java>:2811: warning - @param argument "flusher" is not a parameter name.
[WARNING] <https://builds.apache.org/job/HBase-TRUNK/ws/trunk/src/main/java/org/apache/hadoop/hbase/regionserver/RegionCoprocessorHost.java>:409: warning - @return tag cannot be used in method with void return type.
[WARNING] <https://builds.apache.org/job/HBase-TRUNK/ws/trunk/src/main/java/org/apache/hadoop/hbase/regionserver/SplitLogWorker.java>:546: warning - Tag @link: reference not found: SplitLogManager.TaskFinisher
[WARNING] <https://builds.apache.org/job/HBase-TRUNK/ws/trunk/src/main/java/org/apache/hadoop/hbase/regionserver/SplitTransaction.java>:84: warning - Tag @link: can't find execute(OnlineRegions) in org.apache.hadoop.hbase.regionserver.SplitTransaction
[WARNING] <https://builds.apache.org/job/HBase-TRUNK/ws/trunk/src/main/java/org/apache/hadoop/hbase/regionserver/SplitTransaction.java>:84: warning - Tag @link: can't find rollback(OnlineRegions) in org.apache.hadoop.hbase.regionserver.SplitTransaction
[WARNING] <https://builds.apache.org/job/HBase-TRUNK/ws/trunk/src/main/java/org/apache/hadoop/hbase/regionserver/SplitTransaction.java>:207: warning - Tag @see: can't find rollback(OnlineRegions) in org.apache.hadoop.hbase.regionserver.SplitTransaction
[WARNING] <https://builds.apache.org/job/HBase-TRUNK/ws/trunk/src/main/java/org/apache/hadoop/hbase/regionserver/SplitTransaction.java>:146: warning - @param argument "services" is not a parameter name.
[WARNING] <https://builds.apache.org/job/HBase-TRUNK/ws/trunk/src/main/java/org/apache/hadoop/hbase/regionserver/SplitTransaction.java>:146: warning - @param argument "c" is not a parameter name.
[WARNING] <https://builds.apache.org/job/HBase-TRUNK/ws/trunk/src/main/java/org/apache/hadoop/hbase/regionserver/SplitTransaction.java>:207: warning - Tag @link: can't find rollback(OnlineRegions) in org.apache.hadoop.hbase.regionserver.SplitTransaction
[WARNING] <https://builds.apache.org/job/HBase-TRUNK/ws/trunk/src/main/java/org/apache/hadoop/hbase/regionserver/SplitTransaction.java>:207: warning - Tag @link: can't find rollback(OnlineRegions) in org.apache.hadoop.hbase.regionserver.SplitTransaction
[WARNING] <https://builds.apache.org/job/HBase-TRUNK/ws/trunk/src/main/java/org/apache/hadoop/hbase/regionserver/SplitTransaction.java>:584: warning - @return tag cannot be used in method with void return type.
[WARNING] <https://builds.apache.org/job/HBase-TRUNK/ws/trunk/src/main/java/org/apache/hadoop/hbase/client/HConnection.java>:195: warning - Tag @link: can't find getHRegionConnection(InetSocketAddress) in org.apache.hadoop.hbase.client.HConnection
[WARNING] <https://builds.apache.org/job/HBase-TRUNK/ws/trunk/src/main/java/org/apache/hadoop/hbase/client/HConnectionManager.java>:297: warning - Tag @link: reference not found: Connection
[WARNING] <https://builds.apache.org/job/HBase-TRUNK/ws/trunk/src/main/java/org/apache/hadoop/hbase/client/HTable.java>:962: warning - End Delimiter } missing for possible See Tag in comment string: "Turns 'auto-flush' on or off.
[WARNING] <p>
[WARNING] When enabled (default), {@link Put} operations don't get buffered/delayed
[WARNING] and are immediately executed. Failed operations are not retried. This is
[WARNING] slower but safer.
[WARNING] <p>
[WARNING] Turning off {@link #autoFlush} means that multiple {@link Put}s will be
[WARNING] accepted before any RPC is actually sent to do the write operations. If the
[WARNING] application dies before pending writes get flushed to HBase, data will be
[WARNING] lost.
[WARNING] <p>
[WARNING] When you turn {@link #autoFlush} off, you should also consider the
[WARNING] {@link #clearBufferOnFail} option. By default, asynchronous {@link Put)
[WARNING] requests will be retried on failure until successful. However, this can
[WARNING] pollute the writeBuffer and slow down batching performance. Additionally,
[WARNING] you may want to issue a number of Put requests and call
[WARNING] {@link #flushCommits()} as a barrier. In both use cases, consider setting
[WARNING] clearBufferOnFail to true to erase the buffer after {@link #flushCommits()}
[WARNING] has been called, regardless of success."
[WARNING] <https://builds.apache.org/job/HBase-TRUNK/ws/trunk/src/main/java/org/apache/hadoop/hbase/client/HTableInterface.java>:396: warning - Tag @link: reference not found: Batch.Call#call(Object)
[WARNING] <https://builds.apache.org/job/HBase-TRUNK/ws/trunk/src/main/java/org/apache/hadoop/hbase/client/HTableInterface.java>:432: warning - Tag @link: reference not found: Batch.Callback#update(byte[], byte[], Object)
[WARNING] <https://builds.apache.org/job/HBase-TRUNK/ws/trunk/src/main/java/org/apache/hadoop/hbase/client/HTableInterface.java>:432: warning - Tag @link: reference not found: Batch.Callback#update(byte[], byte[], Object)
[WARNING] <https://builds.apache.org/job/HBase-TRUNK/ws/trunk/src/main/java/org/apache/hadoop/hbase/client/HTableInterface.java>:396: warning - Tag @link: reference not found: Batch.Call#call(Object)
[WARNING] <https://builds.apache.org/job/HBase-TRUNK/ws/trunk/src/main/java/org/apache/hadoop/hbase/client/HTableInterface.java>:432: warning - Tag @link: reference not found: Batch.Callback#update(byte[], byte[], Object)
[WARNING] <https://builds.apache.org/job/HBase-TRUNK/ws/trunk/src/main/java/org/apache/hadoop/hbase/client/HTableInterface.java>:432: warning - Tag @link: reference not found: Batch.Callback#update(byte[], byte[], Object)
[WARNING] <https://builds.apache.org/job/HBase-TRUNK/ws/trunk/src/main/java/org/apache/hadoop/hbase/client/HTablePool.java>:98: warning - @param argument "tableFactory" is not a parameter name.
[WARNING] <https://builds.apache.org/job/HBase-TRUNK/ws/trunk/src/main/java/org/apache/hadoop/hbase/client/RetriesExhaustedWithDetailsException.java>:83: warning - @return tag has no arguments.
[WARNING] <https://builds.apache.org/job/HBase-TRUNK/ws/trunk/src/main/java/org/apache/hadoop/hbase/client/coprocessor/AggregationClient.java>:288: warning - @return tag has no arguments.
[WARNING] <https://builds.apache.org/job/HBase-TRUNK/ws/trunk/src/main/java/org/apache/hadoop/hbase/client/coprocessor/AggregationClient.java>:176: warning - @return tag has no arguments.
[WARNING] <https://builds.apache.org/job/HBase-TRUNK/ws/trunk/src/main/java/org/apache/hadoop/hbase/client/coprocessor/AggregationClient.java>:354: warning - @return tag has no arguments.
[WARNING] <https://builds.apache.org/job/HBase-TRUNK/ws/trunk/src/main/java/org/apache/hadoop/hbase/client/coprocessor/LongColumnInterpreter.java>:38: warning - Tag @link: reference not found: TestAggregateProtocol
[WARNING] <https://builds.apache.org/job/HBase-TRUNK/ws/trunk/src/main/java/org/apache/hadoop/hbase/master/HMaster.java>:274: warning - Tag @link: can't find finishInitialization() in org.apache.hadoop.hbase.master.HMaster
[WARNING] <https://builds.apache.org/job/HBase-TRUNK/ws/trunk/src/main/java/org/apache/hadoop/hbase/master/MasterFileSystem.java>:173: warning - @return tag has no arguments.
[WARNING] <https://builds.apache.org/job/HBase-TRUNK/ws/trunk/src/main/java/org/apache/hadoop/hbase/master/ServerManager.java>:250: warning - @param argument "serverName" is not a parameter name.
[WARNING] <https://builds.apache.org/job/HBase-TRUNK/ws/trunk/src/main/java/org/apache/hadoop/hbase/master/SplitLogManager.java>:120: warning - @param argument "services" is not a parameter name.
[WARNING] <https://builds.apache.org/job/HBase-TRUNK/ws/trunk/src/main/java/org/apache/hadoop/hbase/master/SplitLogManager.java>:120: warning - @param argument "service" is not a parameter name.
[WARNING] <https://builds.apache.org/job/HBase-TRUNK/ws/trunk/src/main/java/org/apache/hadoop/hbase/master/SplitLogManager.java>:218: warning - @param argument "logDir" is not a parameter name.
[WARNING] <https://builds.apache.org/job/HBase-TRUNK/ws/trunk/src/main/java/org/apache/hadoop/hbase/coprocessor/package-info.java>:367: warning - @Override is an unknown tag.
[WARNING] <https://builds.apache.org/job/HBase-TRUNK/ws/trunk/src/main/java/org/apache/hadoop/hbase/coprocessor/package-info.java>:367: warning - @Override is an unknown tag.
[WARNING] <https://builds.apache.org/job/HBase-TRUNK/ws/trunk/src/main/java/org/apache/hadoop/hbase/HConstants.java>:434: warning - Tag @link: reference not found: Configuration
[INFO] Generating "Project License" report.
[INFO] Generating "Source Xref" report.
[INFO] Generating "RAT Report" report.
[INFO] No excludes
[INFO] ------------------------------------------------------------------------
[INFO] Building HBase
[INFO]    task-segment: [assembly:assembly] (aggregator-style)
[INFO] ------------------------------------------------------------------------
[INFO] Preparing assembly:assembly
[INFO] ------------------------------------------------------------------------
[INFO] Building HBase
[INFO] ------------------------------------------------------------------------
[WARNING] DEPRECATED [tasks]: Use target instead
[INFO] [antrun:run {execution: generate}]
[WARNING] Parameter tasks is deprecated, use target instead
[INFO] Executing tasks

main:
SLF4J: Failed to load class "org.slf4j.impl.StaticLoggerBinder".
SLF4J: See http://www.slf4j.org/codes.html#StaticLoggerBinder for further details.
2011-06-13 23:27:30.923:INFO::Logging to STDERR via org.mortbay.log.StdErrLog
[INFO] Executed tasks
[INFO] [build-helper:add-source {execution: add-jspc-source}]
[INFO] Source directory: <https://builds.apache.org/job/HBase-TRUNK/ws/trunk/target/jspc> added.
[INFO] [build-helper:add-source {execution: add-package-info}]
[INFO] Source directory: <https://builds.apache.org/job/HBase-TRUNK/ws/trunk/target/generated-sources> added.
[INFO] [jamon:translate {execution: default}]
[INFO] Setting property: classpath.resource.loader.class => 'org.codehaus.plexus.velocity.ContextClassLoaderResourceLoader'.
[INFO] Setting property: velocimacro.messages.on => 'false'.
[INFO] Setting property: resource.loader => 'classpath'.
[INFO] Setting property: resource.manager.logwhenfound => 'false'.
[INFO] [remote-resources:process {execution: default}]
[INFO] [resources:resources {execution: default-resources}]
[INFO] Using 'UTF-8' encoding to copy filtered resources.
[INFO] Copying 1 resource
[INFO] Copying 6 resources
[INFO] Copying 3 resources
[WARNING] DEPRECATED [tasks]: Use target instead
[INFO] [antrun:run {execution: default}]
[WARNING] Parameter tasks is deprecated, use target instead
[INFO] Executing tasks

main:
    [mkdir] Created dir: <https://builds.apache.org/job/HBase-TRUNK/ws/trunk/target/nativelib>
     [exec] tar: hadoop-snappy-nativelibs.tar: Cannot open: No such file or directory
     [exec] tar: Error is not recoverable: exiting now
     [exec] Result: 2
[INFO] Executed tasks
[INFO] [compiler:compile {execution: default-compile}]
[INFO] Compiling 524 source files to <https://builds.apache.org/job/HBase-TRUNK/ws/trunk/target/classes>
[INFO] [resources:testResources {execution: default-testResources}]
[INFO] Using 'UTF-8' encoding to copy filtered resources.
[INFO] Copying 4 resources
[INFO] Copying 3 resources
[INFO] [compiler:testCompile {execution: default-testCompile}]
[INFO] Compiling 218 source files to <https://builds.apache.org/job/HBase-TRUNK/ws/trunk/target/test-classes>
[INFO] [surefire:test {execution: default-test}]
[INFO] Surefire report directory: <https://builds.apache.org/job/HBase-TRUNK/ws/trunk/target/surefire-reports>

-------------------------------------------------------
 T E S T S
-------------------------------------------------------
Running org.apache.hadoop.hbase.master.TestHMasterRPCException
Tests run: 1, Failures: 0, Errors: 0, Skipped: 0, Time elapsed: 0.414 sec
Running org.apache.hadoop.hbase.regionserver.TestColumnSeeking
Tests run: 2, Failures: 0, Errors: 0, Skipped: 0, Time elapsed: 15.226 sec
Running org.apache.hadoop.hbase.client.TestMultipleTimestamps
killed.
[INFO] ------------------------------------------------------------------------
[ERROR] BUILD ERROR
[INFO] ------------------------------------------------------------------------
[INFO] Error while executing forked tests.; nested exception is org.apache.maven.surefire.booter.shade.org.codehaus.plexus.util.cli.CommandLineException: Error while executing external command, process killed.

Process timeout out after 900 seconds
[INFO] ------------------------------------------------------------------------
[INFO] For more information, run Maven with the -e switch
[INFO] ------------------------------------------------------------------------
[INFO] Total time: 17 minutes 26 seconds
[INFO] Finished at: Mon Jun 13 23:43:08 UTC 2011
[INFO] Final Memory: 112M/1149M
[INFO] ------------------------------------------------------------------------
[locks-and-latches] Releasing all the locks
[locks-and-latches] All the locks released
Archiving artifacts
Recording test results


Build failed in Jenkins: HBase-TRUNK #1966

Posted by Apache Jenkins Server <je...@builds.apache.org>.
See <https://builds.apache.org/job/HBase-TRUNK/1966/changes>

Changes:

[apurtell] HBASE-3978  Rowlock lease renew doesn't work when custom coprocessor indicates to bypass default action

------------------------------------------
[...truncated 3463 lines...]
Tests run: 8, Failures: 0, Errors: 0, Skipped: 0, Time elapsed: 62.108 sec
Running org.apache.hadoop.hbase.mapreduce.TestTableSplit
Tests run: 1, Failures: 0, Errors: 0, Skipped: 0, Time elapsed: 0.016 sec
Running org.apache.hadoop.hbase.filter.TestSingleColumnValueExcludeFilter
Tests run: 1, Failures: 0, Errors: 0, Skipped: 0, Time elapsed: 0.017 sec
Running org.apache.hadoop.hbase.TestHBaseTestingUtility
Tests run: 6, Failures: 0, Errors: 0, Skipped: 0, Time elapsed: 87.135 sec
Running org.apache.hadoop.hbase.mapreduce.TestLoadIncrementalHFiles
Tests run: 4, Failures: 0, Errors: 0, Skipped: 0, Time elapsed: 45.711 sec
Running org.apache.hadoop.hbase.regionserver.wal.TestWALReplay
Tests run: 4, Failures: 0, Errors: 0, Skipped: 0, Time elapsed: 29.033 sec
Running org.apache.hadoop.hbase.rest.TestSchemaResource
Tests run: 2, Failures: 0, Errors: 0, Skipped: 0, Time elapsed: 29.327 sec
Running org.apache.hadoop.hbase.regionserver.TestKeyValueScanFixture
Tests run: 1, Failures: 0, Errors: 0, Skipped: 0, Time elapsed: 0.015 sec
Running org.apache.hadoop.hbase.rest.model.TestTableListModel
Tests run: 3, Failures: 0, Errors: 0, Skipped: 0, Time elapsed: 0.132 sec
Running org.apache.hadoop.hbase.rest.model.TestColumnSchemaModel
Tests run: 2, Failures: 0, Errors: 0, Skipped: 0, Time elapsed: 0.031 sec
Running org.apache.hadoop.hbase.regionserver.TestStoreFile
Tests run: 8, Failures: 0, Errors: 0, Skipped: 0, Time elapsed: 41.465 sec
Running org.apache.hadoop.hbase.zookeeper.TestZooKeeperNodeTracker
Tests run: 2, Failures: 0, Errors: 0, Skipped: 0, Time elapsed: 0.327 sec
Running org.apache.hadoop.hbase.master.TestSplitLogManager
Tests run: 9, Failures: 0, Errors: 0, Skipped: 0, Time elapsed: 12.902 sec
Running org.apache.hadoop.hbase.regionserver.wal.TestHLogMethods
Tests run: 3, Failures: 0, Errors: 0, Skipped: 0, Time elapsed: 0.394 sec
Running org.apache.hadoop.hbase.rest.model.TestScannerModel
Tests run: 3, Failures: 0, Errors: 0, Skipped: 0, Time elapsed: 0.127 sec
Running org.apache.hadoop.hbase.rest.TestVersionResource
Tests run: 7, Failures: 0, Errors: 0, Skipped: 0, Time elapsed: 26.535 sec
Running org.apache.hadoop.hbase.filter.TestFilter
Tests run: 18, Failures: 0, Errors: 0, Skipped: 0, Time elapsed: 4.33 sec
Running org.apache.hadoop.hbase.TestServerName
Tests run: 2, Failures: 0, Errors: 0, Skipped: 0, Time elapsed: 0.016 sec
Running org.apache.hadoop.hbase.regionserver.TestWideScanner
Tests run: 1, Failures: 0, Errors: 0, Skipped: 0, Time elapsed: 40.323 sec
Running org.apache.hadoop.hbase.regionserver.TestSplitTransaction
Tests run: 5, Failures: 0, Errors: 0, Skipped: 0, Time elapsed: 3.167 sec
Running org.apache.hadoop.hbase.replication.regionserver.TestReplicationSink
Tests run: 5, Failures: 0, Errors: 0, Skipped: 0, Time elapsed: 44.806 sec
Running org.apache.hadoop.hbase.regionserver.TestGetClosestAtOrBefore
Tests run: 3, Failures: 0, Errors: 0, Skipped: 0, Time elapsed: 10.942 sec
Running org.apache.hadoop.hbase.regionserver.TestReadWriteConsistencyControl
Tests run: 1, Failures: 0, Errors: 0, Skipped: 0, Time elapsed: 10.02 sec
Running org.apache.hadoop.hbase.util.TestMergeTable
Tests run: 1, Failures: 0, Errors: 0, Skipped: 0, Time elapsed: 75.087 sec
Running org.apache.hadoop.hbase.coprocessor.TestMasterObserver
Tests run: 3, Failures: 0, Errors: 0, Skipped: 0, Time elapsed: 28.508 sec
Running org.apache.hadoop.hbase.rest.model.TestVersionModel
Tests run: 3, Failures: 0, Errors: 0, Skipped: 0, Time elapsed: 0.126 sec
Running org.apache.hadoop.hbase.rest.model.TestCellSetModel
Tests run: 3, Failures: 0, Errors: 0, Skipped: 0, Time elapsed: 0.133 sec
Running org.apache.hadoop.hbase.rest.client.TestRemoteTable
Tests run: 3, Failures: 0, Errors: 0, Skipped: 0, Time elapsed: 40.967 sec
Running org.apache.hadoop.hbase.rest.model.TestStorageClusterStatusModel
Tests run: 3, Failures: 0, Errors: 0, Skipped: 0, Time elapsed: 0.133 sec
Running org.apache.hadoop.hbase.monitoring.TestTaskMonitor
Tests run: 3, Failures: 0, Errors: 0, Skipped: 0, Time elapsed: 0.231 sec
Running org.apache.hadoop.hbase.avro.TestAvroServer
Tests run: 3, Failures: 0, Errors: 0, Skipped: 0, Time elapsed: 59.024 sec
Running org.apache.hadoop.hbase.TestFullLogReconstruction
Tests run: 1, Failures: 0, Errors: 0, Skipped: 0, Time elapsed: 60.552 sec
Running org.apache.hadoop.hbase.TestSerialization
Tests run: 18, Failures: 0, Errors: 0, Skipped: 0, Time elapsed: 0.057 sec
Running org.apache.hadoop.hbase.regionserver.TestKeyValueHeap
Tests run: 3, Failures: 0, Errors: 0, Skipped: 0, Time elapsed: 0.096 sec
Running org.apache.hadoop.hbase.regionserver.TestStoreScanner
Tests run: 14, Failures: 0, Errors: 0, Skipped: 0, Time elapsed: 0.035 sec
Running org.apache.hadoop.hbase.io.hfile.TestReseekTo
Tests run: 1, Failures: 0, Errors: 0, Skipped: 0, Time elapsed: 0.204 sec
Running org.apache.hadoop.hbase.regionserver.TestHRegionInfo
Tests run: 2, Failures: 0, Errors: 0, Skipped: 0, Time elapsed: 0.016 sec
Running org.apache.hadoop.hbase.regionserver.TestScanner
Tests run: 6, Failures: 0, Errors: 0, Skipped: 0, Time elapsed: 93.842 sec
Running org.apache.hadoop.hbase.util.TestIncrementingEnvironmentEdge
Tests run: 1, Failures: 0, Errors: 0, Skipped: 0, Time elapsed: 0.016 sec
Running org.apache.hadoop.hbase.util.TestKeying
Tests run: 1, Failures: 0, Errors: 0, Skipped: 0, Time elapsed: 0.017 sec
Running org.apache.hadoop.hbase.util.TestHBaseFsck
Tests run: 2, Failures: 0, Errors: 0, Skipped: 0, Time elapsed: 60.397 sec
Running org.apache.hadoop.hbase.master.TestRestartCluster
Tests run: 2, Failures: 0, Errors: 0, Skipped: 0, Time elapsed: 82.263 sec
Running org.apache.hadoop.hbase.client.TestShell
Tests run: 1, Failures: 0, Errors: 0, Skipped: 0, Time elapsed: 40.798 sec
Running org.apache.hadoop.hbase.rest.model.TestTableInfoModel
Tests run: 3, Failures: 0, Errors: 0, Skipped: 0, Time elapsed: 0.133 sec
Running org.apache.hadoop.hbase.TestInfoServers
Tests run: 2, Failures: 0, Errors: 0, Skipped: 0, Time elapsed: 35.47 sec
Running org.apache.hadoop.hbase.master.TestLogsCleaner
Tests run: 1, Failures: 0, Errors: 0, Skipped: 0, Time elapsed: 1.232 sec
Running org.apache.hadoop.hbase.client.TestAttributes
Tests run: 3, Failures: 0, Errors: 0, Skipped: 0, Time elapsed: 0.02 sec
Running org.apache.hadoop.hbase.regionserver.TestMasterAddressManager
Tests run: 1, Failures: 0, Errors: 0, Skipped: 0, Time elapsed: 0.285 sec
Running org.apache.hadoop.hbase.master.TestMasterStatusServlet
Tests run: 4, Failures: 0, Errors: 0, Skipped: 0, Time elapsed: 0.37 sec
Running org.apache.hadoop.hbase.catalog.TestCatalogTrackerOnCluster
Tests run: 1, Failures: 0, Errors: 0, Skipped: 0, Time elapsed: 212.68 sec
Running org.apache.hadoop.hbase.regionserver.TestQueryMatcher
Tests run: 4, Failures: 0, Errors: 0, Skipped: 0, Time elapsed: 0.104 sec
Running org.apache.hadoop.hbase.zookeeper.TestZKTable
Tests run: 1, Failures: 0, Errors: 0, Skipped: 0, Time elapsed: 0.296 sec
Running org.apache.hadoop.hbase.client.TestAdmin
Tests run: 19, Failures: 0, Errors: 0, Skipped: 0, Time elapsed: 263.637 sec
Running org.apache.hadoop.hbase.util.TestSortedCopyOnWriteSet
Tests run: 2, Failures: 0, Errors: 0, Skipped: 0, Time elapsed: 0.023 sec
Running org.apache.hadoop.hbase.util.TestMergeTool
Tests run: 1, Failures: 0, Errors: 0, Skipped: 0, Time elapsed: 48.66 sec
Running org.apache.hadoop.hbase.TestAcidGuarantees
Tests run: 3, Failures: 0, Errors: 0, Skipped: 3, Time elapsed: 0.015 sec
Running org.apache.hadoop.hbase.TestHRegionLocation
Tests run: 3, Failures: 0, Errors: 0, Skipped: 0, Time elapsed: 0.017 sec
Running org.apache.hadoop.hbase.util.TestBase64
Tests run: 1, Failures: 0, Errors: 0, Skipped: 0, Time elapsed: 0.017 sec
Running org.apache.hadoop.hbase.coprocessor.TestRegionObserverStacking
Tests run: 1, Failures: 0, Errors: 0, Skipped: 0, Time elapsed: 0.24 sec
Running org.apache.hadoop.hbase.regionserver.TestMemStore
Tests run: 21, Failures: 0, Errors: 0, Skipped: 0, Time elapsed: 51.318 sec
Running org.apache.hadoop.hbase.rest.TestScannerResource
Tests run: 5, Failures: 0, Errors: 0, Skipped: 0, Time elapsed: 59.255 sec
Running org.apache.hadoop.hbase.io.hfile.TestLruBlockCache
Tests run: 7, Failures: 0, Errors: 0, Skipped: 0, Time elapsed: 1.053 sec
Running org.apache.hadoop.hbase.master.TestDeadServer
Tests run: 1, Failures: 0, Errors: 0, Skipped: 0, Time elapsed: 0.018 sec
Running org.apache.hadoop.hbase.rest.TestGzipFilter
Tests run: 2, Failures: 0, Errors: 0, Skipped: 0, Time elapsed: 43.387 sec
Running org.apache.hadoop.hbase.mapreduce.TestTableMapReduce
Tests run: 2, Failures: 0, Errors: 0, Skipped: 0, Time elapsed: 85.964 sec
Running org.apache.hadoop.hbase.TestKeyValue
Tests run: 9, Failures: 0, Errors: 0, Skipped: 0, Time elapsed: 0.026 sec
Running org.apache.hadoop.hbase.filter.TestColumnRangeFilter
Tests run: 1, Failures: 0, Errors: 0, Skipped: 0, Time elapsed: 28.185 sec
Running org.apache.hadoop.hbase.client.TestMultiParallel
Tests run: 10, Failures: 0, Errors: 0, Skipped: 0, Time elapsed: 35.402 sec
Running org.apache.hadoop.hbase.master.TestMaster
Tests run: 1, Failures: 0, Errors: 0, Skipped: 0, Time elapsed: 79.845 sec
Running org.apache.hadoop.hbase.master.TestRollingRestart
Tests run: 1, Failures: 0, Errors: 0, Skipped: 0, Time elapsed: 76.333 sec
Running org.apache.hadoop.hbase.client.TestResult
Tests run: 2, Failures: 0, Errors: 0, Skipped: 0, Time elapsed: 0.038 sec
Running org.apache.hadoop.hbase.client.TestHTablePool
Tests run: 10, Failures: 0, Errors: 0, Skipped: 0, Time elapsed: 185.414 sec
Running org.apache.hadoop.hbase.regionserver.TestRSStatusServlet
Tests run: 2, Failures: 0, Errors: 0, Skipped: 0, Time elapsed: 0.274 sec
Running org.apache.hadoop.hbase.regionserver.TestCompactSelection
Tests run: 1, Failures: 0, Errors: 0, Skipped: 0, Time elapsed: 0.193 sec
Running org.apache.hadoop.hbase.util.TestByteBloomFilter
Tests run: 3, Failures: 0, Errors: 0, Skipped: 0, Time elapsed: 1.588 sec
Running org.apache.hadoop.hbase.rest.model.TestTableSchemaModel
Tests run: 3, Failures: 0, Errors: 0, Skipped: 0, Time elapsed: 0.134 sec
Running org.apache.hadoop.hbase.mapreduce.TestTableInputFormatScan
Tests run: 11, Failures: 0, Errors: 0, Skipped: 0, Time elapsed: 328.353 sec
Running org.apache.hadoop.hbase.filter.TestFilterList
Tests run: 4, Failures: 0, Errors: 0, Skipped: 0, Time elapsed: 0.04 sec
Running org.apache.hadoop.hbase.regionserver.TestHRegion
Tests run: 54, Failures: 0, Errors: 0, Skipped: 0, Time elapsed: 34.499 sec
Running org.apache.hadoop.hbase.master.TestMasterFailover
Tests run: 3, Failures: 0, Errors: 1, Skipped: 0, Time elapsed: 249.544 sec <<< FAILURE!
Running org.apache.hadoop.hbase.client.TestScan
Tests run: 2, Failures: 0, Errors: 0, Skipped: 0, Time elapsed: 0.018 sec
Running org.apache.hadoop.hbase.rest.model.TestTableRegionModel
Tests run: 4, Failures: 0, Errors: 0, Skipped: 0, Time elapsed: 0.032 sec
Running org.apache.hadoop.hbase.client.TestTimestampsFilter
Tests run: 3, Failures: 0, Errors: 0, Skipped: 0, Time elapsed: 59.819 sec
Running org.apache.hadoop.hbase.master.TestLoadBalancer
Tests run: 5, Failures: 0, Errors: 0, Skipped: 0, Time elapsed: 2.172 sec
Running org.apache.hadoop.hbase.util.TestRootPath
Tests run: 1, Failures: 0, Errors: 0, Skipped: 0, Time elapsed: 0.02 sec
Running org.apache.hadoop.hbase.client.TestScannerTimeout
Tests run: 4, Failures: 0, Errors: 0, Skipped: 0, Time elapsed: 79.814 sec
Running org.apache.hadoop.hbase.regionserver.wal.TestWALObserver
Tests run: 1, Failures: 0, Errors: 0, Skipped: 0, Time elapsed: 0.32 sec
Running org.apache.hadoop.hbase.mapred.TestTableMapReduce
Tests run: 1, Failures: 0, Errors: 0, Skipped: 0, Time elapsed: 60.054 sec
Running org.apache.hadoop.hbase.coprocessor.TestAggregateProtocol
Tests run: 44, Failures: 0, Errors: 0, Skipped: 0, Time elapsed: 21.559 sec
Running org.apache.hadoop.hbase.master.TestActiveMasterManager
Tests run: 2, Failures: 0, Errors: 0, Skipped: 0, Time elapsed: 0.634 sec
Running org.apache.hadoop.hbase.util.TestBytes
Tests run: 10, Failures: 0, Errors: 0, Skipped: 0, Time elapsed: 0.022 sec
Running org.apache.hadoop.hbase.filter.TestRandomRowFilter
Tests run: 2, Failures: 0, Errors: 0, Skipped: 0, Time elapsed: 0.431 sec
Running org.apache.hadoop.hbase.replication.regionserver.TestReplicationSourceManager
Tests run: 1, Failures: 0, Errors: 0, Skipped: 0, Time elapsed: 0.912 sec
Running org.apache.hadoop.hbase.util.TestCompressionTest
Tests run: 1, Failures: 0, Errors: 0, Skipped: 0, Time elapsed: 0.026 sec
Running org.apache.hadoop.hbase.client.TestGetRowVersions
Tests run: 1, Failures: 0, Errors: 0, Skipped: 0, Time elapsed: 33.428 sec
Running org.apache.hadoop.hbase.filter.TestDependentColumnFilter
Tests run: 2, Failures: 0, Errors: 0, Skipped: 0, Time elapsed: 0.4 sec
Running org.apache.hadoop.hbase.rest.model.TestCellModel
Tests run: 3, Failures: 0, Errors: 0, Skipped: 0, Time elapsed: 0.126 sec
Running org.apache.hadoop.hbase.master.TestCatalogJanitor
Tests run: 2, Failures: 0, Errors: 0, Skipped: 0, Time elapsed: 0.513 sec
Running org.apache.hadoop.hbase.catalog.TestCatalogTracker
Tests run: 8, Failures: 0, Errors: 0, Skipped: 0, Time elapsed: 2.973 sec
Running org.apache.hadoop.hbase.replication.TestReplicationSource
Tests run: 1, Failures: 0, Errors: 0, Skipped: 0, Time elapsed: 2.494 sec
Running org.apache.hadoop.hbase.coprocessor.TestWALObserver
Tests run: 3, Failures: 0, Errors: 0, Skipped: 0, Time elapsed: 53.896 sec
Running org.apache.hadoop.hbase.rest.TestRowResource
Tests run: 10, Failures: 0, Errors: 0, Skipped: 0, Time elapsed: 24.219 sec
Running org.apache.hadoop.hbase.io.hfile.TestHFile
Tests run: 7, Failures: 0, Errors: 0, Skipped: 0, Time elapsed: 0.334 sec
Running org.apache.hadoop.hbase.catalog.TestMetaReaderEditor
Tests run: 4, Failures: 0, Errors: 0, Skipped: 0, Time elapsed: 36.398 sec
Running org.apache.hadoop.hbase.mapreduce.TestImportTsv
Tests run: 8, Failures: 0, Errors: 0, Skipped: 0, Time elapsed: 58.373 sec
Running org.apache.hadoop.hbase.rest.client.TestRemoteAdmin
Tests run: 2, Failures: 0, Errors: 0, Skipped: 0, Time elapsed: 26.905 sec
Running org.apache.hadoop.hbase.regionserver.wal.TestHLog
Tests run: 9, Failures: 0, Errors: 0, Skipped: 0, Time elapsed: 93.133 sec
Running org.apache.hadoop.hbase.client.TestTimestamp
Tests run: 1, Failures: 0, Errors: 0, Skipped: 0, Time elapsed: 19.845 sec
Running org.apache.hadoop.hbase.TestScanMultipleVersions
Tests run: 1, Failures: 0, Errors: 0, Skipped: 0, Time elapsed: 19.575 sec
Running org.apache.hadoop.hbase.util.TestPoolMap
Tests run: 9, Failures: 0, Errors: 0, Skipped: 0, Time elapsed: 0.037 sec
Running org.apache.hadoop.hbase.TestGlobalMemStoreSize
Tests run: 1, Failures: 0, Errors: 0, Skipped: 0, Time elapsed: 44.999 sec
Running org.apache.hadoop.hbase.rest.model.TestStorageClusterVersionModel
Tests run: 2, Failures: 0, Errors: 0, Skipped: 0, Time elapsed: 0.031 sec
Running org.apache.hadoop.hbase.client.TestHCM
Tests run: 3, Failures: 0, Errors: 0, Skipped: 0, Time elapsed: 23.932 sec

Results :

Tests in error: 

Tests run: 801, Failures: 0, Errors: 2, Skipped: 9

[INFO] ------------------------------------------------------------------------
[ERROR] BUILD FAILURE
[INFO] ------------------------------------------------------------------------
[INFO] There are test failures.

Please refer to <https://builds.apache.org/job/HBase-TRUNK/ws/trunk/target/surefire-reports> for the individual test results.
[INFO] ------------------------------------------------------------------------
[INFO] For more information, run Maven with the -e switch
[INFO] ------------------------------------------------------------------------
[INFO] Total time: 99 minutes 10 seconds
[INFO] Finished at: Sun Jun 12 19:03:17 UTC 2011
[INFO] Final Memory: 91M/982M
[INFO] ------------------------------------------------------------------------
[locks-and-latches] Releasing all the locks
[locks-and-latches] All the locks released
Archiving artifacts
Recording test results


Build failed in Jenkins: HBase-TRUNK #1965

Posted by Apache Jenkins Server <je...@builds.apache.org>.
See <https://builds.apache.org/job/HBase-TRUNK/1965/changes>

Changes:

[apurtell] HBASE 3976; Revert

------------------------------------------
[...truncated 3466 lines...]
Tests run: 8, Failures: 0, Errors: 0, Skipped: 0, Time elapsed: 90.944 sec
Running org.apache.hadoop.hbase.mapreduce.TestTableSplit
Tests run: 1, Failures: 0, Errors: 0, Skipped: 0, Time elapsed: 0.017 sec
Running org.apache.hadoop.hbase.filter.TestSingleColumnValueExcludeFilter
Tests run: 1, Failures: 0, Errors: 0, Skipped: 0, Time elapsed: 0.016 sec
Running org.apache.hadoop.hbase.TestHBaseTestingUtility
Tests run: 6, Failures: 0, Errors: 0, Skipped: 0, Time elapsed: 83.529 sec
Running org.apache.hadoop.hbase.mapreduce.TestLoadIncrementalHFiles
Tests run: 4, Failures: 0, Errors: 0, Skipped: 0, Time elapsed: 39.29 sec
Running org.apache.hadoop.hbase.regionserver.wal.TestWALReplay
Tests run: 4, Failures: 0, Errors: 0, Skipped: 0, Time elapsed: 29.09 sec
Running org.apache.hadoop.hbase.rest.TestSchemaResource
Tests run: 2, Failures: 0, Errors: 0, Skipped: 0, Time elapsed: 28.961 sec
Running org.apache.hadoop.hbase.regionserver.TestKeyValueScanFixture
Tests run: 1, Failures: 0, Errors: 0, Skipped: 0, Time elapsed: 0.016 sec
Running org.apache.hadoop.hbase.rest.model.TestTableListModel
Tests run: 3, Failures: 0, Errors: 0, Skipped: 0, Time elapsed: 0.13 sec
Running org.apache.hadoop.hbase.rest.model.TestColumnSchemaModel
Tests run: 2, Failures: 0, Errors: 0, Skipped: 0, Time elapsed: 0.031 sec
Running org.apache.hadoop.hbase.regionserver.TestStoreFile
Tests run: 8, Failures: 0, Errors: 0, Skipped: 0, Time elapsed: 66.696 sec
Running org.apache.hadoop.hbase.zookeeper.TestZooKeeperNodeTracker
Tests run: 2, Failures: 0, Errors: 0, Skipped: 0, Time elapsed: 0.417 sec
Running org.apache.hadoop.hbase.master.TestSplitLogManager
Tests run: 9, Failures: 0, Errors: 0, Skipped: 0, Time elapsed: 12.837 sec
Running org.apache.hadoop.hbase.regionserver.wal.TestHLogMethods
Tests run: 3, Failures: 0, Errors: 0, Skipped: 0, Time elapsed: 0.422 sec
Running org.apache.hadoop.hbase.rest.model.TestScannerModel
Tests run: 3, Failures: 0, Errors: 0, Skipped: 0, Time elapsed: 0.131 sec
Running org.apache.hadoop.hbase.rest.TestVersionResource
Tests run: 7, Failures: 0, Errors: 0, Skipped: 0, Time elapsed: 29.808 sec
Running org.apache.hadoop.hbase.filter.TestFilter
Tests run: 18, Failures: 0, Errors: 0, Skipped: 0, Time elapsed: 4.056 sec
Running org.apache.hadoop.hbase.TestServerName
Tests run: 2, Failures: 0, Errors: 0, Skipped: 0, Time elapsed: 0.017 sec
Running org.apache.hadoop.hbase.regionserver.TestWideScanner
Tests run: 1, Failures: 0, Errors: 0, Skipped: 0, Time elapsed: 35.456 sec
Running org.apache.hadoop.hbase.regionserver.TestSplitTransaction
Tests run: 5, Failures: 0, Errors: 0, Skipped: 0, Time elapsed: 3.164 sec
Running org.apache.hadoop.hbase.replication.regionserver.TestReplicationSink
Tests run: 5, Failures: 0, Errors: 0, Skipped: 0, Time elapsed: 26.157 sec
Running org.apache.hadoop.hbase.regionserver.TestGetClosestAtOrBefore
Tests run: 3, Failures: 0, Errors: 0, Skipped: 0, Time elapsed: 11.29 sec
Running org.apache.hadoop.hbase.regionserver.TestReadWriteConsistencyControl
Tests run: 1, Failures: 0, Errors: 0, Skipped: 0, Time elapsed: 10.02 sec
Running org.apache.hadoop.hbase.util.TestMergeTable
Tests run: 1, Failures: 0, Errors: 0, Skipped: 0, Time elapsed: 51.53 sec
Running org.apache.hadoop.hbase.coprocessor.TestMasterObserver
Tests run: 3, Failures: 0, Errors: 0, Skipped: 0, Time elapsed: 29.613 sec
Running org.apache.hadoop.hbase.rest.model.TestVersionModel
Tests run: 3, Failures: 0, Errors: 0, Skipped: 0, Time elapsed: 0.126 sec
Running org.apache.hadoop.hbase.rest.model.TestCellSetModel
Tests run: 3, Failures: 0, Errors: 0, Skipped: 0, Time elapsed: 0.137 sec
Running org.apache.hadoop.hbase.rest.client.TestRemoteTable
Tests run: 3, Failures: 0, Errors: 0, Skipped: 0, Time elapsed: 37.708 sec
Running org.apache.hadoop.hbase.rest.model.TestStorageClusterStatusModel
Tests run: 3, Failures: 0, Errors: 0, Skipped: 0, Time elapsed: 0.137 sec
Running org.apache.hadoop.hbase.monitoring.TestTaskMonitor
Tests run: 3, Failures: 0, Errors: 0, Skipped: 0, Time elapsed: 0.231 sec
Running org.apache.hadoop.hbase.avro.TestAvroServer
Tests run: 3, Failures: 0, Errors: 0, Skipped: 0, Time elapsed: 55.728 sec
Running org.apache.hadoop.hbase.TestFullLogReconstruction
Tests run: 1, Failures: 0, Errors: 0, Skipped: 0, Time elapsed: 61.764 sec
Running org.apache.hadoop.hbase.TestSerialization
Tests run: 18, Failures: 0, Errors: 0, Skipped: 0, Time elapsed: 0.055 sec
Running org.apache.hadoop.hbase.regionserver.TestKeyValueHeap
Tests run: 3, Failures: 0, Errors: 0, Skipped: 0, Time elapsed: 0.094 sec
Running org.apache.hadoop.hbase.regionserver.TestStoreScanner
Tests run: 14, Failures: 0, Errors: 0, Skipped: 0, Time elapsed: 0.035 sec
Running org.apache.hadoop.hbase.io.hfile.TestReseekTo
Tests run: 1, Failures: 0, Errors: 0, Skipped: 0, Time elapsed: 0.203 sec
Running org.apache.hadoop.hbase.regionserver.TestHRegionInfo
Tests run: 2, Failures: 0, Errors: 0, Skipped: 0, Time elapsed: 0.017 sec
Running org.apache.hadoop.hbase.regionserver.TestScanner
Tests run: 6, Failures: 0, Errors: 0, Skipped: 0, Time elapsed: 75.633 sec
Running org.apache.hadoop.hbase.util.TestIncrementingEnvironmentEdge
Tests run: 1, Failures: 0, Errors: 0, Skipped: 0, Time elapsed: 0.016 sec
Running org.apache.hadoop.hbase.util.TestKeying
Tests run: 1, Failures: 0, Errors: 0, Skipped: 0, Time elapsed: 0.016 sec
Running org.apache.hadoop.hbase.util.TestHBaseFsck
Tests run: 2, Failures: 0, Errors: 0, Skipped: 0, Time elapsed: 34.834 sec
Running org.apache.hadoop.hbase.master.TestRestartCluster
Tests run: 2, Failures: 0, Errors: 0, Skipped: 0, Time elapsed: 70.035 sec
Running org.apache.hadoop.hbase.client.TestShell
Tests run: 1, Failures: 0, Errors: 0, Skipped: 0, Time elapsed: 39.966 sec
Running org.apache.hadoop.hbase.rest.model.TestTableInfoModel
Tests run: 3, Failures: 0, Errors: 0, Skipped: 0, Time elapsed: 0.154 sec
Running org.apache.hadoop.hbase.TestInfoServers
Tests run: 2, Failures: 0, Errors: 0, Skipped: 0, Time elapsed: 50.232 sec
Running org.apache.hadoop.hbase.master.TestLogsCleaner
Tests run: 1, Failures: 0, Errors: 0, Skipped: 0, Time elapsed: 1.189 sec
Running org.apache.hadoop.hbase.client.TestAttributes
Tests run: 3, Failures: 0, Errors: 0, Skipped: 0, Time elapsed: 0.02 sec
Running org.apache.hadoop.hbase.regionserver.TestMasterAddressManager
Tests run: 1, Failures: 0, Errors: 0, Skipped: 0, Time elapsed: 0.28 sec
Running org.apache.hadoop.hbase.master.TestMasterStatusServlet
Tests run: 4, Failures: 0, Errors: 0, Skipped: 0, Time elapsed: 0.395 sec
Running org.apache.hadoop.hbase.catalog.TestCatalogTrackerOnCluster
Tests run: 1, Failures: 0, Errors: 0, Skipped: 0, Time elapsed: 212.271 sec
Running org.apache.hadoop.hbase.regionserver.TestQueryMatcher
Tests run: 4, Failures: 0, Errors: 0, Skipped: 0, Time elapsed: 0.108 sec
Running org.apache.hadoop.hbase.zookeeper.TestZKTable
Tests run: 1, Failures: 0, Errors: 0, Skipped: 0, Time elapsed: 0.288 sec
Running org.apache.hadoop.hbase.client.TestAdmin
Tests run: 19, Failures: 0, Errors: 0, Skipped: 0, Time elapsed: 280.511 sec
Running org.apache.hadoop.hbase.util.TestSortedCopyOnWriteSet
Tests run: 2, Failures: 0, Errors: 0, Skipped: 0, Time elapsed: 0.024 sec
Running org.apache.hadoop.hbase.util.TestMergeTool
Tests run: 1, Failures: 0, Errors: 0, Skipped: 0, Time elapsed: 25.421 sec
Running org.apache.hadoop.hbase.TestAcidGuarantees
Tests run: 3, Failures: 0, Errors: 0, Skipped: 3, Time elapsed: 0.027 sec
Running org.apache.hadoop.hbase.TestHRegionLocation
Tests run: 3, Failures: 0, Errors: 0, Skipped: 0, Time elapsed: 0.018 sec
Running org.apache.hadoop.hbase.util.TestBase64
Tests run: 1, Failures: 0, Errors: 0, Skipped: 0, Time elapsed: 0.027 sec
Running org.apache.hadoop.hbase.coprocessor.TestRegionObserverStacking
Tests run: 1, Failures: 0, Errors: 0, Skipped: 0, Time elapsed: 0.243 sec
Running org.apache.hadoop.hbase.regionserver.TestMemStore
Tests run: 21, Failures: 0, Errors: 0, Skipped: 0, Time elapsed: 50.684 sec
Running org.apache.hadoop.hbase.rest.TestScannerResource
Tests run: 5, Failures: 0, Errors: 0, Skipped: 0, Time elapsed: 61.064 sec
Running org.apache.hadoop.hbase.io.hfile.TestLruBlockCache
Tests run: 7, Failures: 0, Errors: 0, Skipped: 0, Time elapsed: 1.054 sec
Running org.apache.hadoop.hbase.master.TestDeadServer
Tests run: 1, Failures: 0, Errors: 0, Skipped: 0, Time elapsed: 0.018 sec
Running org.apache.hadoop.hbase.rest.TestGzipFilter
Tests run: 2, Failures: 0, Errors: 0, Skipped: 0, Time elapsed: 22.324 sec
Running org.apache.hadoop.hbase.mapreduce.TestTableMapReduce
Tests run: 2, Failures: 0, Errors: 0, Skipped: 0, Time elapsed: 88.661 sec
Running org.apache.hadoop.hbase.TestKeyValue
Tests run: 9, Failures: 0, Errors: 0, Skipped: 0, Time elapsed: 0.025 sec
Running org.apache.hadoop.hbase.filter.TestColumnRangeFilter
Tests run: 1, Failures: 0, Errors: 0, Skipped: 0, Time elapsed: 28.194 sec
Running org.apache.hadoop.hbase.client.TestMultiParallel
Tests run: 10, Failures: 0, Errors: 0, Skipped: 0, Time elapsed: 34.22 sec
Running org.apache.hadoop.hbase.master.TestMaster
Tests run: 1, Failures: 0, Errors: 0, Skipped: 0, Time elapsed: 90.013 sec
Running org.apache.hadoop.hbase.master.TestRollingRestart
Tests run: 1, Failures: 0, Errors: 0, Skipped: 0, Time elapsed: 65.228 sec
Running org.apache.hadoop.hbase.client.TestResult
Tests run: 2, Failures: 0, Errors: 0, Skipped: 0, Time elapsed: 0.037 sec
Running org.apache.hadoop.hbase.client.TestHTablePool
Tests run: 10, Failures: 0, Errors: 0, Skipped: 0, Time elapsed: 183.57 sec
Running org.apache.hadoop.hbase.regionserver.TestRSStatusServlet
Tests run: 2, Failures: 0, Errors: 0, Skipped: 0, Time elapsed: 0.285 sec
Running org.apache.hadoop.hbase.regionserver.TestCompactSelection
Tests run: 1, Failures: 0, Errors: 0, Skipped: 0, Time elapsed: 0.195 sec
Running org.apache.hadoop.hbase.util.TestByteBloomFilter
Tests run: 3, Failures: 0, Errors: 0, Skipped: 0, Time elapsed: 1.571 sec
Running org.apache.hadoop.hbase.rest.model.TestTableSchemaModel
Tests run: 3, Failures: 0, Errors: 0, Skipped: 0, Time elapsed: 0.138 sec
Running org.apache.hadoop.hbase.mapreduce.TestTableInputFormatScan
Tests run: 11, Failures: 0, Errors: 0, Skipped: 0, Time elapsed: 326.804 sec
Running org.apache.hadoop.hbase.filter.TestFilterList
Tests run: 4, Failures: 0, Errors: 0, Skipped: 0, Time elapsed: 0.04 sec
Running org.apache.hadoop.hbase.regionserver.TestHRegion
Tests run: 54, Failures: 0, Errors: 0, Skipped: 0, Time elapsed: 33.873 sec
Running org.apache.hadoop.hbase.master.TestMasterFailover
Tests run: 3, Failures: 0, Errors: 1, Skipped: 0, Time elapsed: 237.15 sec <<< FAILURE!
Running org.apache.hadoop.hbase.client.TestScan
Tests run: 2, Failures: 0, Errors: 0, Skipped: 0, Time elapsed: 0.019 sec
Running org.apache.hadoop.hbase.rest.model.TestTableRegionModel
Tests run: 4, Failures: 0, Errors: 0, Skipped: 0, Time elapsed: 0.032 sec
Running org.apache.hadoop.hbase.client.TestTimestampsFilter
Tests run: 3, Failures: 0, Errors: 0, Skipped: 0, Time elapsed: 33.332 sec
Running org.apache.hadoop.hbase.master.TestLoadBalancer
Tests run: 5, Failures: 0, Errors: 0, Skipped: 0, Time elapsed: 2.112 sec
Running org.apache.hadoop.hbase.util.TestRootPath
Tests run: 1, Failures: 0, Errors: 0, Skipped: 0, Time elapsed: 0.021 sec
Running org.apache.hadoop.hbase.client.TestScannerTimeout
Tests run: 4, Failures: 0, Errors: 0, Skipped: 0, Time elapsed: 51.692 sec
Running org.apache.hadoop.hbase.regionserver.wal.TestWALObserver
Tests run: 1, Failures: 0, Errors: 0, Skipped: 0, Time elapsed: 0.32 sec
Running org.apache.hadoop.hbase.mapred.TestTableMapReduce
Tests run: 1, Failures: 0, Errors: 0, Skipped: 0, Time elapsed: 55.649 sec
Running org.apache.hadoop.hbase.coprocessor.TestAggregateProtocol
Tests run: 44, Failures: 0, Errors: 0, Skipped: 0, Time elapsed: 22.41 sec
Running org.apache.hadoop.hbase.master.TestActiveMasterManager
Tests run: 2, Failures: 0, Errors: 0, Skipped: 0, Time elapsed: 0.638 sec
Running org.apache.hadoop.hbase.util.TestBytes
Tests run: 10, Failures: 0, Errors: 0, Skipped: 0, Time elapsed: 0.022 sec
Running org.apache.hadoop.hbase.filter.TestRandomRowFilter
Tests run: 2, Failures: 0, Errors: 0, Skipped: 0, Time elapsed: 0.432 sec
Running org.apache.hadoop.hbase.replication.regionserver.TestReplicationSourceManager
Tests run: 1, Failures: 0, Errors: 0, Skipped: 0, Time elapsed: 0.95 sec
Running org.apache.hadoop.hbase.util.TestCompressionTest
Tests run: 1, Failures: 0, Errors: 0, Skipped: 0, Time elapsed: 0.025 sec
Running org.apache.hadoop.hbase.client.TestGetRowVersions
Tests run: 1, Failures: 0, Errors: 0, Skipped: 0, Time elapsed: 51.286 sec
Running org.apache.hadoop.hbase.filter.TestDependentColumnFilter
Tests run: 2, Failures: 0, Errors: 0, Skipped: 0, Time elapsed: 0.4 sec
Running org.apache.hadoop.hbase.rest.model.TestCellModel
Tests run: 3, Failures: 0, Errors: 0, Skipped: 0, Time elapsed: 0.127 sec
Running org.apache.hadoop.hbase.master.TestCatalogJanitor
Tests run: 2, Failures: 0, Errors: 0, Skipped: 0, Time elapsed: 0.588 sec
Running org.apache.hadoop.hbase.catalog.TestCatalogTracker
Tests run: 8, Failures: 0, Errors: 0, Skipped: 0, Time elapsed: 3.008 sec
Running org.apache.hadoop.hbase.replication.TestReplicationSource
Tests run: 1, Failures: 0, Errors: 0, Skipped: 0, Time elapsed: 2.513 sec
Running org.apache.hadoop.hbase.coprocessor.TestWALObserver
Tests run: 3, Failures: 0, Errors: 0, Skipped: 0, Time elapsed: 81.965 sec
Running org.apache.hadoop.hbase.rest.TestRowResource
Tests run: 10, Failures: 0, Errors: 0, Skipped: 0, Time elapsed: 22.39 sec
Running org.apache.hadoop.hbase.io.hfile.TestHFile
Tests run: 7, Failures: 0, Errors: 0, Skipped: 0, Time elapsed: 0.333 sec
Running org.apache.hadoop.hbase.catalog.TestMetaReaderEditor
Tests run: 4, Failures: 0, Errors: 0, Skipped: 0, Time elapsed: 26.842 sec
Running org.apache.hadoop.hbase.mapreduce.TestImportTsv
Tests run: 8, Failures: 0, Errors: 0, Skipped: 0, Time elapsed: 44.278 sec
Running org.apache.hadoop.hbase.rest.client.TestRemoteAdmin
Tests run: 2, Failures: 0, Errors: 0, Skipped: 0, Time elapsed: 27.574 sec
Running org.apache.hadoop.hbase.regionserver.wal.TestHLog
Tests run: 9, Failures: 0, Errors: 0, Skipped: 0, Time elapsed: 80.827 sec
Running org.apache.hadoop.hbase.client.TestTimestamp
Tests run: 1, Failures: 0, Errors: 0, Skipped: 0, Time elapsed: 19.08 sec
Running org.apache.hadoop.hbase.TestScanMultipleVersions
Tests run: 1, Failures: 0, Errors: 0, Skipped: 0, Time elapsed: 19.518 sec
Running org.apache.hadoop.hbase.util.TestPoolMap
Tests run: 9, Failures: 0, Errors: 0, Skipped: 0, Time elapsed: 0.029 sec
Running org.apache.hadoop.hbase.TestGlobalMemStoreSize
Tests run: 1, Failures: 0, Errors: 0, Skipped: 0, Time elapsed: 47.477 sec
Running org.apache.hadoop.hbase.rest.model.TestStorageClusterVersionModel
Tests run: 2, Failures: 0, Errors: 0, Skipped: 0, Time elapsed: 0.03 sec
Running org.apache.hadoop.hbase.client.TestHCM
Tests run: 3, Failures: 0, Errors: 0, Skipped: 0, Time elapsed: 51.146 sec

Results :

Tests in error: 

Tests run: 801, Failures: 0, Errors: 1, Skipped: 9

[INFO] ------------------------------------------------------------------------
[ERROR] BUILD FAILURE
[INFO] ------------------------------------------------------------------------
[INFO] There are test failures.

Please refer to <https://builds.apache.org/job/HBase-TRUNK/ws/trunk/target/surefire-reports> for the individual test results.
[INFO] ------------------------------------------------------------------------
[INFO] For more information, run Maven with the -e switch
[INFO] ------------------------------------------------------------------------
[INFO] Total time: 98 minutes 42 seconds
[INFO] Finished at: Sun Jun 12 17:21:42 UTC 2011
[INFO] Final Memory: 91M/952M
[INFO] ------------------------------------------------------------------------
[locks-and-latches] Releasing all the locks
[locks-and-latches] All the locks released
Archiving artifacts
Recording test results