You are viewing a plain text version of this content. The canonical link for it is here.
Posted to dev@lucene.apache.org by Policeman Jenkins Server <je...@thetaphi.de> on 2019/01/04 14:32:11 UTC

[JENKINS] Lucene-Solr-master-Windows (64bit/jdk-10.0.1) - Build # 7676 - Failure!

Build: https://jenkins.thetaphi.de/job/Lucene-Solr-master-Windows/7676/
Java: 64bit/jdk-10.0.1 -XX:+UseCompressedOops -XX:+UseConcMarkSweepGC

All tests passed

Build Log:
[...truncated 2096 lines...]
   [junit4] JVM J1: stderr was not empty, see: C:\Users\jenkins\workspace\Lucene-Solr-master-Windows\lucene\build\core\test\temp\junit4-J1-20190104_131101_4956603580940051438220.syserr
   [junit4] >>> JVM J1 emitted unexpected output (verbatim) ----
   [junit4] OpenJDK 64-Bit Server VM warning: Option UseConcMarkSweepGC was deprecated in version 9.0 and will likely be removed in a future release.
   [junit4] <<< JVM J1: EOF ----

[...truncated 5 lines...]
   [junit4] JVM J0: stderr was not empty, see: C:\Users\jenkins\workspace\Lucene-Solr-master-Windows\lucene\build\core\test\temp\junit4-J0-20190104_131101_4966050782587001716534.syserr
   [junit4] >>> JVM J0 emitted unexpected output (verbatim) ----
   [junit4] OpenJDK 64-Bit Server VM warning: Option UseConcMarkSweepGC was deprecated in version 9.0 and will likely be removed in a future release.
   [junit4] <<< JVM J0: EOF ----

[...truncated 322 lines...]
   [junit4] JVM J0: stderr was not empty, see: C:\Users\jenkins\workspace\Lucene-Solr-master-Windows\lucene\build\test-framework\test\temp\junit4-J0-20190104_131851_36317828251495600986995.syserr
   [junit4] >>> JVM J0 emitted unexpected output (verbatim) ----
   [junit4] OpenJDK 64-Bit Server VM warning: Option UseConcMarkSweepGC was deprecated in version 9.0 and will likely be removed in a future release.
   [junit4] <<< JVM J0: EOF ----

   [junit4] JVM J1: stderr was not empty, see: C:\Users\jenkins\workspace\Lucene-Solr-master-Windows\lucene\build\test-framework\test\temp\junit4-J1-20190104_131851_36310248802702225795867.syserr
   [junit4] >>> JVM J1 emitted unexpected output (verbatim) ----
   [junit4] OpenJDK 64-Bit Server VM warning: Option UseConcMarkSweepGC was deprecated in version 9.0 and will likely be removed in a future release.
   [junit4] <<< JVM J1: EOF ----

[...truncated 1081 lines...]
   [junit4] JVM J0: stderr was not empty, see: C:\Users\jenkins\workspace\Lucene-Solr-master-Windows\lucene\build\analysis\common\test\temp\junit4-J0-20190104_132006_3301812777510369952134.syserr
   [junit4] >>> JVM J0 emitted unexpected output (verbatim) ----
   [junit4] OpenJDK 64-Bit Server VM warning: Option UseConcMarkSweepGC was deprecated in version 9.0 and will likely be removed in a future release.
   [junit4] <<< JVM J0: EOF ----

[...truncated 3 lines...]
   [junit4] JVM J1: stderr was not empty, see: C:\Users\jenkins\workspace\Lucene-Solr-master-Windows\lucene\build\analysis\common\test\temp\junit4-J1-20190104_132006_33013549876195576090076.syserr
   [junit4] >>> JVM J1 emitted unexpected output (verbatim) ----
   [junit4] OpenJDK 64-Bit Server VM warning: Option UseConcMarkSweepGC was deprecated in version 9.0 and will likely be removed in a future release.
   [junit4] <<< JVM J1: EOF ----

[...truncated 257 lines...]
   [junit4] JVM J0: stderr was not empty, see: C:\Users\jenkins\workspace\Lucene-Solr-master-Windows\lucene\build\analysis\icu\test\temp\junit4-J0-20190104_132230_87917180815161153284474.syserr
   [junit4] >>> JVM J0 emitted unexpected output (verbatim) ----
   [junit4] OpenJDK 64-Bit Server VM warning: Option UseConcMarkSweepGC was deprecated in version 9.0 and will likely be removed in a future release.
   [junit4] <<< JVM J0: EOF ----

[...truncated 3 lines...]
   [junit4] JVM J1: stderr was not empty, see: C:\Users\jenkins\workspace\Lucene-Solr-master-Windows\lucene\build\analysis\icu\test\temp\junit4-J1-20190104_132230_879827510122896441486.syserr
   [junit4] >>> JVM J1 emitted unexpected output (verbatim) ----
   [junit4] OpenJDK 64-Bit Server VM warning: Option UseConcMarkSweepGC was deprecated in version 9.0 and will likely be removed in a future release.
   [junit4] <<< JVM J1: EOF ----

[...truncated 245 lines...]
   [junit4] JVM J1: stderr was not empty, see: C:\Users\jenkins\workspace\Lucene-Solr-master-Windows\lucene\build\analysis\kuromoji\test\temp\junit4-J1-20190104_132242_7295690301553583352337.syserr
   [junit4] >>> JVM J1 emitted unexpected output (verbatim) ----
   [junit4] OpenJDK 64-Bit Server VM warning: Option UseConcMarkSweepGC was deprecated in version 9.0 and will likely be removed in a future release.
   [junit4] <<< JVM J1: EOF ----

[...truncated 12 lines...]
   [junit4] JVM J0: stderr was not empty, see: C:\Users\jenkins\workspace\Lucene-Solr-master-Windows\lucene\build\analysis\kuromoji\test\temp\junit4-J0-20190104_132242_72914322272502343248216.syserr
   [junit4] >>> JVM J0 emitted unexpected output (verbatim) ----
   [junit4] OpenJDK 64-Bit Server VM warning: Option UseConcMarkSweepGC was deprecated in version 9.0 and will likely be removed in a future release.
   [junit4] <<< JVM J0: EOF ----

[...truncated 163 lines...]
   [junit4] JVM J0: stderr was not empty, see: C:\Users\jenkins\workspace\Lucene-Solr-master-Windows\lucene\build\analysis\morfologik\test\temp\junit4-J0-20190104_132313_6549838929253732084278.syserr
   [junit4] >>> JVM J0 emitted unexpected output (verbatim) ----
   [junit4] OpenJDK 64-Bit Server VM warning: Option UseConcMarkSweepGC was deprecated in version 9.0 and will likely be removed in a future release.
   [junit4] <<< JVM J0: EOF ----

[...truncated 3 lines...]
   [junit4] JVM J1: stderr was not empty, see: C:\Users\jenkins\workspace\Lucene-Solr-master-Windows\lucene\build\analysis\morfologik\test\temp\junit4-J1-20190104_132313_65416864492039147172494.syserr
   [junit4] >>> JVM J1 emitted unexpected output (verbatim) ----
   [junit4] OpenJDK 64-Bit Server VM warning: Option UseConcMarkSweepGC was deprecated in version 9.0 and will likely be removed in a future release.
   [junit4] <<< JVM J1: EOF ----

[...truncated 208 lines...]
   [junit4] JVM J1: stderr was not empty, see: C:\Users\jenkins\workspace\Lucene-Solr-master-Windows\lucene\build\analysis\nori\test\temp\junit4-J1-20190104_132320_3279902091664089084101.syserr
   [junit4] >>> JVM J1 emitted unexpected output (verbatim) ----
   [junit4] OpenJDK 64-Bit Server VM warning: Option UseConcMarkSweepGC was deprecated in version 9.0 and will likely be removed in a future release.
   [junit4] <<< JVM J1: EOF ----

[...truncated 3 lines...]
   [junit4] JVM J0: stderr was not empty, see: C:\Users\jenkins\workspace\Lucene-Solr-master-Windows\lucene\build\analysis\nori\test\temp\junit4-J0-20190104_132320_32715613504977341680403.syserr
   [junit4] >>> JVM J0 emitted unexpected output (verbatim) ----
   [junit4] OpenJDK 64-Bit Server VM warning: Option UseConcMarkSweepGC was deprecated in version 9.0 and will likely be removed in a future release.
   [junit4] <<< JVM J0: EOF ----

[...truncated 169 lines...]
   [junit4] JVM J1: stderr was not empty, see: C:\Users\jenkins\workspace\Lucene-Solr-master-Windows\lucene\build\analysis\opennlp\test\temp\junit4-J1-20190104_132330_0015743013776565197671.syserr
   [junit4] >>> JVM J1 emitted unexpected output (verbatim) ----
   [junit4] OpenJDK 64-Bit Server VM warning: Option UseConcMarkSweepGC was deprecated in version 9.0 and will likely be removed in a future release.
   [junit4] <<< JVM J1: EOF ----

[...truncated 3 lines...]
   [junit4] JVM J0: stderr was not empty, see: C:\Users\jenkins\workspace\Lucene-Solr-master-Windows\lucene\build\analysis\opennlp\test\temp\junit4-J0-20190104_132330_0016441385075076734184.syserr
   [junit4] >>> JVM J0 emitted unexpected output (verbatim) ----
   [junit4] OpenJDK 64-Bit Server VM warning: Option UseConcMarkSweepGC was deprecated in version 9.0 and will likely be removed in a future release.
   [junit4] <<< JVM J0: EOF ----

[...truncated 177 lines...]
   [junit4] JVM J1: stderr was not empty, see: C:\Users\jenkins\workspace\Lucene-Solr-master-Windows\lucene\build\analysis\phonetic\test\temp\junit4-J1-20190104_132334_5525304444058466302004.syserr
   [junit4] >>> JVM J1 emitted unexpected output (verbatim) ----
   [junit4] OpenJDK 64-Bit Server VM warning: Option UseConcMarkSweepGC was deprecated in version 9.0 and will likely be removed in a future release.
   [junit4] <<< JVM J1: EOF ----

[...truncated 3 lines...]
   [junit4] JVM J0: stderr was not empty, see: C:\Users\jenkins\workspace\Lucene-Solr-master-Windows\lucene\build\analysis\phonetic\test\temp\junit4-J0-20190104_132334_552915760617727029098.syserr
   [junit4] >>> JVM J0 emitted unexpected output (verbatim) ----
   [junit4] OpenJDK 64-Bit Server VM warning: Option UseConcMarkSweepGC was deprecated in version 9.0 and will likely be removed in a future release.
   [junit4] <<< JVM J0: EOF ----

[...truncated 160 lines...]
   [junit4] JVM J0: stderr was not empty, see: C:\Users\jenkins\workspace\Lucene-Solr-master-Windows\lucene\build\analysis\smartcn\test\temp\junit4-J0-20190104_132346_9242202190623747479051.syserr
   [junit4] >>> JVM J0 emitted unexpected output (verbatim) ----
   [junit4] OpenJDK 64-Bit Server VM warning: Option UseConcMarkSweepGC was deprecated in version 9.0 and will likely be removed in a future release.
   [junit4] <<< JVM J0: EOF ----

[...truncated 3 lines...]
   [junit4] JVM J1: stderr was not empty, see: C:\Users\jenkins\workspace\Lucene-Solr-master-Windows\lucene\build\analysis\smartcn\test\temp\junit4-J1-20190104_132346_923161703586047188167.syserr
   [junit4] >>> JVM J1 emitted unexpected output (verbatim) ----
   [junit4] OpenJDK 64-Bit Server VM warning: Option UseConcMarkSweepGC was deprecated in version 9.0 and will likely be removed in a future release.
   [junit4] <<< JVM J1: EOF ----

[...truncated 165 lines...]
   [junit4] JVM J0: stderr was not empty, see: C:\Users\jenkins\workspace\Lucene-Solr-master-Windows\lucene\build\analysis\stempel\test\temp\junit4-J0-20190104_132356_7138682771419256028700.syserr
   [junit4] >>> JVM J0 emitted unexpected output (verbatim) ----
   [junit4] OpenJDK 64-Bit Server VM warning: Option UseConcMarkSweepGC was deprecated in version 9.0 and will likely be removed in a future release.
   [junit4] <<< JVM J0: EOF ----

[...truncated 3 lines...]
   [junit4] JVM J1: stderr was not empty, see: C:\Users\jenkins\workspace\Lucene-Solr-master-Windows\lucene\build\analysis\stempel\test\temp\junit4-J1-20190104_132356_71313941411349696578295.syserr
   [junit4] >>> JVM J1 emitted unexpected output (verbatim) ----
   [junit4] OpenJDK 64-Bit Server VM warning: Option UseConcMarkSweepGC was deprecated in version 9.0 and will likely be removed in a future release.
   [junit4] <<< JVM J1: EOF ----

[...truncated 161 lines...]
   [junit4] JVM J1: stderr was not empty, see: C:\Users\jenkins\workspace\Lucene-Solr-master-Windows\lucene\build\backward-codecs\test\temp\junit4-J1-20190104_132402_26712084702133240599246.syserr
   [junit4] >>> JVM J1 emitted unexpected output (verbatim) ----
   [junit4] OpenJDK 64-Bit Server VM warning: Option UseConcMarkSweepGC was deprecated in version 9.0 and will likely be removed in a future release.
   [junit4] <<< JVM J1: EOF ----

[...truncated 19 lines...]
   [junit4] JVM J0: stderr was not empty, see: C:\Users\jenkins\workspace\Lucene-Solr-master-Windows\lucene\build\backward-codecs\test\temp\junit4-J0-20190104_132402_26210157888100175808555.syserr
   [junit4] >>> JVM J0 emitted unexpected output (verbatim) ----
   [junit4] OpenJDK 64-Bit Server VM warning: Option UseConcMarkSweepGC was deprecated in version 9.0 and will likely be removed in a future release.
   [junit4] <<< JVM J0: EOF ----

[...truncated 1551 lines...]
   [junit4] JVM J1: stderr was not empty, see: C:\Users\jenkins\workspace\Lucene-Solr-master-Windows\lucene\build\benchmark\test\temp\junit4-J1-20190104_132432_91013748225759095097233.syserr
   [junit4] >>> JVM J1 emitted unexpected output (verbatim) ----
   [junit4] OpenJDK 64-Bit Server VM warning: Option UseConcMarkSweepGC was deprecated in version 9.0 and will likely be removed in a future release.
   [junit4] <<< JVM J1: EOF ----

[...truncated 3 lines...]
   [junit4] JVM J0: stderr was not empty, see: C:\Users\jenkins\workspace\Lucene-Solr-master-Windows\lucene\build\benchmark\test\temp\junit4-J0-20190104_132432_91010551324207534393499.syserr
   [junit4] >>> JVM J0 emitted unexpected output (verbatim) ----
   [junit4] OpenJDK 64-Bit Server VM warning: Option UseConcMarkSweepGC was deprecated in version 9.0 and will likely be removed in a future release.
   [junit4] <<< JVM J0: EOF ----

[...truncated 252 lines...]
   [junit4] JVM J1: stderr was not empty, see: C:\Users\jenkins\workspace\Lucene-Solr-master-Windows\lucene\build\classification\test\temp\junit4-J1-20190104_132444_8084177380729520209392.syserr
   [junit4] >>> JVM J1 emitted unexpected output (verbatim) ----
   [junit4] OpenJDK 64-Bit Server VM warning: Option UseConcMarkSweepGC was deprecated in version 9.0 and will likely be removed in a future release.
   [junit4] <<< JVM J1: EOF ----

[...truncated 3 lines...]
   [junit4] JVM J0: stderr was not empty, see: C:\Users\jenkins\workspace\Lucene-Solr-master-Windows\lucene\build\classification\test\temp\junit4-J0-20190104_132444_8088471414453745632653.syserr
   [junit4] >>> JVM J0 emitted unexpected output (verbatim) ----
   [junit4] OpenJDK 64-Bit Server VM warning: Option UseConcMarkSweepGC was deprecated in version 9.0 and will likely be removed in a future release.
   [junit4] <<< JVM J0: EOF ----

[...truncated 262 lines...]
   [junit4] JVM J0: stderr was not empty, see: C:\Users\jenkins\workspace\Lucene-Solr-master-Windows\lucene\build\codecs\test\temp\junit4-J0-20190104_132508_8932385066502695845536.syserr
   [junit4] >>> JVM J0 emitted unexpected output (verbatim) ----
   [junit4] OpenJDK 64-Bit Server VM warning: Option UseConcMarkSweepGC was deprecated in version 9.0 and will likely be removed in a future release.
   [junit4] <<< JVM J0: EOF ----

[...truncated 3 lines...]
   [junit4] JVM J1: stderr was not empty, see: C:\Users\jenkins\workspace\Lucene-Solr-master-Windows\lucene\build\codecs\test\temp\junit4-J1-20190104_132508_89310051610425733282153.syserr
   [junit4] >>> JVM J1 emitted unexpected output (verbatim) ----
   [junit4] OpenJDK 64-Bit Server VM warning: Option UseConcMarkSweepGC was deprecated in version 9.0 and will likely be removed in a future release.
   [junit4] <<< JVM J1: EOF ----

[...truncated 232 lines...]
   [junit4] JVM J1: stderr was not empty, see: C:\Users\jenkins\workspace\Lucene-Solr-master-Windows\lucene\build\demo\test\temp\junit4-J1-20190104_132703_27217478608108653243536.syserr
   [junit4] >>> JVM J1 emitted unexpected output (verbatim) ----
   [junit4] OpenJDK 64-Bit Server VM warning: Option UseConcMarkSweepGC was deprecated in version 9.0 and will likely be removed in a future release.
   [junit4] <<< JVM J1: EOF ----

[...truncated 3 lines...]
   [junit4] JVM J0: stderr was not empty, see: C:\Users\jenkins\workspace\Lucene-Solr-master-Windows\lucene\build\demo\test\temp\junit4-J0-20190104_132703_2726259912384648896709.syserr
   [junit4] >>> JVM J0 emitted unexpected output (verbatim) ----
   [junit4] OpenJDK 64-Bit Server VM warning: Option UseConcMarkSweepGC was deprecated in version 9.0 and will likely be removed in a future release.
   [junit4] <<< JVM J0: EOF ----

[...truncated 174 lines...]
   [junit4] JVM J0: stderr was not empty, see: C:\Users\jenkins\workspace\Lucene-Solr-master-Windows\lucene\build\expressions\test\temp\junit4-J0-20190104_132710_95816981884784597731341.syserr
   [junit4] >>> JVM J0 emitted unexpected output (verbatim) ----
   [junit4] OpenJDK 64-Bit Server VM warning: Option UseConcMarkSweepGC was deprecated in version 9.0 and will likely be removed in a future release.
   [junit4] <<< JVM J0: EOF ----

[...truncated 3 lines...]
   [junit4] JVM J1: stderr was not empty, see: C:\Users\jenkins\workspace\Lucene-Solr-master-Windows\lucene\build\expressions\test\temp\junit4-J1-20190104_132710_9584410601677910248791.syserr
   [junit4] >>> JVM J1 emitted unexpected output (verbatim) ----
   [junit4] OpenJDK 64-Bit Server VM warning: Option UseConcMarkSweepGC was deprecated in version 9.0 and will likely be removed in a future release.
   [junit4] <<< JVM J1: EOF ----

[...truncated 238 lines...]
   [junit4] JVM J0: stderr was not empty, see: C:\Users\jenkins\workspace\Lucene-Solr-master-Windows\lucene\build\facet\test\temp\junit4-J0-20190104_132719_0233574712860575876923.syserr
   [junit4] >>> JVM J0 emitted unexpected output (verbatim) ----
   [junit4] OpenJDK 64-Bit Server VM warning: Option UseConcMarkSweepGC was deprecated in version 9.0 and will likely be removed in a future release.
   [junit4] <<< JVM J0: EOF ----

   [junit4] JVM J1: stderr was not empty, see: C:\Users\jenkins\workspace\Lucene-Solr-master-Windows\lucene\build\facet\test\temp\junit4-J1-20190104_132719_02312485203290705337310.syserr
   [junit4] >>> JVM J1 emitted unexpected output (verbatim) ----
   [junit4] OpenJDK 64-Bit Server VM warning: Option UseConcMarkSweepGC was deprecated in version 9.0 and will likely be removed in a future release.
   [junit4] <<< JVM J1: EOF ----

[...truncated 186 lines...]
   [junit4] JVM J0: stderr was not empty, see: C:\Users\jenkins\workspace\Lucene-Solr-master-Windows\lucene\build\grouping\test\temp\junit4-J0-20190104_132801_1233778271544326473690.syserr
   [junit4] >>> JVM J0 emitted unexpected output (verbatim) ----
   [junit4] OpenJDK 64-Bit Server VM warning: Option UseConcMarkSweepGC was deprecated in version 9.0 and will likely be removed in a future release.
   [junit4] <<< JVM J0: EOF ----

   [junit4] JVM J1: stderr was not empty, see: C:\Users\jenkins\workspace\Lucene-Solr-master-Windows\lucene\build\grouping\test\temp\junit4-J1-20190104_132801_1238589856448301359668.syserr
   [junit4] >>> JVM J1 emitted unexpected output (verbatim) ----
   [junit4] OpenJDK 64-Bit Server VM warning: Option UseConcMarkSweepGC was deprecated in version 9.0 and will likely be removed in a future release.
   [junit4] <<< JVM J1: EOF ----

[...truncated 253 lines...]
   [junit4] JVM J0: stderr was not empty, see: C:\Users\jenkins\workspace\Lucene-Solr-master-Windows\lucene\build\highlighter\test\temp\junit4-J0-20190104_132815_27117806615164320767495.syserr
   [junit4] >>> JVM J0 emitted unexpected output (verbatim) ----
   [junit4] OpenJDK 64-Bit Server VM warning: Option UseConcMarkSweepGC was deprecated in version 9.0 and will likely be removed in a future release.
   [junit4] <<< JVM J0: EOF ----

[...truncated 6 lines...]
   [junit4] JVM J1: stderr was not empty, see: C:\Users\jenkins\workspace\Lucene-Solr-master-Windows\lucene\build\highlighter\test\temp\junit4-J1-20190104_132815_2713014113886023262797.syserr
   [junit4] >>> JVM J1 emitted unexpected output (verbatim) ----
   [junit4] OpenJDK 64-Bit Server VM warning: Option UseConcMarkSweepGC was deprecated in version 9.0 and will likely be removed in a future release.
   [junit4] <<< JVM J1: EOF ----

[...truncated 167 lines...]
   [junit4] JVM J0: stderr was not empty, see: C:\Users\jenkins\workspace\Lucene-Solr-master-Windows\lucene\build\join\test\temp\junit4-J0-20190104_132900_6255730489383532305854.syserr
   [junit4] >>> JVM J0 emitted unexpected output (verbatim) ----
   [junit4] OpenJDK 64-Bit Server VM warning: Option UseConcMarkSweepGC was deprecated in version 9.0 and will likely be removed in a future release.
   [junit4] <<< JVM J0: EOF ----

[...truncated 3 lines...]
   [junit4] JVM J1: stderr was not empty, see: C:\Users\jenkins\workspace\Lucene-Solr-master-Windows\lucene\build\join\test\temp\junit4-J1-20190104_132900_6254361959809604928029.syserr
   [junit4] >>> JVM J1 emitted unexpected output (verbatim) ----
   [junit4] OpenJDK 64-Bit Server VM warning: Option UseConcMarkSweepGC was deprecated in version 9.0 and will likely be removed in a future release.
   [junit4] <<< JVM J1: EOF ----

[...truncated 156 lines...]
   [junit4] JVM J0: stderr was not empty, see: C:\Users\jenkins\workspace\Lucene-Solr-master-Windows\lucene\build\memory\test\temp\junit4-J0-20190104_132919_06010734735310338293125.syserr
   [junit4] >>> JVM J0 emitted unexpected output (verbatim) ----
   [junit4] OpenJDK 64-Bit Server VM warning: Option UseConcMarkSweepGC was deprecated in version 9.0 and will likely be removed in a future release.
   [junit4] <<< JVM J0: EOF ----

[...truncated 3 lines...]
   [junit4] JVM J1: stderr was not empty, see: C:\Users\jenkins\workspace\Lucene-Solr-master-Windows\lucene\build\memory\test\temp\junit4-J1-20190104_132919_06013900004623212709764.syserr
   [junit4] >>> JVM J1 emitted unexpected output (verbatim) ----
   [junit4] OpenJDK 64-Bit Server VM warning: Option UseConcMarkSweepGC was deprecated in version 9.0 and will likely be removed in a future release.
   [junit4] <<< JVM J1: EOF ----

[...truncated 199 lines...]
   [junit4] JVM J1: stderr was not empty, see: C:\Users\jenkins\workspace\Lucene-Solr-master-Windows\lucene\build\misc\test\temp\junit4-J1-20190104_132927_94613066249949072971082.syserr
   [junit4] >>> JVM J1 emitted unexpected output (verbatim) ----
   [junit4] OpenJDK 64-Bit Server VM warning: Option UseConcMarkSweepGC was deprecated in version 9.0 and will likely be removed in a future release.
   [junit4] <<< JVM J1: EOF ----

[...truncated 3 lines...]
   [junit4] JVM J0: stderr was not empty, see: C:\Users\jenkins\workspace\Lucene-Solr-master-Windows\lucene\build\misc\test\temp\junit4-J0-20190104_132927_94613608662240014708621.syserr
   [junit4] >>> JVM J0 emitted unexpected output (verbatim) ----
   [junit4] OpenJDK 64-Bit Server VM warning: Option UseConcMarkSweepGC was deprecated in version 9.0 and will likely be removed in a future release.
   [junit4] <<< JVM J0: EOF ----

[...truncated 307 lines...]
   [junit4] JVM J1: stderr was not empty, see: C:\Users\jenkins\workspace\Lucene-Solr-master-Windows\lucene\build\queries\test\temp\junit4-J1-20190104_133004_11717489878335459887945.syserr
   [junit4] >>> JVM J1 emitted unexpected output (verbatim) ----
   [junit4] OpenJDK 64-Bit Server VM warning: Option UseConcMarkSweepGC was deprecated in version 9.0 and will likely be removed in a future release.
   [junit4] <<< JVM J1: EOF ----

[...truncated 3 lines...]
   [junit4] JVM J0: stderr was not empty, see: C:\Users\jenkins\workspace\Lucene-Solr-master-Windows\lucene\build\queries\test\temp\junit4-J0-20190104_133004_1172303973269515544703.syserr
   [junit4] >>> JVM J0 emitted unexpected output (verbatim) ----
   [junit4] OpenJDK 64-Bit Server VM warning: Option UseConcMarkSweepGC was deprecated in version 9.0 and will likely be removed in a future release.
   [junit4] <<< JVM J0: EOF ----

[...truncated 232 lines...]
   [junit4] JVM J1: stderr was not empty, see: C:\Users\jenkins\workspace\Lucene-Solr-master-Windows\lucene\build\queryparser\test\temp\junit4-J1-20190104_133015_6969593503864878784168.syserr
   [junit4] >>> JVM J1 emitted unexpected output (verbatim) ----
   [junit4] OpenJDK 64-Bit Server VM warning: Option UseConcMarkSweepGC was deprecated in version 9.0 and will likely be removed in a future release.
   [junit4] <<< JVM J1: EOF ----

[...truncated 3 lines...]
   [junit4] JVM J0: stderr was not empty, see: C:\Users\jenkins\workspace\Lucene-Solr-master-Windows\lucene\build\queryparser\test\temp\junit4-J0-20190104_133015_6962100844421866144228.syserr
   [junit4] >>> JVM J0 emitted unexpected output (verbatim) ----
   [junit4] OpenJDK 64-Bit Server VM warning: Option UseConcMarkSweepGC was deprecated in version 9.0 and will likely be removed in a future release.
   [junit4] <<< JVM J0: EOF ----

[...truncated 217 lines...]
   [junit4] JVM J1: stderr was not empty, see: C:\Users\jenkins\workspace\Lucene-Solr-master-Windows\lucene\build\replicator\test\temp\junit4-J1-20190104_133029_0152012720391567621208.syserr
   [junit4] >>> JVM J1 emitted unexpected output (verbatim) ----
   [junit4] OpenJDK 64-Bit Server VM warning: Option UseConcMarkSweepGC was deprecated in version 9.0 and will likely be removed in a future release.
   [junit4] <<< JVM J1: EOF ----

[...truncated 3 lines...]
   [junit4] JVM J0: stderr was not empty, see: C:\Users\jenkins\workspace\Lucene-Solr-master-Windows\lucene\build\replicator\test\temp\junit4-J0-20190104_133029_01516180401472454309021.syserr
   [junit4] >>> JVM J0 emitted unexpected output (verbatim) ----
   [junit4] OpenJDK 64-Bit Server VM warning: Option UseConcMarkSweepGC was deprecated in version 9.0 and will likely be removed in a future release.
   [junit4] <<< JVM J0: EOF ----

[...truncated 216 lines...]
   [junit4] JVM J0: stderr was not empty, see: C:\Users\jenkins\workspace\Lucene-Solr-master-Windows\lucene\build\sandbox\test\temp\junit4-J0-20190104_133045_61516470680587175971806.syserr
   [junit4] >>> JVM J0 emitted unexpected output (verbatim) ----
   [junit4] OpenJDK 64-Bit Server VM warning: Option UseConcMarkSweepGC was deprecated in version 9.0 and will likely be removed in a future release.
   [junit4] <<< JVM J0: EOF ----

[...truncated 10 lines...]
   [junit4] JVM J1: stderr was not empty, see: C:\Users\jenkins\workspace\Lucene-Solr-master-Windows\lucene\build\sandbox\test\temp\junit4-J1-20190104_133045_61515930067383279611801.syserr
   [junit4] >>> JVM J1 emitted unexpected output (verbatim) ----
   [junit4] OpenJDK 64-Bit Server VM warning: Option UseConcMarkSweepGC was deprecated in version 9.0 and will likely be removed in a future release.
   [junit4] <<< JVM J1: EOF ----

[...truncated 300 lines...]
   [junit4] JVM J0: stderr was not empty, see: C:\Users\jenkins\workspace\Lucene-Solr-master-Windows\lucene\build\spatial-extras\test\temp\junit4-J0-20190104_133159_6649097645558225355170.syserr
   [junit4] >>> JVM J0 emitted unexpected output (verbatim) ----
   [junit4] OpenJDK 64-Bit Server VM warning: Option UseConcMarkSweepGC was deprecated in version 9.0 and will likely be removed in a future release.
   [junit4] <<< JVM J0: EOF ----

[...truncated 3 lines...]
   [junit4] JVM J1: stderr was not empty, see: C:\Users\jenkins\workspace\Lucene-Solr-master-Windows\lucene\build\spatial-extras\test\temp\junit4-J1-20190104_133159_6642767259356446293492.syserr
   [junit4] >>> JVM J1 emitted unexpected output (verbatim) ----
   [junit4] OpenJDK 64-Bit Server VM warning: Option UseConcMarkSweepGC was deprecated in version 9.0 and will likely be removed in a future release.
   [junit4] <<< JVM J1: EOF ----

[...truncated 195 lines...]
   [junit4] JVM J0: stderr was not empty, see: C:\Users\jenkins\workspace\Lucene-Solr-master-Windows\lucene\build\spatial3d\test\temp\junit4-J0-20190104_133228_5821959005627282816638.syserr
   [junit4] >>> JVM J0 emitted unexpected output (verbatim) ----
   [junit4] OpenJDK 64-Bit Server VM warning: Option UseConcMarkSweepGC was deprecated in version 9.0 and will likely be removed in a future release.
   [junit4] <<< JVM J0: EOF ----

[...truncated 3 lines...]
   [junit4] JVM J1: stderr was not empty, see: C:\Users\jenkins\workspace\Lucene-Solr-master-Windows\lucene\build\spatial3d\test\temp\junit4-J1-20190104_133228_5822321201090872514130.syserr
   [junit4] >>> JVM J1 emitted unexpected output (verbatim) ----
   [junit4] OpenJDK 64-Bit Server VM warning: Option UseConcMarkSweepGC was deprecated in version 9.0 and will likely be removed in a future release.
   [junit4] <<< JVM J1: EOF ----

[...truncated 152 lines...]
   [junit4] JVM J0: stderr was not empty, see: C:\Users\jenkins\workspace\Lucene-Solr-master-Windows\lucene\build\spatial\test\temp\junit4-J0-20190104_133257_66316178666460551144930.syserr
   [junit4] >>> JVM J0 emitted unexpected output (verbatim) ----
   [junit4] OpenJDK 64-Bit Server VM warning: Option UseConcMarkSweepGC was deprecated in version 9.0 and will likely be removed in a future release.
   [junit4] <<< JVM J0: EOF ----

[...truncated 259 lines...]
   [junit4] JVM J0: stderr was not empty, see: C:\Users\jenkins\workspace\Lucene-Solr-master-Windows\lucene\build\suggest\test\temp\junit4-J0-20190104_133303_21014933626697778065453.syserr
   [junit4] >>> JVM J0 emitted unexpected output (verbatim) ----
   [junit4] OpenJDK 64-Bit Server VM warning: Option UseConcMarkSweepGC was deprecated in version 9.0 and will likely be removed in a future release.
   [junit4] <<< JVM J0: EOF ----

   [junit4] JVM J1: stderr was not empty, see: C:\Users\jenkins\workspace\Lucene-Solr-master-Windows\lucene\build\suggest\test\temp\junit4-J1-20190104_133303_2101859095698426454153.syserr
   [junit4] >>> JVM J1 emitted unexpected output (verbatim) ----
   [junit4] OpenJDK 64-Bit Server VM warning: Option UseConcMarkSweepGC was deprecated in version 9.0 and will likely be removed in a future release.
   [junit4] <<< JVM J1: EOF ----

[...truncated 3659 lines...]
   [junit4] JVM J1: stdout was not empty, see: C:\Users\jenkins\workspace\Lucene-Solr-master-Windows\solr\build\solr-core\test\temp\junit4-J1-20190104_133502_01116642728668270228903.sysout
   [junit4] >>> JVM J1 emitted unexpected output (verbatim) ----
   [junit4] #
   [junit4] # A fatal error has been detected by the Java Runtime Environment:
   [junit4] #
   [junit4] #  EXCEPTION_ACCESS_VIOLATION (0xc0000005) at pc=0x0000000055b5bbff, pid=10236, tid=6272
   [junit4] #
   [junit4] # JRE version: OpenJDK Runtime Environment (10.0.1+10) (build 10.0.1+10)
   [junit4] # Java VM: OpenJDK 64-Bit Server VM (10.0.1+10, mixed mode, tiered, compressed oops, concurrent mark sweep gc, windows-amd64)
   [junit4] # Problematic frame:
   [junit4] # V  [jvm.dll+0x46bbff]
   [junit4] #
   [junit4] # No core dump will be written. Minidumps are not enabled by default on client versions of Windows
   [junit4] #
   [junit4] # An error report file with more information is saved as:
   [junit4] # C:\Users\jenkins\workspace\Lucene-Solr-master-Windows\solr\build\solr-core\test\J1\hs_err_pid10236.log
   [junit4] #
   [junit4] # Compiler replay data is saved as:
   [junit4] # C:\Users\jenkins\workspace\Lucene-Solr-master-Windows\solr\build\solr-core\test\J1\replay_pid10236.log
   [junit4] #
   [junit4] # If you would like to submit a bug report, please visit:
   [junit4] #   http://bugreport.java.com/bugreport/crash.jsp
   [junit4] #
   [junit4] <<< JVM J1: EOF ----

   [junit4] JVM J1: stderr was not empty, see: C:\Users\jenkins\workspace\Lucene-Solr-master-Windows\solr\build\solr-core\test\temp\junit4-J1-20190104_133502_01111358890489645829218.syserr
   [junit4] >>> JVM J1 emitted unexpected output (verbatim) ----
   [junit4] OpenJDK 64-Bit Server VM warning: Option UseConcMarkSweepGC was deprecated in version 9.0 and will likely be removed in a future release.
   [junit4] <<< JVM J1: EOF ----

[...truncated 1143 lines...]
   [junit4] JVM J0: stderr was not empty, see: C:\Users\jenkins\workspace\Lucene-Solr-master-Windows\solr\build\solr-core\test\temp\junit4-J0-20190104_133502_01412722389280756850505.syserr
   [junit4] >>> JVM J0 emitted unexpected output (verbatim) ----
   [junit4] OpenJDK 64-Bit Server VM warning: Option UseConcMarkSweepGC was deprecated in version 9.0 and will likely be removed in a future release.
   [junit4] <<< JVM J0: EOF ----

[...truncated 2 lines...]
   [junit4] ERROR: JVM J1 ended with an exception, command line: C:\Users\jenkins\tools\java\64bit\jdk-10.0.1\bin\java.exe -XX:+UseCompressedOops -XX:+UseConcMarkSweepGC -XX:+HeapDumpOnOutOfMemoryError -XX:HeapDumpPath=C:\Users\jenkins\workspace\Lucene-Solr-master-Windows\heapdumps -ea -esa --illegal-access=deny -Dtests.prefix=tests -Dtests.seed=16B50AD975CBD021 -Xmx512M -Dtests.iters= -Dtests.verbose=false -Dtests.infostream=false -Dtests.codec=random -Dtests.postingsformat=random -Dtests.docvaluesformat=random -Dtests.locale=random -Dtests.timezone=random -Dtests.directory=random -Dtests.linedocsfile=europarl.lines.txt.gz -Dtests.luceneMatchVersion=8.0.0 -Dtests.cleanthreads=perClass -Djava.util.logging.config.file=C:\Users\jenkins\workspace\Lucene-Solr-master-Windows\lucene\tools\junit4\logging.properties -Dtests.nightly=false -Dtests.weekly=false -Dtests.monster=false -Dtests.slow=true -Dtests.asserts=true -Dtests.multiplier=1 -DtempDir=./temp -Djava.io.tmpdir=./temp -Dcommon.dir=C:\Users\jenkins\workspace\Lucene-Solr-master-Windows\lucene -Dclover.db.dir=C:\Users\jenkins\workspace\Lucene-Solr-master-Windows\lucene\build\clover\db -Djava.security.policy=C:\Users\jenkins\workspace\Lucene-Solr-master-Windows\lucene\tools\junit4\solr-tests.policy -Dtests.LUCENE_VERSION=8.0.0 -Djetty.testMode=1 -Djetty.insecurerandom=1 -Dsolr.directoryFactory=org.apache.solr.core.MockDirectoryFactory -Djava.awt.headless=true -Djdk.map.althashing.threshold=0 -Dtests.src.home=C:\Users\jenkins\workspace\Lucene-Solr-master-Windows -Djava.security.egd=file:/dev/./urandom -Djunit4.childvm.cwd=C:\Users\jenkins\workspace\Lucene-Solr-master-Windows\solr\build\solr-core\test\J1 -Djunit4.tempDir=C:\Users\jenkins\workspace\Lucene-Solr-master-Windows\solr\build\solr-core\test\temp -Djunit4.childvm.id=1 -Djunit4.childvm.count=2 -Dfile.encoding=UTF-8 -Dtests.disableHdfs=true -Djava.security.manager=org.apache.lucene.util.TestSecurityManager -Dtests.filterstacks=true -Dtests.leaveTemporary=false -Dtests.badapples=false -classpath C:\Users\jenkins\workspace\Lucene-Solr-master-Windows\solr\build\solr-core\classes\test;C:\Users\jenkins\workspace\Lucene-Solr-master-Windows\solr\build\solr-test-framework\classes\java;C:\Users\jenkins\workspace\Lucene-Solr-master-Windows\solr\test-framework\lib\hamcrest-core-1.3.jar;C:\Users\jenkins\workspace\Lucene-Solr-master-Windows\solr\test-framework\lib\junit4-ant-2.7.2.jar;C:\Users\jenkins\workspace\Lucene-Solr-master-Windows\solr\core\src\test-files;C:\Users\jenkins\workspace\Lucene-Solr-master-Windows\lucene\build\test-framework\classes\java;C:\Users\jenkins\workspace\Lucene-Solr-master-Windows\lucene\build\codecs\classes\java;C:\Users\jenkins\workspace\Lucene-Solr-master-Windows\solr\build\solr-solrj\classes\java;C:\Users\jenkins\workspace\Lucene-Solr-master-Windows\solr\build\solr-core\classes\java;C:\Users\jenkins\workspace\Lucene-Solr-master-Windows\lucene\build\analysis\common\lucene-analyzers-common-8.0.0-SNAPSHOT.jar;C:\Users\jenkins\workspace\Lucene-Solr-master-Windows\lucene\build\analysis\kuromoji\lucene-analyzers-kuromoji-8.0.0-SNAPSHOT.jar;C:\Users\jenkins\workspace\Lucene-Solr-master-Windows\lucene\build\analysis\nori\lucene-analyzers-nori-8.0.0-SNAPSHOT.jar;C:\Users\jenkins\workspace\Lucene-Solr-master-Windows\lucene\build\analysis\phonetic\lucene-analyzers-phonetic-8.0.0-SNAPSHOT.jar;C:\Users\jenkins\workspace\Lucene-Solr-master-Windows\lucene\build\codecs\lucene-codecs-8.0.0-SNAPSHOT.jar;C:\Users\jenkins\workspace\Lucene-Solr-master-Windows\lucene\build\backward-codecs\lucene-backward-codecs-8.0.0-SNAPSHOT.jar;C:\Users\jenkins\workspace\Lucene-Solr-master-Windows\lucene\build\highlighter\lucene-highlighter-8.0.0-SNAPSHOT.jar;C:\Users\jenkins\workspace\Lucene-Solr-master-Windows\lucene\build\memory\lucene-memory-8.0.0-SNAPSHOT.jar;C:\Users\jenkins\workspace\Lucene-Solr-master-Windows\lucene\build\misc\lucene-misc-8.0.0-SNAPSHOT.jar;C:\Users\jenkins\workspace\Lucene-Solr-master-Windows\lucene\build\spatial-extras\lucene-spatial-extras-8.0.0-SNAPSHOT.jar;C:\Users\jenkins\workspace\Lucene-Solr-master-Windows\lucene\build\spatial3d\lucene-spatial3d-8.0.0-SNAPSHOT.jar;C:\Users\jenkins\workspace\Lucene-Solr-master-Windows\lucene\build\expressions\lucene-expressions-8.0.0-SNAPSHOT.jar;C:\Users\jenkins\workspace\Lucene-Solr-master-Windows\lucene\build\suggest\lucene-suggest-8.0.0-SNAPSHOT.jar;C:\Users\jenkins\workspace\Lucene-Solr-master-Windows\lucene\build\grouping\lucene-grouping-8.0.0-SNAPSHOT.jar;C:\Users\jenkins\workspace\Lucene-Solr-master-Windows\lucene\build\queries\lucene-queries-8.0.0-SNAPSHOT.jar;C:\Users\jenkins\workspace\Lucene-Solr-master-Windows\lucene\build\queryparser\lucene-queryparser-8.0.0-SNAPSHOT.jar;C:\Users\jenkins\workspace\Lucene-Solr-master-Windows\lucene\build\join\lucene-join-8.0.0-SNAPSHOT.jar;C:\Users\jenkins\workspace\Lucene-Solr-master-Windows\lucene\build\sandbox\lucene-sandbox-8.0.0-SNAPSHOT.jar;C:\Users\jenkins\workspace\Lucene-Solr-master-Windows\lucene\build\classification\lucene-classification-8.0.0-SNAPSHOT.jar;C:\Users\jenkins\workspace\Lucene-Solr-master-Windows\solr\core\lib\antlr4-runtime-4.5.1-1.jar;C:\Users\jenkins\workspace\Lucene-Solr-master-Windows\solr\core\lib\asm-5.1.jar;C:\Users\jenkins\workspace\Lucene-Solr-master-Windows\solr\core\lib\asm-commons-5.1.jar;C:\Users\jenkins\workspace\Lucene-Solr-master-Windows\solr\core\lib\avatica-core-1.10.0.jar;C:\Users\jenkins\workspace\Lucene-Solr-master-Windows\solr\core\lib\caffeine-2.4.0.jar;C:\Users\jenkins\workspace\Lucene-Solr-master-Windows\solr\core\lib\calcite-core-1.13.0.jar;C:\Users\jenkins\workspace\Lucene-Solr-master-Windows\solr\core\lib\calcite-linq4j-1.13.0.jar;C:\Users\jenkins\workspace\Lucene-Solr-master-Windows\solr\core\lib\commons-cli-1.2.jar;C:\Users\jenkins\workspace\Lucene-Solr-master-Windows\solr\core\lib\commons-codec-1.11.jar;C:\Users\jenkins\workspace\Lucene-Solr-master-Windows\solr\core\lib\commons-collections-3.2.2.jar;C:\Users\jenkins\workspace\Lucene-Solr-master-Windows\solr\core\lib\commons-compiler-2.7.6.jar;C:\Users\jenkins\workspace\Lucene-Solr-master-Windows\solr\core\lib\commons-configuration-1.6.jar;C:\Users\jenkins\workspace\Lucene-Solr-master-Windows\solr\core\lib\commons-exec-1.3.jar;C:\Users\jenkins\workspace\Lucene-Solr-master-Windows\solr\core\lib\commons-fileupload-1.3.3.jar;C:\Users\jenkins\workspace\Lucene-Solr-master-Windows\solr\core\lib\commons-io-2.5.jar;C:\Users\jenkins\workspace\Lucene-Solr-master-Windows\solr\core\lib\commons-lang-2.6.jar;C:\Users\jenkins\workspace\Lucene-Solr-master-Windows\solr\core\lib\commons-lang3-3.6.jar;C:\Users\jenkins\workspace\Lucene-Solr-master-Windows\solr\core\lib\commons-math3-3.6.1.jar;C:\Users\jenkins\workspace\Lucene-Solr-master-Windows\solr\core\lib\curator-client-2.8.0.jar;C:\Users\jenkins\workspace\Lucene-Solr-master-Windows\solr\core\lib\curator-framework-2.8.0.jar;C:\Users\jenkins\workspace\Lucene-Solr-master-Windows\solr\core\lib\curator-recipes-2.8.0.jar;C:\Users\jenkins\workspace\Lucene-Solr-master-Windows\solr\core\lib\disruptor-3.4.0.jar;C:\Users\jenkins\workspace\Lucene-Solr-master-Windows\solr\core\lib\dom4j-1.6.1.jar;C:\Users\jenkins\workspace\Lucene-Solr-master-Windows\solr\core\lib\eigenbase-properties-1.1.5.jar;C:\Users\jenkins\workspace\Lucene-Solr-master-Windows\solr\core\lib\guava-14.0.1.jar;C:\Users\jenkins\workspace\Lucene-Solr-master-Windows\solr\core\lib\hadoop-annotations-2.7.4.jar;C:\Users\jenkins\workspace\Lucene-Solr-master-Windows\solr\core\lib\hadoop-auth-2.7.4.jar;C:\Users\jenkins\workspace\Lucene-Solr-master-Windows\solr\core\lib\hadoop-common-2.7.4.jar;C:\Users\jenkins\workspace\Lucene-Solr-master-Windows\solr\core\lib\hadoop-hdfs-2.7.4.jar;C:\Users\jenkins\workspace\Lucene-Solr-master-Windows\solr\core\lib\hppc-0.8.1.jar;C:\Users\jenkins\workspace\Lucene-Solr-master-Windows\solr\core\lib\htrace-core-3.2.0-incubating.jar;C:\Users\jenkins\workspace\Lucene-Solr-master-Windows\solr\core\lib\jackson-annotations-2.9.6.jar;C:\Users\jenkins\workspace\Lucene-Solr-master-Windows\solr\core\lib\jackson-core-2.9.6.jar;C:\Users\jenkins\workspace\Lucene-Solr-master-Windows\solr\core\lib\jackson-core-asl-1.9.13.jar;C:\Users\jenkins\workspace\Lucene-Solr-master-Windows\solr\core\lib\jackson-databind-2.9.6.jar;C:\Users\jenkins\workspace\Lucene-Solr-master-Windows\solr\core\lib\jackson-dataformat-smile-2.9.6.jar;C:\Users\jenkins\workspace\Lucene-Solr-master-Windows\solr\core\lib\jackson-mapper-asl-1.9.13.jar;C:\Users\jenkins\workspace\Lucene-Solr-master-Windows\solr\core\lib\janino-2.7.6.jar;C:\Users\jenkins\workspace\Lucene-Solr-master-Windows\solr\core\lib\jcl-over-slf4j-1.7.24.jar;C:\Users\jenkins\workspace\Lucene-Solr-master-Windows\solr\core\lib\log4j-1.2-api-2.11.0.jar;C:\Users\jenkins\workspace\Lucene-Solr-master-Windows\solr\core\lib\log4j-api-2.11.0.jar;C:\Users\jenkins\workspace\Lucene-Solr-master-Windows\solr\core\lib\log4j-core-2.11.0.jar;C:\Users\jenkins\workspace\Lucene-Solr-master-Windows\solr\core\lib\log4j-slf4j-impl-2.11.0.jar;C:\Users\jenkins\workspace\Lucene-Solr-master-Windows\solr\core\lib\org.restlet-2.3.0.jar;C:\Users\jenkins\workspace\Lucene-Solr-master-Windows\solr\core\lib\org.restlet.ext.servlet-2.3.0.jar;C:\Users\jenkins\workspace\Lucene-Solr-master-Windows\solr\core\lib\protobuf-java-3.1.0.jar;C:\Users\jenkins\workspace\Lucene-Solr-master-Windows\solr\core\lib\rrd4j-3.2.jar;C:\Users\jenkins\workspace\Lucene-Solr-master-Windows\solr\core\lib\spatial4j-0.7.jar;C:\Users\jenkins\workspace\Lucene-Solr-master-Windows\solr\core\lib\t-digest-3.1.jar;C:\Users\jenkins\workspace\Lucene-Solr-master-Windows\solr\solrj\lib\commons-io-2.5.jar;C:\Users\jenkins\workspace\Lucene-Solr-master-Windows\solr\solrj\lib\commons-math3-3.6.1.jar;C:\Users\jenkins\workspace\Lucene-Solr-master-Windows\solr\solrj\lib\http2-client-9.4.14.v20181114.jar;C:\Users\jenkins\workspace\Lucene-Solr-master-Windows\solr\solrj\lib\http2-common-9.4.14.v20181114.jar;C:\Users\jenkins\workspace\Lucene-Solr-master-Windows\solr\solrj\lib\http2-hpack-9.4.14.v20181114.jar;C:\Users\jenkins\workspace\Lucene-Solr-master-Windows\solr\solrj\lib\http2-http-client-transport-9.4.14.v20181114.jar;C:\Users\jenkins\workspace\Lucene-Solr-master-Windows\solr\solrj\lib\httpclient-4.5.6.jar;C:\Users\jenkins\workspace\Lucene-Solr-master-Windows\solr\solrj\lib\httpcore-4.4.10.jar;C:\Users\jenkins\workspace\Lucene-Solr-master-Windows\solr\solrj\lib\httpmime-4.5.6.jar;C:\Users\jenkins\workspace\Lucene-Solr-master-Windows\solr\solrj\lib\jcl-over-slf4j-1.7.24.jar;C:\Users\jenkins\workspace\Lucene-Solr-master-Windows\solr\solrj\lib\jetty-alpn-client-9.4.14.v20181114.jar;C:\Users\jenkins\workspace\Lucene-Solr-master-Windows\solr\solrj\lib\jetty-alpn-java-client-9.4.14.v20181114.jar;C:\Users\jenkins\workspace\Lucene-Solr-master-Windows\solr\solrj\lib\jetty-client-9.4.14.v20181114.jar;C:\Users\jenkins\workspace\Lucene-Solr-master-Windows\solr\solrj\lib\jetty-http-9.4.14.v20181114.jar;C:\Users\jenkins\workspace\Lucene-Solr-master-Windows\solr\solrj\lib\jetty-io-9.4.14.v20181114.jar;C:\Users\jenkins\workspace\Lucene-Solr-master-Windows\solr\solrj\lib\jetty-util-9.4.14.v20181114.jar;C:\Users\jenkins\workspace\Lucene-Solr-master-Windows\solr\solrj\lib\noggit-0.8.jar;C:\Users\jenkins\workspace\Lucene-Solr-master-Windows\solr\solrj\lib\slf4j-api-1.7.24.jar;C:\Users\jenkins\workspace\Lucene-Solr-master-Windows\solr\solrj\lib\stax2-api-3.1.4.jar;C:\Users\jenkins\workspace\Lucene-Solr-master-Windows\solr\solrj\lib\woodstox-core-asl-4.4.1.jar;C:\Users\jenkins\workspace\Lucene-Solr-master-Windows\solr\solrj\lib\zookeeper-3.4.13.jar;C:\Users\jenkins\workspace\Lucene-Solr-master-Windows\solr\server\lib\gmetric4j-1.0.7.jar;C:\Users\jenkins\workspace\Lucene-Solr-master-Windows\solr\server\lib\http2-common-9.4.14.v20181114.jar;C:\Users\jenkins\workspace\Lucene-Solr-master-Windows\solr\server\lib\http2-hpack-9.4.14.v20181114.jar;C:\Users\jenkins\workspace\Lucene-Solr-master-Windows\solr\server\lib\http2-server-9.4.14.v20181114.jar;C:\Users\jenkins\workspace\Lucene-Solr-master-Windows\solr\server\lib\javax.servlet-api-3.1.0.jar;C:\Users\jenkins\workspace\Lucene-Solr-master-Windows\solr\server\lib\jetty-alpn-java-server-9.4.14.v20181114.jar;C:\Users\jenkins\workspace\Lucene-Solr-master-Windows\solr\server\lib\jetty-alpn-server-9.4.14.v20181114.jar;C:\Users\jenkins\workspace\Lucene-Solr-master-Windows\solr\server\lib\jetty-continuation-9.4.14.v20181114.jar;C:\Users\jenkins\workspace\Lucene-Solr-master-Windows\solr\server\lib\jetty-deploy-9.4.14.v20181114.jar;C:\Users\jenkins\workspace\Lucene-Solr-master-Windows\solr\server\lib\jetty-http-9.4.14.v20181114.jar;C:\Users\jenkins\workspace\Lucene-Solr-master-Windows\solr\server\lib\jetty-io-9.4.14.v20181114.jar;C:\Users\jenkins\workspace\Lucene-Solr-master-Windows\solr\server\lib\jetty-jmx-9.4.14.v20181114.jar;C:\Users\jenkins\workspace\Lucene-Solr-master-Windows\solr\server\lib\jetty-rewrite-9.4.14.v20181114.jar;C:\Users\jenkins\workspace\Lucene-Solr-master-Windows\solr\server\lib\jetty-security-9.4.14.v20181114.jar;C:\Users\jenkins\workspace\Lucene-Solr-master-Windows\solr\server\lib\jetty-server-9.4.14.v20181114.jar;C:\Users\jenkins\workspace\Lucene-Solr-master-Windows\solr\server\lib\jetty-servlet-9.4.14.v20181114.jar;C:\Users\jenkins\workspace\Lucene-Solr-master-Windows\solr\server\lib\jetty-servlets-9.4.14.v20181114.jar;C:\Users\jenkins\workspace\Lucene-Solr-master-Windows\solr\server\lib\jetty-util-9.4.14.v20181114.jar;C:\Users\jenkins\workspace\Lucene-Solr-master-Windows\solr\server\lib\jetty-webapp-9.4.14.v20181114.jar;C:\Users\jenkins\workspace\Lucene-Solr-master-Windows\solr\server\lib\jetty-xml-9.4.14.v20181114.jar;C:\Users\jenkins\workspace\Lucene-Solr-master-Windows\solr\server\lib\metrics-core-3.2.6.jar;C:\Users\jenkins\workspace\Lucene-Solr-master-Windows\solr\server\lib\metrics-ganglia-3.2.6.jar;C:\Users\jenkins\workspace\Lucene-Solr-master-Windows\solr\server\lib\metrics-graphite-3.2.6.jar;C:\Users\jenkins\workspace\Lucene-Solr-master-Windows\solr\server\lib\metrics-jetty9-3.2.6.jar;C:\Users\jenkins\workspace\Lucene-Solr-master-Windows\solr\server\lib\metrics-jvm-3.2.6.jar;C:\Users\jenkins\workspace\Lucene-Solr-master-Windows\solr\example\example-DIH\solr\db\lib\derby-10.9.1.0.jar;C:\Users\jenkins\workspace\Lucene-Solr-master-Windows\solr\example\example-DIH\solr\db\lib\hsqldb-2.4.0.jar;C:\Users\jenkins\workspace\Lucene-Solr-master-Windows\lucene\build\core\classes\java;C:\Users\jenkins\workspace\Lucene-Solr-master-Windows\lucene\test-framework\lib\hamcrest-core-1.3.jar;C:\Users\jenkins\workspace\Lucene-Solr-master-Windows\lucene\test-framework\lib\junit-4.12.jar;C:\Users\jenkins\workspace\Lucene-Solr-master-Windows\lucene\test-framework\lib\randomizedtesting-runner-2.7.2.jar;C:\Users\jenkins\workspace\Lucene-Solr-master-Windows\solr\core\test-lib\antlr-2.7.7.jar;C:\Users\jenkins\workspace\Lucene-Solr-master-Windows\solr\core\test-lib\antlr4-runtime-4.5.1-1.jar;C:\Users\jenkins\workspace\Lucene-Solr-master-Windows\solr\core\test-lib\apacheds-core-2.0.0-M15.jar;C:\Users\jenkins\workspace\Lucene-Solr-master-Windows\solr\core\test-lib\apacheds-core-api-2.0.0-M15.jar;C:\Users\jenkins\workspace\Lucene-Solr-master-Windows\solr\core\test-lib\apacheds-core-avl-2.0.0-M15.jar;C:\Users\jenkins\workspace\Lucene-Solr-master-Windows\solr\core\test-lib\apacheds-core-shared-2.0.0-M15.jar;C:\Users\jenkins\workspace\Lucene-Solr-master-Windows\solr\core\test-lib\apacheds-i18n-2.0.0-M15.jar;C:\Users\jenkins\workspace\Lucene-Solr-master-Windows\solr\core\test-lib\apacheds-interceptor-kerberos-2.0.0-M15.jar;C:\Users\jenkins\workspace\Lucene-Solr-master-Windows\solr\core\test-lib\apacheds-interceptors-admin-2.0.0-M15.jar;C:\Users\jenkins\workspace\Lucene-Solr-master-Windows\solr\core\test-lib\apacheds-interceptors-authn-2.0.0-M15.jar;C:\Users\jenkins\workspace\Lucene-Solr-master-Windows\solr\core\test-lib\apacheds-interceptors-authz-2.0.0-M15.jar;C:\Users\jenkins\workspace\Lucene-Solr-master-Windows\solr\core\test-lib\apacheds-interceptors-changelog-2.0.0-M15.jar;C:\Users\jenkins\workspace\Lucene-Solr-master-Windows\solr\core\test-lib\apacheds-interceptors-collective-2.0.0-M15.jar;C:\Users\jenkins\workspace\Lucene-Solr-master-Windows\solr\core\test-lib\apacheds-interceptors-event-2.0.0-M15.jar;C:\Users\jenkins\workspace\Lucene-Solr-master-Windows\solr\core\test-lib\apacheds-interceptors-exception-2.0.0-M15.jar;C:\Users\jenkins\workspace\Lucene-Solr-master-Windows\solr\core\test-lib\apacheds-interceptors-journal-2.0.0-M15.jar;C:\Users\jenkins\workspace\Lucene-Solr-master-Windows\solr\core\test-lib\apacheds-interceptors-normalization-2.0.0-M15.jar;C:\Users\jenkins\workspace\Lucene-Solr-master-Windows\solr\core\test-lib\apacheds-interceptors-operational-2.0.0-M15.jar;C:\Users\jenkins\workspace\Lucene-Solr-master-Windows\solr\core\test-lib\apacheds-interceptors-referral-2.0.0-M15.jar;C:\Users\jenkins\workspace\Lucene-Solr-master-Windows\solr\core\test-lib\apacheds-interceptors-schema-2.0.0-M15.jar;C:\Users\jenkins\workspace\Lucene-Solr-master-Windows\solr\core\test-lib\apacheds-interceptors-subtree-2.0.0-M15.jar;C:\Users\jenkins\workspace\Lucene-Solr-master-Windows\solr\core\test-lib\apacheds-interceptors-trigger-2.0.0-M15.jar;C:\Users\jenkins\workspace\Lucene-Solr-master-Windows\solr\core\test-lib\apacheds-jdbm-partition-2.0.0-M15.jar;C:\Users\jenkins\workspace\Lucene-Solr-master-Windows\solr\core\test-lib\apacheds-jdbm1-2.0.0-M2.jar;C:\Users\jenkins\workspace\Lucene-Solr-master-Windows\solr\core\test-lib\apacheds-kerberos-codec-2.0.0-M15.jar;C:\Users\jenkins\workspace\Lucene-Solr-master-Windows\solr\core\test-lib\apacheds-ldif-partition-2.0.0-M15.jar;C:\Users\jenkins\workspace\Lucene-Solr-master-Windows\solr\core\test-lib\apacheds-mavibot-partition-2.0.0-M15.jar;C:\Users\jenkins\workspace\Lucene-Solr-master-Windows\solr\core\test-lib\apacheds-protocol-kerberos-2.0.0-M15.jar;C:\Users\jenkins\workspace\Lucene-Solr-master-Windows\solr\core\test-lib\apacheds-protocol-ldap-2.0.0-M15.jar;C:\Users\jenkins\workspace\Lucene-Solr-master-Windows\solr\core\test-lib\apacheds-protocol-shared-2.0.0-M15.jar;C:\Users\jenkins\workspace\Lucene-Solr-master-Windows\solr\core\test-lib\apacheds-xdbm-partition-2.0.0-M15.jar;C:\Users\jenkins\workspace\Lucene-Solr-master-Windows\solr\core\test-lib\api-all-1.0.0-M20.jar;C:\Users\jenkins\workspace\Lucene-Solr-master-Windows\solr\core\test-lib\bcprov-jdk15on-1.60.jar;C:\Users\jenkins\workspace\Lucene-Solr-master-Windows\solr\core\test-lib\byte-buddy-1.9.3.jar;C:\Users\jenkins\workspace\Lucene-Solr-master-Windows\solr\core\test-lib\commons-collections-3.2.2.jar;C:\Users\jenkins\workspace\Lucene-Solr-master-Windows\solr\core\test-lib\ehcache-core-2.4.4.jar;C:\Users\jenkins\workspace\Lucene-Solr-master-Windows\solr\core\test-lib\hadoop-common-2.7.4-tests.jar;C:\Users\jenkins\workspace\Lucene-Solr-master-Windows\solr\core\test-lib\hadoop-hdfs-2.7.4-tests.jar;C:\Users\jenkins\workspace\Lucene-Solr-master-Windows\solr\core\test-lib\hadoop-minikdc-2.7.4.jar;C:\Users\jenkins\workspace\Lucene-Solr-master-Windows\solr\core\test-lib\htrace-core-3.2.0-incubating.jar;C:\Users\jenkins\workspace\Lucene-Solr-master-Windows\solr\core\test-lib\jersey-core-1.9.jar;C:\Users\jenkins\workspace\Lucene-Solr-master-Windows\solr\core\test-lib\jersey-server-1.9.jar;C:\Users\jenkins\workspace\Lucene-Solr-master-Windows\solr\core\test-lib\jetty-6.1.26.jar;C:\Users\jenkins\workspace\Lucene-Solr-master-Windows\solr\core\test-lib\jetty-sslengine-6.1.26.jar;C:\Users\jenkins\workspace\Lucene-Solr-master-Windows\solr\core\test-lib\jetty-util-6.1.26.jar;C:\Users\jenkins\workspace\Lucene-Solr-master-Windows\solr\core\test-lib\mina-core-2.0.0-M5.jar;C:\Users\jenkins\workspace\Lucene-Solr-master-Windows\solr\core\test-lib\mockito-core-2.23.4.jar;C:\Users\jenkins\workspace\Lucene-Solr-master-Windows\solr\core\test-lib\netty-all-4.0.36.Final.jar;C:\Users\jenkins\workspace\Lucene-Solr-master-Windows\solr\core\test-lib\objenesis-2.6.jar;C:\Users\jenkins\workspace\Lucene-Solr-master-Windows\lucene\build\analysis\icu\lucene-analyzers-icu-8.0.0-SNAPSHOT.jar;C:\Users\jenkins\workspace\Lucene-Solr-master-Windows\solr\build\contrib\solr-analysis-extras\classes\java;C:\Users\jenkins\workspace\Lucene-Solr-master-Windows\lucene\build\queryparser\classes\test;C:\Users\jenkins\workspace\Lucene-Solr-master-Windows\lucene\build\backward-codecs\classes\test;C:\Users\jenkins\workspace\Lucene-Solr-master-Windows\solr\contrib\analysis-extras\lib\icu4j-62.1.jar;C:\Users\jenkins\tools\hudson.tasks.Ant_AntInstallation\ANT_1.8.2\lib\ant-launcher.jar;C:\Users\jenkins\.ant\lib\ivy-2.4.0.jar;C:\Users\jenkins\tools\hudson.tasks.Ant_AntInstallation\ANT_1.8.2\lib\ant-antlr.jar;C:\Users\jenkins\tools\hudson.tasks.Ant_AntInstallation\ANT_1.8.2\lib\ant-apache-bcel.jar;C:\Users\jenkins\tools\hudson.tasks.Ant_AntInstallation\ANT_1.8.2\lib\ant-apache-bsf.jar;C:\Users\jenkins\tools\hudson.tasks.Ant_AntInstallation\ANT_1.8.2\lib\ant-apache-log4j.jar;C:\Users\jenkins\tools\hudson.tasks.Ant_AntInstallation\ANT_1.8.2\lib\ant-apache-oro.jar;C:\Users\jenkins\tools\hudson.tasks.Ant_AntInstallation\ANT_1.8.2\lib\ant-apache-regexp.jar;C:\Users\jenkins\tools\hudson.tasks.Ant_AntInstallation\ANT_1.8.2\lib\ant-apache-resolver.jar;C:\Users\jenkins\tools\hudson.tasks.Ant_AntInstallation\ANT_1.8.2\lib\ant-apache-xalan2.jar;C:\Users\jenkins\tools\hudson.tasks.Ant_AntInstallation\ANT_1.8.2\lib\ant-commons-logging.jar;C:\Users\jenkins\tools\hudson.tasks.Ant_AntInstallation\ANT_1.8.2\lib\ant-commons-net.jar;C:\Users\jenkins\tools\hudson.tasks.Ant_AntInstallation\ANT_1.8.2\lib\ant-jai.jar;C:\Users\jenkins\tools\hudson.tasks.Ant_AntInstallation\ANT_1.8.2\lib\ant-javamail.jar;C:\Users\jenkins\tools\hudson.tasks.Ant_AntInstallation\ANT_1.8.2\lib\ant-jdepend.jar;C:\Users\jenkins\tools\hudson.tasks.Ant_AntInstallation\ANT_1.8.2\lib\ant-jmf.jar;C:\Users\jenkins\tools\hudson.tasks.Ant_AntInstallation\ANT_1.8.2\lib\ant-jsch.jar;C:\Users\jenkins\tools\hudson.tasks.Ant_AntInstallation\ANT_1.8.2\lib\ant-junit.jar;C:\Users\jenkins\tools\hudson.tasks.Ant_AntInstallation\ANT_1.8.2\lib\ant-junit4.jar;C:\Users\jenkins\tools\hudson.tasks.Ant_AntInstallation\ANT_1.8.2\lib\ant-netrexx.jar;C:\Users\jenkins\tools\hudson.tasks.Ant_AntInstallation\ANT_1.8.2\lib\ant-swing.jar;C:\Users\jenkins\tools\hudson.tasks.Ant_AntInstallation\ANT_1.8.2\lib\ant-testutil.jar;C:\Users\jenkins\tools\hudson.tasks.Ant_AntInstallation\ANT_1.8.2\lib\ant.jar;C:\Users\jenkins\.ivy2\cache\com.carrotsearch.randomizedtesting\junit4-ant\jars\junit4-ant-2.7.2.jar com.carrotsearch.ant.tasks.junit4.slave.SlaveMainSafe -eventsfile C:\Users\jenkins\workspace\Lucene-Solr-master-Windows\solr\build\solr-core\test\temp\junit4-J1-20190104_133502_01118028798058180013901.events @C:\Users\jenkins\workspace\Lucene-Solr-master-Windows\solr\build\solr-core\test\temp\junit4-J1-20190104_133502_0112706602006747013045.suites -stdin
   [junit4] ERROR: JVM J1 ended with an exception: Forked process returned with error code: 1. Very likely a JVM crash.  See process stdout at: C:\Users\jenkins\workspace\Lucene-Solr-master-Windows\solr\build\solr-core\test\temp\junit4-J1-20190104_133502_01116642728668270228903.sysout See process stderr at: C:\Users\jenkins\workspace\Lucene-Solr-master-Windows\solr\build\solr-core\test\temp\junit4-J1-20190104_133502_01111358890489645829218.syserr
   [junit4] 	at com.carrotsearch.ant.tasks.junit4.JUnit4.executeSlave(JUnit4.java:1542)
   [junit4] 	at com.carrotsearch.ant.tasks.junit4.JUnit4.access$000(JUnit4.java:123)
   [junit4] 	at com.carrotsearch.ant.tasks.junit4.JUnit4$2.call(JUnit4.java:997)
   [junit4] 	at com.carrotsearch.ant.tasks.junit4.JUnit4$2.call(JUnit4.java:994)
   [junit4] 	at java.base/java.util.concurrent.FutureTask.run(FutureTask.java:264)
   [junit4] 	at java.base/java.util.concurrent.ThreadPoolExecutor.runWorker(ThreadPoolExecutor.java:1135)
   [junit4] 	at java.base/java.util.concurrent.ThreadPoolExecutor$Worker.run(ThreadPoolExecutor.java:635)
   [junit4] 	at java.base/java.lang.Thread.run(Thread.java:844)

BUILD FAILED
C:\Users\jenkins\workspace\Lucene-Solr-master-Windows\build.xml:633: The following error occurred while executing this line:
C:\Users\jenkins\workspace\Lucene-Solr-master-Windows\build.xml:577: The following error occurred while executing this line:
C:\Users\jenkins\workspace\Lucene-Solr-master-Windows\build.xml:59: The following error occurred while executing this line:
C:\Users\jenkins\workspace\Lucene-Solr-master-Windows\solr\build.xml:267: The following error occurred while executing this line:
C:\Users\jenkins\workspace\Lucene-Solr-master-Windows\solr\common-build.xml:558: The following error occurred while executing this line:
C:\Users\jenkins\workspace\Lucene-Solr-master-Windows\lucene\common-build.xml:1572: The following error occurred while executing this line:
C:\Users\jenkins\workspace\Lucene-Solr-master-Windows\lucene\common-build.xml:1099: At least one slave process threw an exception, first: Forked process returned with error code: 1. Very likely a JVM crash.  See process stdout at: C:\Users\jenkins\workspace\Lucene-Solr-master-Windows\solr\build\solr-core\test\temp\junit4-J1-20190104_133502_01116642728668270228903.sysout See process stderr at: C:\Users\jenkins\workspace\Lucene-Solr-master-Windows\solr\build\solr-core\test\temp\junit4-J1-20190104_133502_01111358890489645829218.syserr

Total time: 81 minutes 31 seconds
Build step 'Invoke Ant' marked build as failure
Archiving artifacts
Setting ANT_1_8_2_HOME=C:\Users\jenkins\tools\hudson.tasks.Ant_AntInstallation\ANT_1.8.2
[WARNINGS] Skipping publisher since build result is FAILURE
Recording test results
Setting ANT_1_8_2_HOME=C:\Users\jenkins\tools\hudson.tasks.Ant_AntInstallation\ANT_1.8.2
Email was triggered for: Failure - Any
Sending email for trigger: Failure - Any
Setting ANT_1_8_2_HOME=C:\Users\jenkins\tools\hudson.tasks.Ant_AntInstallation\ANT_1.8.2
Setting ANT_1_8_2_HOME=C:\Users\jenkins\tools\hudson.tasks.Ant_AntInstallation\ANT_1.8.2
Setting ANT_1_8_2_HOME=C:\Users\jenkins\tools\hudson.tasks.Ant_AntInstallation\ANT_1.8.2
Setting ANT_1_8_2_HOME=C:\Users\jenkins\tools\hudson.tasks.Ant_AntInstallation\ANT_1.8.2

[JENKINS] Lucene-Solr-master-Windows (64bit/jdk-11) - Build # 7677 - Unstable!

Posted by Policeman Jenkins Server <je...@thetaphi.de>.
Build: https://jenkins.thetaphi.de/job/Lucene-Solr-master-Windows/7677/
Java: 64bit/jdk-11 -XX:-UseCompressedOops -XX:+UseParallelGC

6 tests failed.
FAILED:  org.apache.solr.cloud.MissingSegmentRecoveryTest.testLeaderRecovery

Error Message:
Expected a collection with one shard and two replicas Timeout waiting to see state for collection=MissingSegmentRecoveryTest :DocCollection(MissingSegmentRecoveryTest//collections/MissingSegmentRecoveryTest/state.json/8)={   "pullReplicas":"0",   "replicationFactor":"2",   "shards":{"shard1":{       "range":"80000000-7fffffff",       "state":"active",       "replicas":{         "core_node3":{           "core":"MissingSegmentRecoveryTest_shard1_replica_n1",           "base_url":"http://127.0.0.1:54422/solr",           "node_name":"127.0.0.1:54422_solr",           "state":"active",           "type":"NRT",           "force_set_state":"false",           "leader":"true"},         "core_node4":{           "core":"MissingSegmentRecoveryTest_shard1_replica_n2",           "base_url":"http://127.0.0.1:54421/solr",           "node_name":"127.0.0.1:54421_solr",           "state":"down",           "type":"NRT",           "force_set_state":"false"}}}},   "router":{"name":"compositeId"},   "maxShardsPerNode":"1",   "autoAddReplicas":"false",   "nrtReplicas":"2",   "tlogReplicas":"0"} Live Nodes: [127.0.0.1:54421_solr, 127.0.0.1:54422_solr] Last available state: DocCollection(MissingSegmentRecoveryTest//collections/MissingSegmentRecoveryTest/state.json/8)={   "pullReplicas":"0",   "replicationFactor":"2",   "shards":{"shard1":{       "range":"80000000-7fffffff",       "state":"active",       "replicas":{         "core_node3":{           "core":"MissingSegmentRecoveryTest_shard1_replica_n1",           "base_url":"http://127.0.0.1:54422/solr",           "node_name":"127.0.0.1:54422_solr",           "state":"active",           "type":"NRT",           "force_set_state":"false",           "leader":"true"},         "core_node4":{           "core":"MissingSegmentRecoveryTest_shard1_replica_n2",           "base_url":"http://127.0.0.1:54421/solr",           "node_name":"127.0.0.1:54421_solr",           "state":"down",           "type":"NRT",           "force_set_state":"false"}}}},   "router":{"name":"compositeId"},   "maxShardsPerNode":"1",   "autoAddReplicas":"false",   "nrtReplicas":"2",   "tlogReplicas":"0"}

Stack Trace:
java.lang.AssertionError: Expected a collection with one shard and two replicas
Timeout waiting to see state for collection=MissingSegmentRecoveryTest :DocCollection(MissingSegmentRecoveryTest//collections/MissingSegmentRecoveryTest/state.json/8)={
  "pullReplicas":"0",
  "replicationFactor":"2",
  "shards":{"shard1":{
      "range":"80000000-7fffffff",
      "state":"active",
      "replicas":{
        "core_node3":{
          "core":"MissingSegmentRecoveryTest_shard1_replica_n1",
          "base_url":"http://127.0.0.1:54422/solr",
          "node_name":"127.0.0.1:54422_solr",
          "state":"active",
          "type":"NRT",
          "force_set_state":"false",
          "leader":"true"},
        "core_node4":{
          "core":"MissingSegmentRecoveryTest_shard1_replica_n2",
          "base_url":"http://127.0.0.1:54421/solr",
          "node_name":"127.0.0.1:54421_solr",
          "state":"down",
          "type":"NRT",
          "force_set_state":"false"}}}},
  "router":{"name":"compositeId"},
  "maxShardsPerNode":"1",
  "autoAddReplicas":"false",
  "nrtReplicas":"2",
  "tlogReplicas":"0"}
Live Nodes: [127.0.0.1:54421_solr, 127.0.0.1:54422_solr]
Last available state: DocCollection(MissingSegmentRecoveryTest//collections/MissingSegmentRecoveryTest/state.json/8)={
  "pullReplicas":"0",
  "replicationFactor":"2",
  "shards":{"shard1":{
      "range":"80000000-7fffffff",
      "state":"active",
      "replicas":{
        "core_node3":{
          "core":"MissingSegmentRecoveryTest_shard1_replica_n1",
          "base_url":"http://127.0.0.1:54422/solr",
          "node_name":"127.0.0.1:54422_solr",
          "state":"active",
          "type":"NRT",
          "force_set_state":"false",
          "leader":"true"},
        "core_node4":{
          "core":"MissingSegmentRecoveryTest_shard1_replica_n2",
          "base_url":"http://127.0.0.1:54421/solr",
          "node_name":"127.0.0.1:54421_solr",
          "state":"down",
          "type":"NRT",
          "force_set_state":"false"}}}},
  "router":{"name":"compositeId"},
  "maxShardsPerNode":"1",
  "autoAddReplicas":"false",
  "nrtReplicas":"2",
  "tlogReplicas":"0"}
	at __randomizedtesting.SeedInfo.seed([657A612AB85F5D26:352FF929E17EEB3B]:0)
	at org.junit.Assert.fail(Assert.java:88)
	at org.apache.solr.cloud.SolrCloudTestCase.waitForState(SolrCloudTestCase.java:289)
	at org.apache.solr.cloud.SolrCloudTestCase.waitForState(SolrCloudTestCase.java:267)
	at org.apache.solr.cloud.MissingSegmentRecoveryTest.testLeaderRecovery(MissingSegmentRecoveryTest.java:106)
	at java.base/jdk.internal.reflect.NativeMethodAccessorImpl.invoke0(Native Method)
	at java.base/jdk.internal.reflect.NativeMethodAccessorImpl.invoke(NativeMethodAccessorImpl.java:62)
	at java.base/jdk.internal.reflect.DelegatingMethodAccessorImpl.invoke(DelegatingMethodAccessorImpl.java:43)
	at java.base/java.lang.reflect.Method.invoke(Method.java:566)
	at com.carrotsearch.randomizedtesting.RandomizedRunner.invoke(RandomizedRunner.java:1750)
	at com.carrotsearch.randomizedtesting.RandomizedRunner$8.evaluate(RandomizedRunner.java:938)
	at com.carrotsearch.randomizedtesting.RandomizedRunner$9.evaluate(RandomizedRunner.java:974)
	at com.carrotsearch.randomizedtesting.RandomizedRunner$10.evaluate(RandomizedRunner.java:988)
	at com.carrotsearch.randomizedtesting.rules.SystemPropertiesRestoreRule$1.evaluate(SystemPropertiesRestoreRule.java:57)
	at org.apache.lucene.util.TestRuleSetupTeardownChained$1.evaluate(TestRuleSetupTeardownChained.java:49)
	at org.apache.lucene.util.AbstractBeforeAfterRule$1.evaluate(AbstractBeforeAfterRule.java:45)
	at org.apache.lucene.util.TestRuleThreadAndTestName$1.evaluate(TestRuleThreadAndTestName.java:48)
	at org.apache.lucene.util.TestRuleIgnoreAfterMaxFailures$1.evaluate(TestRuleIgnoreAfterMaxFailures.java:64)
	at org.apache.lucene.util.TestRuleMarkFailure$1.evaluate(TestRuleMarkFailure.java:47)
	at com.carrotsearch.randomizedtesting.rules.StatementAdapter.evaluate(StatementAdapter.java:36)
	at com.carrotsearch.randomizedtesting.ThreadLeakControl$StatementRunner.run(ThreadLeakControl.java:368)
	at com.carrotsearch.randomizedtesting.ThreadLeakControl.forkTimeoutingTask(ThreadLeakControl.java:817)
	at com.carrotsearch.randomizedtesting.ThreadLeakControl$3.evaluate(ThreadLeakControl.java:468)
	at com.carrotsearch.randomizedtesting.RandomizedRunner.runSingleTest(RandomizedRunner.java:947)
	at com.carrotsearch.randomizedtesting.RandomizedRunner$5.evaluate(RandomizedRunner.java:832)
	at com.carrotsearch.randomizedtesting.RandomizedRunner$6.evaluate(RandomizedRunner.java:883)
	at com.carrotsearch.randomizedtesting.RandomizedRunner$7.evaluate(RandomizedRunner.java:894)
	at com.carrotsearch.randomizedtesting.rules.StatementAdapter.evaluate(StatementAdapter.java:36)
	at com.carrotsearch.randomizedtesting.rules.SystemPropertiesRestoreRule$1.evaluate(SystemPropertiesRestoreRule.java:57)
	at org.apache.lucene.util.AbstractBeforeAfterRule$1.evaluate(AbstractBeforeAfterRule.java:45)
	at com.carrotsearch.randomizedtesting.rules.StatementAdapter.evaluate(StatementAdapter.java:36)
	at org.apache.lucene.util.TestRuleStoreClassName$1.evaluate(TestRuleStoreClassName.java:41)
	at com.carrotsearch.randomizedtesting.rules.NoShadowingOrOverridesOnMethodsRule$1.evaluate(NoShadowingOrOverridesOnMethodsRule.java:40)
	at com.carrotsearch.randomizedtesting.rules.NoShadowingOrOverridesOnMethodsRule$1.evaluate(NoShadowingOrOverridesOnMethodsRule.java:40)
	at com.carrotsearch.randomizedtesting.rules.StatementAdapter.evaluate(StatementAdapter.java:36)
	at com.carrotsearch.randomizedtesting.rules.StatementAdapter.evaluate(StatementAdapter.java:36)
	at org.apache.lucene.util.TestRuleAssertionsRequired$1.evaluate(TestRuleAssertionsRequired.java:53)
	at org.apache.lucene.util.TestRuleMarkFailure$1.evaluate(TestRuleMarkFailure.java:47)
	at org.apache.lucene.util.TestRuleIgnoreAfterMaxFailures$1.evaluate(TestRuleIgnoreAfterMaxFailures.java:64)
	at org.apache.lucene.util.TestRuleIgnoreTestSuites$1.evaluate(TestRuleIgnoreTestSuites.java:54)
	at com.carrotsearch.randomizedtesting.rules.StatementAdapter.evaluate(StatementAdapter.java:36)
	at com.carrotsearch.randomizedtesting.ThreadLeakControl$StatementRunner.run(ThreadLeakControl.java:368)
	at java.base/java.lang.Thread.run(Thread.java:834)


FAILED:  org.apache.solr.cloud.autoscaling.sim.TestSimTriggerIntegration.testNodeLostTriggerRestoreState

Error Message:
The trigger did not fire at all

Stack Trace:
java.lang.AssertionError: The trigger did not fire at all
	at __randomizedtesting.SeedInfo.seed([657A612AB85F5D26:4E85B471222748F6]:0)
	at org.junit.Assert.fail(Assert.java:88)
	at org.junit.Assert.assertTrue(Assert.java:41)
	at org.apache.solr.cloud.autoscaling.sim.TestSimTriggerIntegration.testNodeLostTriggerRestoreState(TestSimTriggerIntegration.java:332)
	at java.base/jdk.internal.reflect.NativeMethodAccessorImpl.invoke0(Native Method)
	at java.base/jdk.internal.reflect.NativeMethodAccessorImpl.invoke(NativeMethodAccessorImpl.java:62)
	at java.base/jdk.internal.reflect.DelegatingMethodAccessorImpl.invoke(DelegatingMethodAccessorImpl.java:43)
	at java.base/java.lang.reflect.Method.invoke(Method.java:566)
	at com.carrotsearch.randomizedtesting.RandomizedRunner.invoke(RandomizedRunner.java:1750)
	at com.carrotsearch.randomizedtesting.RandomizedRunner$8.evaluate(RandomizedRunner.java:938)
	at com.carrotsearch.randomizedtesting.RandomizedRunner$9.evaluate(RandomizedRunner.java:974)
	at com.carrotsearch.randomizedtesting.RandomizedRunner$10.evaluate(RandomizedRunner.java:988)
	at com.carrotsearch.randomizedtesting.rules.SystemPropertiesRestoreRule$1.evaluate(SystemPropertiesRestoreRule.java:57)
	at org.apache.lucene.util.TestRuleSetupTeardownChained$1.evaluate(TestRuleSetupTeardownChained.java:49)
	at org.apache.lucene.util.AbstractBeforeAfterRule$1.evaluate(AbstractBeforeAfterRule.java:45)
	at org.apache.lucene.util.TestRuleThreadAndTestName$1.evaluate(TestRuleThreadAndTestName.java:48)
	at org.apache.lucene.util.TestRuleIgnoreAfterMaxFailures$1.evaluate(TestRuleIgnoreAfterMaxFailures.java:64)
	at org.apache.lucene.util.TestRuleMarkFailure$1.evaluate(TestRuleMarkFailure.java:47)
	at com.carrotsearch.randomizedtesting.rules.StatementAdapter.evaluate(StatementAdapter.java:36)
	at com.carrotsearch.randomizedtesting.ThreadLeakControl$StatementRunner.run(ThreadLeakControl.java:368)
	at com.carrotsearch.randomizedtesting.ThreadLeakControl.forkTimeoutingTask(ThreadLeakControl.java:817)
	at com.carrotsearch.randomizedtesting.ThreadLeakControl$3.evaluate(ThreadLeakControl.java:468)
	at com.carrotsearch.randomizedtesting.RandomizedRunner.runSingleTest(RandomizedRunner.java:947)
	at com.carrotsearch.randomizedtesting.RandomizedRunner$5.evaluate(RandomizedRunner.java:832)
	at com.carrotsearch.randomizedtesting.RandomizedRunner$6.evaluate(RandomizedRunner.java:883)
	at com.carrotsearch.randomizedtesting.RandomizedRunner$7.evaluate(RandomizedRunner.java:894)
	at com.carrotsearch.randomizedtesting.rules.StatementAdapter.evaluate(StatementAdapter.java:36)
	at com.carrotsearch.randomizedtesting.rules.SystemPropertiesRestoreRule$1.evaluate(SystemPropertiesRestoreRule.java:57)
	at org.apache.lucene.util.AbstractBeforeAfterRule$1.evaluate(AbstractBeforeAfterRule.java:45)
	at com.carrotsearch.randomizedtesting.rules.StatementAdapter.evaluate(StatementAdapter.java:36)
	at org.apache.lucene.util.TestRuleStoreClassName$1.evaluate(TestRuleStoreClassName.java:41)
	at com.carrotsearch.randomizedtesting.rules.NoShadowingOrOverridesOnMethodsRule$1.evaluate(NoShadowingOrOverridesOnMethodsRule.java:40)
	at com.carrotsearch.randomizedtesting.rules.NoShadowingOrOverridesOnMethodsRule$1.evaluate(NoShadowingOrOverridesOnMethodsRule.java:40)
	at com.carrotsearch.randomizedtesting.rules.StatementAdapter.evaluate(StatementAdapter.java:36)
	at com.carrotsearch.randomizedtesting.rules.StatementAdapter.evaluate(StatementAdapter.java:36)
	at org.apache.lucene.util.TestRuleAssertionsRequired$1.evaluate(TestRuleAssertionsRequired.java:53)
	at org.apache.lucene.util.TestRuleMarkFailure$1.evaluate(TestRuleMarkFailure.java:47)
	at org.apache.lucene.util.TestRuleIgnoreAfterMaxFailures$1.evaluate(TestRuleIgnoreAfterMaxFailures.java:64)
	at org.apache.lucene.util.TestRuleIgnoreTestSuites$1.evaluate(TestRuleIgnoreTestSuites.java:54)
	at com.carrotsearch.randomizedtesting.rules.StatementAdapter.evaluate(StatementAdapter.java:36)
	at com.carrotsearch.randomizedtesting.ThreadLeakControl$StatementRunner.run(ThreadLeakControl.java:368)
	at java.base/java.lang.Thread.run(Thread.java:834)


FAILED:  org.apache.solr.cloud.autoscaling.sim.TestSimTriggerIntegration.testNodeMarkersRegistration

Error Message:
Path /autoscaling/nodeAdded/127.0.0.1:10042_solr should have been deleted

Stack Trace:
java.lang.AssertionError: Path /autoscaling/nodeAdded/127.0.0.1:10042_solr should have been deleted
	at __randomizedtesting.SeedInfo.seed([657A612AB85F5D26:7DC0E926B66A90C9]:0)
	at org.junit.Assert.fail(Assert.java:88)
	at org.junit.Assert.assertTrue(Assert.java:41)
	at org.junit.Assert.assertFalse(Assert.java:64)
	at org.apache.solr.cloud.autoscaling.sim.TestSimTriggerIntegration.testNodeMarkersRegistration(TestSimTriggerIntegration.java:892)
	at java.base/jdk.internal.reflect.NativeMethodAccessorImpl.invoke0(Native Method)
	at java.base/jdk.internal.reflect.NativeMethodAccessorImpl.invoke(NativeMethodAccessorImpl.java:62)
	at java.base/jdk.internal.reflect.DelegatingMethodAccessorImpl.invoke(DelegatingMethodAccessorImpl.java:43)
	at java.base/java.lang.reflect.Method.invoke(Method.java:566)
	at com.carrotsearch.randomizedtesting.RandomizedRunner.invoke(RandomizedRunner.java:1750)
	at com.carrotsearch.randomizedtesting.RandomizedRunner$8.evaluate(RandomizedRunner.java:938)
	at com.carrotsearch.randomizedtesting.RandomizedRunner$9.evaluate(RandomizedRunner.java:974)
	at com.carrotsearch.randomizedtesting.RandomizedRunner$10.evaluate(RandomizedRunner.java:988)
	at com.carrotsearch.randomizedtesting.rules.SystemPropertiesRestoreRule$1.evaluate(SystemPropertiesRestoreRule.java:57)
	at org.apache.lucene.util.TestRuleSetupTeardownChained$1.evaluate(TestRuleSetupTeardownChained.java:49)
	at org.apache.lucene.util.AbstractBeforeAfterRule$1.evaluate(AbstractBeforeAfterRule.java:45)
	at org.apache.lucene.util.TestRuleThreadAndTestName$1.evaluate(TestRuleThreadAndTestName.java:48)
	at org.apache.lucene.util.TestRuleIgnoreAfterMaxFailures$1.evaluate(TestRuleIgnoreAfterMaxFailures.java:64)
	at org.apache.lucene.util.TestRuleMarkFailure$1.evaluate(TestRuleMarkFailure.java:47)
	at com.carrotsearch.randomizedtesting.rules.StatementAdapter.evaluate(StatementAdapter.java:36)
	at com.carrotsearch.randomizedtesting.ThreadLeakControl$StatementRunner.run(ThreadLeakControl.java:368)
	at com.carrotsearch.randomizedtesting.ThreadLeakControl.forkTimeoutingTask(ThreadLeakControl.java:817)
	at com.carrotsearch.randomizedtesting.ThreadLeakControl$3.evaluate(ThreadLeakControl.java:468)
	at com.carrotsearch.randomizedtesting.RandomizedRunner.runSingleTest(RandomizedRunner.java:947)
	at com.carrotsearch.randomizedtesting.RandomizedRunner$5.evaluate(RandomizedRunner.java:832)
	at com.carrotsearch.randomizedtesting.RandomizedRunner$6.evaluate(RandomizedRunner.java:883)
	at com.carrotsearch.randomizedtesting.RandomizedRunner$7.evaluate(RandomizedRunner.java:894)
	at com.carrotsearch.randomizedtesting.rules.StatementAdapter.evaluate(StatementAdapter.java:36)
	at com.carrotsearch.randomizedtesting.rules.SystemPropertiesRestoreRule$1.evaluate(SystemPropertiesRestoreRule.java:57)
	at org.apache.lucene.util.AbstractBeforeAfterRule$1.evaluate(AbstractBeforeAfterRule.java:45)
	at com.carrotsearch.randomizedtesting.rules.StatementAdapter.evaluate(StatementAdapter.java:36)
	at org.apache.lucene.util.TestRuleStoreClassName$1.evaluate(TestRuleStoreClassName.java:41)
	at com.carrotsearch.randomizedtesting.rules.NoShadowingOrOverridesOnMethodsRule$1.evaluate(NoShadowingOrOverridesOnMethodsRule.java:40)
	at com.carrotsearch.randomizedtesting.rules.NoShadowingOrOverridesOnMethodsRule$1.evaluate(NoShadowingOrOverridesOnMethodsRule.java:40)
	at com.carrotsearch.randomizedtesting.rules.StatementAdapter.evaluate(StatementAdapter.java:36)
	at com.carrotsearch.randomizedtesting.rules.StatementAdapter.evaluate(StatementAdapter.java:36)
	at org.apache.lucene.util.TestRuleAssertionsRequired$1.evaluate(TestRuleAssertionsRequired.java:53)
	at org.apache.lucene.util.TestRuleMarkFailure$1.evaluate(TestRuleMarkFailure.java:47)
	at org.apache.lucene.util.TestRuleIgnoreAfterMaxFailures$1.evaluate(TestRuleIgnoreAfterMaxFailures.java:64)
	at org.apache.lucene.util.TestRuleIgnoreTestSuites$1.evaluate(TestRuleIgnoreTestSuites.java:54)
	at com.carrotsearch.randomizedtesting.rules.StatementAdapter.evaluate(StatementAdapter.java:36)
	at com.carrotsearch.randomizedtesting.ThreadLeakControl$StatementRunner.run(ThreadLeakControl.java:368)
	at java.base/java.lang.Thread.run(Thread.java:834)


FAILED:  org.apache.solr.cloud.autoscaling.sim.TestSimTriggerIntegration.testNodeMarkersRegistration

Error Message:
Path /autoscaling/nodeAdded/127.0.0.1:10098_solr should have been deleted

Stack Trace:
java.lang.AssertionError: Path /autoscaling/nodeAdded/127.0.0.1:10098_solr should have been deleted
	at __randomizedtesting.SeedInfo.seed([657A612AB85F5D26:7DC0E926B66A90C9]:0)
	at org.junit.Assert.fail(Assert.java:88)
	at org.junit.Assert.assertTrue(Assert.java:41)
	at org.junit.Assert.assertFalse(Assert.java:64)
	at org.apache.solr.cloud.autoscaling.sim.TestSimTriggerIntegration.testNodeMarkersRegistration(TestSimTriggerIntegration.java:892)
	at java.base/jdk.internal.reflect.NativeMethodAccessorImpl.invoke0(Native Method)
	at java.base/jdk.internal.reflect.NativeMethodAccessorImpl.invoke(NativeMethodAccessorImpl.java:62)
	at java.base/jdk.internal.reflect.DelegatingMethodAccessorImpl.invoke(DelegatingMethodAccessorImpl.java:43)
	at java.base/java.lang.reflect.Method.invoke(Method.java:566)
	at com.carrotsearch.randomizedtesting.RandomizedRunner.invoke(RandomizedRunner.java:1750)
	at com.carrotsearch.randomizedtesting.RandomizedRunner$8.evaluate(RandomizedRunner.java:938)
	at com.carrotsearch.randomizedtesting.RandomizedRunner$9.evaluate(RandomizedRunner.java:974)
	at com.carrotsearch.randomizedtesting.RandomizedRunner$10.evaluate(RandomizedRunner.java:988)
	at com.carrotsearch.randomizedtesting.rules.SystemPropertiesRestoreRule$1.evaluate(SystemPropertiesRestoreRule.java:57)
	at org.apache.lucene.util.TestRuleSetupTeardownChained$1.evaluate(TestRuleSetupTeardownChained.java:49)
	at org.apache.lucene.util.AbstractBeforeAfterRule$1.evaluate(AbstractBeforeAfterRule.java:45)
	at org.apache.lucene.util.TestRuleThreadAndTestName$1.evaluate(TestRuleThreadAndTestName.java:48)
	at org.apache.lucene.util.TestRuleIgnoreAfterMaxFailures$1.evaluate(TestRuleIgnoreAfterMaxFailures.java:64)
	at org.apache.lucene.util.TestRuleMarkFailure$1.evaluate(TestRuleMarkFailure.java:47)
	at com.carrotsearch.randomizedtesting.rules.StatementAdapter.evaluate(StatementAdapter.java:36)
	at com.carrotsearch.randomizedtesting.ThreadLeakControl$StatementRunner.run(ThreadLeakControl.java:368)
	at com.carrotsearch.randomizedtesting.ThreadLeakControl.forkTimeoutingTask(ThreadLeakControl.java:817)
	at com.carrotsearch.randomizedtesting.ThreadLeakControl$3.evaluate(ThreadLeakControl.java:468)
	at com.carrotsearch.randomizedtesting.RandomizedRunner.runSingleTest(RandomizedRunner.java:947)
	at com.carrotsearch.randomizedtesting.RandomizedRunner$5.evaluate(RandomizedRunner.java:832)
	at com.carrotsearch.randomizedtesting.RandomizedRunner$6.evaluate(RandomizedRunner.java:883)
	at com.carrotsearch.randomizedtesting.RandomizedRunner$7.evaluate(RandomizedRunner.java:894)
	at com.carrotsearch.randomizedtesting.rules.StatementAdapter.evaluate(StatementAdapter.java:36)
	at com.carrotsearch.randomizedtesting.rules.SystemPropertiesRestoreRule$1.evaluate(SystemPropertiesRestoreRule.java:57)
	at org.apache.lucene.util.AbstractBeforeAfterRule$1.evaluate(AbstractBeforeAfterRule.java:45)
	at com.carrotsearch.randomizedtesting.rules.StatementAdapter.evaluate(StatementAdapter.java:36)
	at org.apache.lucene.util.TestRuleStoreClassName$1.evaluate(TestRuleStoreClassName.java:41)
	at com.carrotsearch.randomizedtesting.rules.NoShadowingOrOverridesOnMethodsRule$1.evaluate(NoShadowingOrOverridesOnMethodsRule.java:40)
	at com.carrotsearch.randomizedtesting.rules.NoShadowingOrOverridesOnMethodsRule$1.evaluate(NoShadowingOrOverridesOnMethodsRule.java:40)
	at com.carrotsearch.randomizedtesting.rules.StatementAdapter.evaluate(StatementAdapter.java:36)
	at com.carrotsearch.randomizedtesting.rules.StatementAdapter.evaluate(StatementAdapter.java:36)
	at org.apache.lucene.util.TestRuleAssertionsRequired$1.evaluate(TestRuleAssertionsRequired.java:53)
	at org.apache.lucene.util.TestRuleMarkFailure$1.evaluate(TestRuleMarkFailure.java:47)
	at org.apache.lucene.util.TestRuleIgnoreAfterMaxFailures$1.evaluate(TestRuleIgnoreAfterMaxFailures.java:64)
	at org.apache.lucene.util.TestRuleIgnoreTestSuites$1.evaluate(TestRuleIgnoreTestSuites.java:54)
	at com.carrotsearch.randomizedtesting.rules.StatementAdapter.evaluate(StatementAdapter.java:36)
	at com.carrotsearch.randomizedtesting.ThreadLeakControl$StatementRunner.run(ThreadLeakControl.java:368)
	at java.base/java.lang.Thread.run(Thread.java:834)


FAILED:  org.apache.solr.cloud.autoscaling.sim.TestSimTriggerIntegration.testNodeMarkersRegistration

Error Message:
Path /autoscaling/nodeAdded/127.0.0.1:10014_solr should have been deleted

Stack Trace:
java.lang.AssertionError: Path /autoscaling/nodeAdded/127.0.0.1:10014_solr should have been deleted
	at __randomizedtesting.SeedInfo.seed([657A612AB85F5D26:7DC0E926B66A90C9]:0)
	at org.junit.Assert.fail(Assert.java:88)
	at org.junit.Assert.assertTrue(Assert.java:41)
	at org.junit.Assert.assertFalse(Assert.java:64)
	at org.apache.solr.cloud.autoscaling.sim.TestSimTriggerIntegration.testNodeMarkersRegistration(TestSimTriggerIntegration.java:892)
	at java.base/jdk.internal.reflect.NativeMethodAccessorImpl.invoke0(Native Method)
	at java.base/jdk.internal.reflect.NativeMethodAccessorImpl.invoke(NativeMethodAccessorImpl.java:62)
	at java.base/jdk.internal.reflect.DelegatingMethodAccessorImpl.invoke(DelegatingMethodAccessorImpl.java:43)
	at java.base/java.lang.reflect.Method.invoke(Method.java:566)
	at com.carrotsearch.randomizedtesting.RandomizedRunner.invoke(RandomizedRunner.java:1750)
	at com.carrotsearch.randomizedtesting.RandomizedRunner$8.evaluate(RandomizedRunner.java:938)
	at com.carrotsearch.randomizedtesting.RandomizedRunner$9.evaluate(RandomizedRunner.java:974)
	at com.carrotsearch.randomizedtesting.RandomizedRunner$10.evaluate(RandomizedRunner.java:988)
	at com.carrotsearch.randomizedtesting.rules.SystemPropertiesRestoreRule$1.evaluate(SystemPropertiesRestoreRule.java:57)
	at org.apache.lucene.util.TestRuleSetupTeardownChained$1.evaluate(TestRuleSetupTeardownChained.java:49)
	at org.apache.lucene.util.AbstractBeforeAfterRule$1.evaluate(AbstractBeforeAfterRule.java:45)
	at org.apache.lucene.util.TestRuleThreadAndTestName$1.evaluate(TestRuleThreadAndTestName.java:48)
	at org.apache.lucene.util.TestRuleIgnoreAfterMaxFailures$1.evaluate(TestRuleIgnoreAfterMaxFailures.java:64)
	at org.apache.lucene.util.TestRuleMarkFailure$1.evaluate(TestRuleMarkFailure.java:47)
	at com.carrotsearch.randomizedtesting.rules.StatementAdapter.evaluate(StatementAdapter.java:36)
	at com.carrotsearch.randomizedtesting.ThreadLeakControl$StatementRunner.run(ThreadLeakControl.java:368)
	at com.carrotsearch.randomizedtesting.ThreadLeakControl.forkTimeoutingTask(ThreadLeakControl.java:817)
	at com.carrotsearch.randomizedtesting.ThreadLeakControl$3.evaluate(ThreadLeakControl.java:468)
	at com.carrotsearch.randomizedtesting.RandomizedRunner.runSingleTest(RandomizedRunner.java:947)
	at com.carrotsearch.randomizedtesting.RandomizedRunner$5.evaluate(RandomizedRunner.java:832)
	at com.carrotsearch.randomizedtesting.RandomizedRunner$6.evaluate(RandomizedRunner.java:883)
	at com.carrotsearch.randomizedtesting.RandomizedRunner$7.evaluate(RandomizedRunner.java:894)
	at com.carrotsearch.randomizedtesting.rules.StatementAdapter.evaluate(StatementAdapter.java:36)
	at com.carrotsearch.randomizedtesting.rules.SystemPropertiesRestoreRule$1.evaluate(SystemPropertiesRestoreRule.java:57)
	at org.apache.lucene.util.AbstractBeforeAfterRule$1.evaluate(AbstractBeforeAfterRule.java:45)
	at com.carrotsearch.randomizedtesting.rules.StatementAdapter.evaluate(StatementAdapter.java:36)
	at org.apache.lucene.util.TestRuleStoreClassName$1.evaluate(TestRuleStoreClassName.java:41)
	at com.carrotsearch.randomizedtesting.rules.NoShadowingOrOverridesOnMethodsRule$1.evaluate(NoShadowingOrOverridesOnMethodsRule.java:40)
	at com.carrotsearch.randomizedtesting.rules.NoShadowingOrOverridesOnMethodsRule$1.evaluate(NoShadowingOrOverridesOnMethodsRule.java:40)
	at com.carrotsearch.randomizedtesting.rules.StatementAdapter.evaluate(StatementAdapter.java:36)
	at com.carrotsearch.randomizedtesting.rules.StatementAdapter.evaluate(StatementAdapter.java:36)
	at org.apache.lucene.util.TestRuleAssertionsRequired$1.evaluate(TestRuleAssertionsRequired.java:53)
	at org.apache.lucene.util.TestRuleMarkFailure$1.evaluate(TestRuleMarkFailure.java:47)
	at org.apache.lucene.util.TestRuleIgnoreAfterMaxFailures$1.evaluate(TestRuleIgnoreAfterMaxFailures.java:64)
	at org.apache.lucene.util.TestRuleIgnoreTestSuites$1.evaluate(TestRuleIgnoreTestSuites.java:54)
	at com.carrotsearch.randomizedtesting.rules.StatementAdapter.evaluate(StatementAdapter.java:36)
	at com.carrotsearch.randomizedtesting.ThreadLeakControl$StatementRunner.run(ThreadLeakControl.java:368)
	at java.base/java.lang.Thread.run(Thread.java:834)


FAILED:  org.apache.solr.cloud.autoscaling.sim.TestSimTriggerIntegration.testNodeMarkersRegistration

Error Message:
Path /autoscaling/nodeAdded/127.0.0.1:10014_solr wasn't created

Stack Trace:
java.lang.AssertionError: Path /autoscaling/nodeAdded/127.0.0.1:10014_solr wasn't created
	at __randomizedtesting.SeedInfo.seed([657A612AB85F5D26:7DC0E926B66A90C9]:0)
	at org.junit.Assert.fail(Assert.java:88)
	at org.junit.Assert.assertTrue(Assert.java:41)
	at org.apache.solr.cloud.autoscaling.sim.TestSimTriggerIntegration.testNodeMarkersRegistration(TestSimTriggerIntegration.java:888)
	at java.base/jdk.internal.reflect.NativeMethodAccessorImpl.invoke0(Native Method)
	at java.base/jdk.internal.reflect.NativeMethodAccessorImpl.invoke(NativeMethodAccessorImpl.java:62)
	at java.base/jdk.internal.reflect.DelegatingMethodAccessorImpl.invoke(DelegatingMethodAccessorImpl.java:43)
	at java.base/java.lang.reflect.Method.invoke(Method.java:566)
	at com.carrotsearch.randomizedtesting.RandomizedRunner.invoke(RandomizedRunner.java:1750)
	at com.carrotsearch.randomizedtesting.RandomizedRunner$8.evaluate(RandomizedRunner.java:938)
	at com.carrotsearch.randomizedtesting.RandomizedRunner$9.evaluate(RandomizedRunner.java:974)
	at com.carrotsearch.randomizedtesting.RandomizedRunner$10.evaluate(RandomizedRunner.java:988)
	at com.carrotsearch.randomizedtesting.rules.SystemPropertiesRestoreRule$1.evaluate(SystemPropertiesRestoreRule.java:57)
	at org.apache.lucene.util.TestRuleSetupTeardownChained$1.evaluate(TestRuleSetupTeardownChained.java:49)
	at org.apache.lucene.util.AbstractBeforeAfterRule$1.evaluate(AbstractBeforeAfterRule.java:45)
	at org.apache.lucene.util.TestRuleThreadAndTestName$1.evaluate(TestRuleThreadAndTestName.java:48)
	at org.apache.lucene.util.TestRuleIgnoreAfterMaxFailures$1.evaluate(TestRuleIgnoreAfterMaxFailures.java:64)
	at org.apache.lucene.util.TestRuleMarkFailure$1.evaluate(TestRuleMarkFailure.java:47)
	at com.carrotsearch.randomizedtesting.rules.StatementAdapter.evaluate(StatementAdapter.java:36)
	at com.carrotsearch.randomizedtesting.ThreadLeakControl$StatementRunner.run(ThreadLeakControl.java:368)
	at com.carrotsearch.randomizedtesting.ThreadLeakControl.forkTimeoutingTask(ThreadLeakControl.java:817)
	at com.carrotsearch.randomizedtesting.ThreadLeakControl$3.evaluate(ThreadLeakControl.java:468)
	at com.carrotsearch.randomizedtesting.RandomizedRunner.runSingleTest(RandomizedRunner.java:947)
	at com.carrotsearch.randomizedtesting.RandomizedRunner$5.evaluate(RandomizedRunner.java:832)
	at com.carrotsearch.randomizedtesting.RandomizedRunner$6.evaluate(RandomizedRunner.java:883)
	at com.carrotsearch.randomizedtesting.RandomizedRunner$7.evaluate(RandomizedRunner.java:894)
	at com.carrotsearch.randomizedtesting.rules.StatementAdapter.evaluate(StatementAdapter.java:36)
	at com.carrotsearch.randomizedtesting.rules.SystemPropertiesRestoreRule$1.evaluate(SystemPropertiesRestoreRule.java:57)
	at org.apache.lucene.util.AbstractBeforeAfterRule$1.evaluate(AbstractBeforeAfterRule.java:45)
	at com.carrotsearch.randomizedtesting.rules.StatementAdapter.evaluate(StatementAdapter.java:36)
	at org.apache.lucene.util.TestRuleStoreClassName$1.evaluate(TestRuleStoreClassName.java:41)
	at com.carrotsearch.randomizedtesting.rules.NoShadowingOrOverridesOnMethodsRule$1.evaluate(NoShadowingOrOverridesOnMethodsRule.java:40)
	at com.carrotsearch.randomizedtesting.rules.NoShadowingOrOverridesOnMethodsRule$1.evaluate(NoShadowingOrOverridesOnMethodsRule.java:40)
	at com.carrotsearch.randomizedtesting.rules.StatementAdapter.evaluate(StatementAdapter.java:36)
	at com.carrotsearch.randomizedtesting.rules.StatementAdapter.evaluate(StatementAdapter.java:36)
	at org.apache.lucene.util.TestRuleAssertionsRequired$1.evaluate(TestRuleAssertionsRequired.java:53)
	at org.apache.lucene.util.TestRuleMarkFailure$1.evaluate(TestRuleMarkFailure.java:47)
	at org.apache.lucene.util.TestRuleIgnoreAfterMaxFailures$1.evaluate(TestRuleIgnoreAfterMaxFailures.java:64)
	at org.apache.lucene.util.TestRuleIgnoreTestSuites$1.evaluate(TestRuleIgnoreTestSuites.java:54)
	at com.carrotsearch.randomizedtesting.rules.StatementAdapter.evaluate(StatementAdapter.java:36)
	at com.carrotsearch.randomizedtesting.ThreadLeakControl$StatementRunner.run(ThreadLeakControl.java:368)
	at java.base/java.lang.Thread.run(Thread.java:834)




Build Log:
[...truncated 14000 lines...]
   [junit4] Suite: org.apache.solr.cloud.MissingSegmentRecoveryTest
   [junit4]   2> 1517068 INFO  (SUITE-MissingSegmentRecoveryTest-seed#[657A612AB85F5D26]-worker) [    ] o.a.s.SolrTestCaseJ4 SecureRandom sanity checks: test.solr.allowed.securerandom=null & java.security.egd=file:/dev/./urandom
   [junit4]   2> Creating dataDir: C:\Users\jenkins\workspace\Lucene-Solr-master-Windows\solr\build\solr-core\test\J1\temp\solr.cloud.MissingSegmentRecoveryTest_657A612AB85F5D26-001\init-core-data-001
   [junit4]   2> 1517068 INFO  (SUITE-MissingSegmentRecoveryTest-seed#[657A612AB85F5D26]-worker) [    ] o.a.s.SolrTestCaseJ4 Using TrieFields (NUMERIC_POINTS_SYSPROP=false) w/NUMERIC_DOCVALUES_SYSPROP=true
   [junit4]   2> 1517068 INFO  (SUITE-MissingSegmentRecoveryTest-seed#[657A612AB85F5D26]-worker) [    ] o.a.s.SolrTestCaseJ4 Randomized ssl (false) and clientAuth (false) via: @org.apache.solr.util.RandomizeSSL(reason="", value=0.0/0.0, ssl=0.0/0.0, clientAuth=0.0/0.0)
   [junit4]   2> 1517068 INFO  (SUITE-MissingSegmentRecoveryTest-seed#[657A612AB85F5D26]-worker) [    ] o.a.s.c.MiniSolrCloudCluster Starting cluster of 2 servers in C:\Users\jenkins\workspace\Lucene-Solr-master-Windows\solr\build\solr-core\test\J1\temp\solr.cloud.MissingSegmentRecoveryTest_657A612AB85F5D26-001\tempDir-001
   [junit4]   2> 1517068 INFO  (SUITE-MissingSegmentRecoveryTest-seed#[657A612AB85F5D26]-worker) [    ] o.a.s.c.ZkTestServer STARTING ZK TEST SERVER
   [junit4]   2> 1517068 INFO  (ZkTestServer Run Thread) [    ] o.a.s.c.ZkTestServer client port:0.0.0.0/0.0.0.0:0
   [junit4]   2> 1517068 INFO  (ZkTestServer Run Thread) [    ] o.a.s.c.ZkTestServer Starting server
   [junit4]   2> 1517192 INFO  (SUITE-MissingSegmentRecoveryTest-seed#[657A612AB85F5D26]-worker) [    ] o.a.s.c.ZkTestServer start zk server on port:54410
   [junit4]   2> 1517192 INFO  (SUITE-MissingSegmentRecoveryTest-seed#[657A612AB85F5D26]-worker) [    ] o.a.s.c.ZkTestServer parse host and port list: 127.0.0.1:54410
   [junit4]   2> 1517192 INFO  (SUITE-MissingSegmentRecoveryTest-seed#[657A612AB85F5D26]-worker) [    ] o.a.s.c.ZkTestServer connecting to 127.0.0.1 54410
   [junit4]   2> 1517192 INFO  (zkConnectionManagerCallback-11262-thread-1) [    ] o.a.s.c.c.ConnectionManager zkClient has connected
   [junit4]   2> 1517192 INFO  (zkConnectionManagerCallback-11264-thread-1) [    ] o.a.s.c.c.ConnectionManager zkClient has connected
   [junit4]   2> 1517192 INFO  (zkConnectionManagerCallback-11266-thread-1) [    ] o.a.s.c.c.ConnectionManager zkClient has connected
   [junit4]   2> 1517192 WARN  (jetty-launcher-11267-thread-2) [    ] o.e.j.s.AbstractConnector Ignoring deprecated socket close linger time
   [junit4]   2> 1517192 WARN  (jetty-launcher-11267-thread-1) [    ] o.e.j.s.AbstractConnector Ignoring deprecated socket close linger time
   [junit4]   2> 1517192 INFO  (jetty-launcher-11267-thread-1) [    ] o.a.s.c.s.e.JettySolrRunner Start Jetty (original configured port=0)
   [junit4]   2> 1517192 INFO  (jetty-launcher-11267-thread-2) [    ] o.a.s.c.s.e.JettySolrRunner Start Jetty (original configured port=0)
   [junit4]   2> 1517192 INFO  (jetty-launcher-11267-thread-1) [    ] o.a.s.c.s.e.JettySolrRunner Trying to start Jetty on port 0 try number 1 ...
   [junit4]   2> 1517192 INFO  (jetty-launcher-11267-thread-2) [    ] o.a.s.c.s.e.JettySolrRunner Trying to start Jetty on port 0 try number 1 ...
   [junit4]   2> 1517192 INFO  (jetty-launcher-11267-thread-1) [    ] o.e.j.s.Server jetty-9.4.14.v20181114; built: 2018-11-14T21:20:31.478Z; git: c4550056e785fb5665914545889f21dc136ad9e6; jvm 11+28
   [junit4]   2> 1517192 INFO  (jetty-launcher-11267-thread-2) [    ] o.e.j.s.Server jetty-9.4.14.v20181114; built: 2018-11-14T21:20:31.478Z; git: c4550056e785fb5665914545889f21dc136ad9e6; jvm 11+28
   [junit4]   2> 1517207 INFO  (jetty-launcher-11267-thread-1) [    ] o.e.j.s.session DefaultSessionIdManager workerName=node0
   [junit4]   2> 1517207 INFO  (jetty-launcher-11267-thread-1) [    ] o.e.j.s.session No SessionScavenger set, using defaults
   [junit4]   2> 1517207 INFO  (jetty-launcher-11267-thread-1) [    ] o.e.j.s.session node0 Scavenging every 660000ms
   [junit4]   2> 1517207 INFO  (jetty-launcher-11267-thread-2) [    ] o.e.j.s.session DefaultSessionIdManager workerName=node0
   [junit4]   2> 1517207 INFO  (jetty-launcher-11267-thread-2) [    ] o.e.j.s.session No SessionScavenger set, using defaults
   [junit4]   2> 1517207 INFO  (jetty-launcher-11267-thread-2) [    ] o.e.j.s.session node0 Scavenging every 660000ms
   [junit4]   2> 1517207 INFO  (jetty-launcher-11267-thread-2) [    ] o.e.j.s.h.ContextHandler Started o.e.j.s.ServletContextHandler@1970cc25{/solr,null,AVAILABLE}
   [junit4]   2> 1517207 INFO  (jetty-launcher-11267-thread-1) [    ] o.e.j.s.h.ContextHandler Started o.e.j.s.ServletContextHandler@25231ff8{/solr,null,AVAILABLE}
   [junit4]   2> 1517207 INFO  (jetty-launcher-11267-thread-1) [    ] o.e.j.s.AbstractConnector Started ServerConnector@2b3cccf8{HTTP/1.1,[http/1.1, h2c]}{127.0.0.1:54421}
   [junit4]   2> 1517207 INFO  (jetty-launcher-11267-thread-2) [    ] o.e.j.s.AbstractConnector Started ServerConnector@4ace67e{HTTP/1.1,[http/1.1, h2c]}{127.0.0.1:54422}
   [junit4]   2> 1517207 INFO  (jetty-launcher-11267-thread-1) [    ] o.e.j.s.Server Started @1501962ms
   [junit4]   2> 1517207 INFO  (jetty-launcher-11267-thread-2) [    ] o.e.j.s.Server Started @1501962ms
   [junit4]   2> 1517207 INFO  (jetty-launcher-11267-thread-1) [    ] o.a.s.c.s.e.JettySolrRunner Jetty properties: {hostContext=/solr, hostPort=54421}
   [junit4]   2> 1517207 INFO  (jetty-launcher-11267-thread-2) [    ] o.a.s.c.s.e.JettySolrRunner Jetty properties: {hostContext=/solr, hostPort=54422}
   [junit4]   2> 1517207 ERROR (jetty-launcher-11267-thread-1) [    ] o.a.s.u.StartupLoggingUtils Missing Java Option solr.log.dir. Logging may be missing or incomplete.
   [junit4]   2> 1517207 INFO  (jetty-launcher-11267-thread-1) [    ] o.a.s.s.SolrDispatchFilter Using logger factory org.apache.logging.slf4j.Log4jLoggerFactory
   [junit4]   2> 1517207 ERROR (jetty-launcher-11267-thread-2) [    ] o.a.s.u.StartupLoggingUtils Missing Java Option solr.log.dir. Logging may be missing or incomplete.
   [junit4]   2> 1517207 INFO  (jetty-launcher-11267-thread-2) [    ] o.a.s.s.SolrDispatchFilter Using logger factory org.apache.logging.slf4j.Log4jLoggerFactory
   [junit4]   2> 1517207 INFO  (jetty-launcher-11267-thread-1) [    ] o.a.s.s.SolrDispatchFilter  ___      _       Welcome to Apache Solr? version 8.0.0
   [junit4]   2> 1517207 INFO  (jetty-launcher-11267-thread-2) [    ] o.a.s.s.SolrDispatchFilter  ___      _       Welcome to Apache Solr? version 8.0.0
   [junit4]   2> 1517207 INFO  (jetty-launcher-11267-thread-1) [    ] o.a.s.s.SolrDispatchFilter / __| ___| |_ _   Starting in cloud mode on port null
   [junit4]   2> 1517207 INFO  (jetty-launcher-11267-thread-1) [    ] o.a.s.s.SolrDispatchFilter \__ \/ _ \ | '_|  Install dir: null
   [junit4]   2> 1517207 INFO  (jetty-launcher-11267-thread-1) [    ] o.a.s.s.SolrDispatchFilter |___/\___/_|_|    Start time: 2019-01-05T02:00:15.924114200Z
   [junit4]   2> 1517207 INFO  (jetty-launcher-11267-thread-2) [    ] o.a.s.s.SolrDispatchFilter / __| ___| |_ _   Starting in cloud mode on port null
   [junit4]   2> 1517207 INFO  (jetty-launcher-11267-thread-2) [    ] o.a.s.s.SolrDispatchFilter \__ \/ _ \ | '_|  Install dir: null
   [junit4]   2> 1517207 INFO  (jetty-launcher-11267-thread-2) [    ] o.a.s.s.SolrDispatchFilter |___/\___/_|_|    Start time: 2019-01-05T02:00:15.924114200Z
   [junit4]   2> 1517207 INFO  (zkConnectionManagerCallback-11271-thread-1) [    ] o.a.s.c.c.ConnectionManager zkClient has connected
   [junit4]   2> 1517207 INFO  (zkConnectionManagerCallback-11269-thread-1) [    ] o.a.s.c.c.ConnectionManager zkClient has connected
   [junit4]   2> 1517207 INFO  (jetty-launcher-11267-thread-1) [    ] o.a.s.s.SolrDispatchFilter solr.xml found in ZooKeeper. Loading...
   [junit4]   2> 1517207 INFO  (jetty-launcher-11267-thread-2) [    ] o.a.s.s.SolrDispatchFilter solr.xml found in ZooKeeper. Loading...
   [junit4]   2> 1517254 WARN  (NIOServerCxn.Factory:0.0.0.0/0.0.0.0:0) [    ] o.a.z.s.NIOServerCnxn Unable to read additional data from client sessionid 0x1004c03fe630003, likely client has closed socket
   [junit4]   2> 1517471 WARN  (jetty-launcher-11267-thread-2) [    ] o.e.j.u.s.S.config No Client EndPointIdentificationAlgorithm configured for SslContextFactory@594b7af0[provider=null,keyStore=null,trustStore=null]
   [junit4]   2> 1517471 WARN  (jetty-launcher-11267-thread-2) [    ] o.e.j.u.s.S.config No Client EndPointIdentificationAlgorithm configured for SslContextFactory@31eb971d[provider=null,keyStore=null,trustStore=null]
   [junit4]   2> 1517471 INFO  (jetty-launcher-11267-thread-2) [    ] o.a.s.c.ZkContainer Zookeeper client=127.0.0.1:54410/solr
   [junit4]   2> 1517485 INFO  (zkConnectionManagerCallback-11277-thread-1) [    ] o.a.s.c.c.ConnectionManager zkClient has connected
   [junit4]   2> 1517485 INFO  (zkConnectionManagerCallback-11279-thread-1) [    ] o.a.s.c.c.ConnectionManager zkClient has connected
   [junit4]   2> 1517578 INFO  (jetty-launcher-11267-thread-2) [n:127.0.0.1:54422_solr    ] o.a.s.c.OverseerElectionContext I am going to be the leader 127.0.0.1:54422_solr
   [junit4]   2> 1517578 INFO  (jetty-launcher-11267-thread-2) [n:127.0.0.1:54422_solr    ] o.a.s.c.Overseer Overseer (id=72141174074441734-127.0.0.1:54422_solr-n_0000000000) starting
   [junit4]   2> 1517578 INFO  (zkConnectionManagerCallback-11286-thread-1) [    ] o.a.s.c.c.ConnectionManager zkClient has connected
   [junit4]   2> 1517578 INFO  (jetty-launcher-11267-thread-2) [n:127.0.0.1:54422_solr    ] o.a.s.c.s.i.ZkClientClusterStateProvider Cluster at 127.0.0.1:54410/solr ready
   [junit4]   2> 1517578 INFO  (jetty-launcher-11267-thread-2) [n:127.0.0.1:54422_solr    ] o.a.s.c.ZkController Register node as live in ZooKeeper:/live_nodes/127.0.0.1:54422_solr
   [junit4]   2> 1517578 INFO  (OverseerStateUpdate-72141174074441734-127.0.0.1:54422_solr-n_0000000000) [n:127.0.0.1:54422_solr    ] o.a.s.c.Overseer Starting to work on the main queue : 127.0.0.1:54422_solr
   [junit4]   2> 1517578 INFO  (OverseerStateUpdate-72141174074441734-127.0.0.1:54422_solr-n_0000000000) [n:127.0.0.1:54422_solr    ] o.a.s.c.c.ZkStateReader Updated live nodes from ZooKeeper... (0) -> (1)
   [junit4]   2> 1517593 INFO  (zkCallback-11285-thread-1) [    ] o.a.s.c.c.ZkStateReader Updated live nodes from ZooKeeper... (0) -> (1)
   [junit4]   2> 1517610 INFO  (jetty-launcher-11267-thread-2) [n:127.0.0.1:54422_solr    ] o.a.s.h.a.MetricsHistoryHandler No .system collection, keeping metrics history in memory.
   [junit4]   2> 1517641 INFO  (jetty-launcher-11267-thread-2) [n:127.0.0.1:54422_solr    ] o.a.s.m.r.SolrJmxReporter JMX monitoring for 'solr_54422.solr.node' (registry 'solr.node') enabled at server: com.sun.jmx.mbeanserver.JmxMBeanServer@56f62a13
   [junit4]   2> 1517641 INFO  (jetty-launcher-11267-thread-2) [n:127.0.0.1:54422_solr    ] o.a.s.m.r.SolrJmxReporter JMX monitoring for 'solr_54422.solr.jvm' (registry 'solr.jvm') enabled at server: com.sun.jmx.mbeanserver.JmxMBeanServer@56f62a13
   [junit4]   2> 1517641 INFO  (jetty-launcher-11267-thread-2) [n:127.0.0.1:54422_solr    ] o.a.s.m.r.SolrJmxReporter JMX monitoring for 'solr_54422.solr.jetty' (registry 'solr.jetty') enabled at server: com.sun.jmx.mbeanserver.JmxMBeanServer@56f62a13
   [junit4]   2> 1517641 INFO  (jetty-launcher-11267-thread-2) [n:127.0.0.1:54422_solr    ] o.a.s.c.CorePropertiesLocator Found 0 core definitions underneath C:\Users\jenkins\workspace\Lucene-Solr-master-Windows\solr\build\solr-core\test\J1\temp\solr.cloud.MissingSegmentRecoveryTest_657A612AB85F5D26-001\tempDir-001\node1\.
   [junit4]   2> 1517672 WARN  (jetty-launcher-11267-thread-1) [    ] o.e.j.u.s.S.config No Client EndPointIdentificationAlgorithm configured for SslContextFactory@708dc6a1[provider=null,keyStore=null,trustStore=null]
   [junit4]   2> 1517672 WARN  (jetty-launcher-11267-thread-1) [    ] o.e.j.u.s.S.config No Client EndPointIdentificationAlgorithm configured for SslContextFactory@6b128e34[provider=null,keyStore=null,trustStore=null]
   [junit4]   2> 1517672 INFO  (jetty-launcher-11267-thread-1) [    ] o.a.s.c.ZkContainer Zookeeper client=127.0.0.1:54410/solr
   [junit4]   2> 1517672 INFO  (zkConnectionManagerCallback-11293-thread-1) [    ] o.a.s.c.c.ConnectionManager zkClient has connected
   [junit4]   2> 1517672 WARN  (NIOServerCxn.Factory:0.0.0.0/0.0.0.0:0) [    ] o.a.z.s.NIOServerCnxn Unable to read additional data from client sessionid 0x1004c03fe630008, likely client has closed socket
   [junit4]   2> 1517687 INFO  (zkConnectionManagerCallback-11295-thread-1) [    ] o.a.s.c.c.ConnectionManager zkClient has connected
   [junit4]   2> 1517687 INFO  (jetty-launcher-11267-thread-1) [n:127.0.0.1:54421_solr    ] o.a.s.c.c.ZkStateReader Updated live nodes from ZooKeeper... (0) -> (1)
   [junit4]   2> 1517703 INFO  (jetty-launcher-11267-thread-1) [n:127.0.0.1:54421_solr    ] o.a.s.c.ZkController Publish node=127.0.0.1:54421_solr as DOWN
   [junit4]   2> 1517703 INFO  (jetty-launcher-11267-thread-1) [n:127.0.0.1:54421_solr    ] o.a.s.c.TransientSolrCoreCacheDefault Allocating transient cache for 2147483647 transient cores
   [junit4]   2> 1517703 INFO  (jetty-launcher-11267-thread-1) [n:127.0.0.1:54421_solr    ] o.a.s.c.ZkController Register node as live in ZooKeeper:/live_nodes/127.0.0.1:54421_solr
   [junit4]   2> 1517703 INFO  (zkCallback-11285-thread-1) [    ] o.a.s.c.c.ZkStateReader Updated live nodes from ZooKeeper... (1) -> (2)
   [junit4]   2> 1517703 INFO  (zkCallback-11278-thread-1) [    ] o.a.s.c.c.ZkStateReader Updated live nodes from ZooKeeper... (1) -> (2)
   [junit4]   2> 1517703 INFO  (zkCallback-11294-thread-1) [    ] o.a.s.c.c.ZkStateReader Updated live nodes from ZooKeeper... (1) -> (2)
   [junit4]   2> 1517718 INFO  (zkConnectionManagerCallback-11302-thread-1) [    ] o.a.s.c.c.ConnectionManager zkClient has connected
   [junit4]   2> 1517718 INFO  (jetty-launcher-11267-thread-1) [n:127.0.0.1:54421_solr    ] o.a.s.c.c.ZkStateReader Updated live nodes from ZooKeeper... (0) -> (2)
   [junit4]   2> 1517733 INFO  (jetty-launcher-11267-thread-1) [n:127.0.0.1:54421_solr    ] o.a.s.c.s.i.ZkClientClusterStateProvider Cluster at 127.0.0.1:54410/solr ready
   [junit4]   2> 1517733 INFO  (jetty-launcher-11267-thread-1) [n:127.0.0.1:54421_solr    ] o.a.s.h.a.MetricsHistoryHandler No .system collection, keeping metrics history in memory.
   [junit4]   2> 1517748 INFO  (jetty-launcher-11267-thread-1) [n:127.0.0.1:54421_solr    ] o.a.s.m.r.SolrJmxReporter JMX monitoring for 'solr_54421.solr.node' (registry 'solr.node') enabled at server: com.sun.jmx.mbeanserver.JmxMBeanServer@56f62a13
   [junit4]   2> 1517748 INFO  (jetty-launcher-11267-thread-1) [n:127.0.0.1:54421_solr    ] o.a.s.m.r.SolrJmxReporter JMX monitoring for 'solr_54421.solr.jvm' (registry 'solr.jvm') enabled at server: com.sun.jmx.mbeanserver.JmxMBeanServer@56f62a13
   [junit4]   2> 1517748 INFO  (jetty-launcher-11267-thread-1) [n:127.0.0.1:54421_solr    ] o.a.s.m.r.SolrJmxReporter JMX monitoring for 'solr_54421.solr.jetty' (registry 'solr.jetty') enabled at server: com.sun.jmx.mbeanserver.JmxMBeanServer@56f62a13
   [junit4]   2> 1517748 INFO  (jetty-launcher-11267-thread-1) [n:127.0.0.1:54421_solr    ] o.a.s.c.CorePropertiesLocator Found 0 core definitions underneath C:\Users\jenkins\workspace\Lucene-Solr-master-Windows\solr\build\solr-core\test\J1\temp\solr.cloud.MissingSegmentRecoveryTest_657A612AB85F5D26-001\tempDir-001\node2\.
   [junit4]   2> 1517764 INFO  (zkConnectionManagerCallback-11308-thread-1) [    ] o.a.s.c.c.ConnectionManager zkClient has connected
   [junit4]   2> 1517764 INFO  (SUITE-MissingSegmentRecoveryTest-seed#[657A612AB85F5D26]-worker) [    ] o.a.s.c.c.ZkStateReader Updated live nodes from ZooKeeper... (0) -> (2)
   [junit4]   2> 1517764 INFO  (SUITE-MissingSegmentRecoveryTest-seed#[657A612AB85F5D26]-worker) [    ] o.a.s.c.s.i.ZkClientClusterStateProvider Cluster at 127.0.0.1:54410/solr ready
   [junit4]   2> 1517780 INFO  (TEST-MissingSegmentRecoveryTest.testLeaderRecovery-seed#[657A612AB85F5D26]) [    ] o.a.s.SolrTestCaseJ4 ###Starting testLeaderRecovery
   [junit4]   2> 1517780 INFO  (qtp1510713574-29900) [n:127.0.0.1:54421_solr    ] o.a.s.h.a.CollectionsHandler Invoked Collection Action :create with params collection.configName=conf&maxShardsPerNode=1&name=MissingSegmentRecoveryTest&nrtReplicas=2&action=CREATE&numShards=1&wt=javabin&version=2 and sendToOCPQueue=true
   [junit4]   2> 1517795 INFO  (OverseerThreadFactory-9762-thread-1-processing-n:127.0.0.1:54422_solr) [n:127.0.0.1:54422_solr    ] o.a.s.c.a.c.CreateCollectionCmd Create collection MissingSegmentRecoveryTest
   [junit4]   2> 1517905 INFO  (qtp1510713574-29903) [n:127.0.0.1:54421_solr    ] o.a.s.s.HttpSolrCall [admin] webapp=null path=/admin/metrics params={prefix=CONTAINER.fs.usableSpace,CONTAINER.fs.totalSpace,CORE.coreName&wt=javabin&version=2&group=solr.node,solr.core} status=0 QTime=2
   [junit4]   2> 1517905 INFO  (qtp1510713574-29906) [n:127.0.0.1:54421_solr    ] o.a.s.s.HttpSolrCall [admin] webapp=null path=/admin/metrics params={prefix=CONTAINER.fs.usableSpace,CONTAINER.fs.totalSpace,CORE.coreName&wt=javabin&version=2&group=solr.node,solr.core} status=0 QTime=3
   [junit4]   2> 1517905 INFO  (qtp1510713574-29908) [n:127.0.0.1:54421_solr    ] o.a.s.s.HttpSolrCall [admin] webapp=null path=/admin/metrics params={prefix=CONTAINER.fs.usableSpace,CONTAINER.fs.totalSpace,CORE.coreName&wt=javabin&version=2&group=solr.node,solr.core} status=0 QTime=2
   [junit4]   2> 1517905 INFO  (qtp1510713574-29898) [n:127.0.0.1:54421_solr    ] o.a.s.s.HttpSolrCall [admin] webapp=null path=/admin/metrics params={prefix=CONTAINER.fs.usableSpace,CONTAINER.fs.totalSpace,CORE.coreName&wt=javabin&version=2&group=solr.node,solr.core} status=0 QTime=2
   [junit4]   2> 1517919 INFO  (qtp1510713574-29901) [n:127.0.0.1:54421_solr    ] o.a.s.s.HttpSolrCall [admin] webapp=null path=/admin/metrics params={prefix=CONTAINER.fs.usableSpace,CONTAINER.fs.totalSpace,CORE.coreName&wt=javabin&version=2&group=solr.node,solr.core} status=0 QTime=2
   [junit4]   2> 1517919 INFO  (qtp907302256-29904) [n:127.0.0.1:54422_solr    ] o.a.s.s.HttpSolrCall [admin] webapp=null path=/admin/metrics params={prefix=CONTAINER.fs.usableSpace,CONTAINER.fs.totalSpace,CORE.coreName&wt=javabin&version=2&group=solr.node,solr.core} status=0 QTime=2
   [junit4]   2> 1517919 INFO  (qtp907302256-29905) [n:127.0.0.1:54422_solr    ] o.a.s.s.HttpSolrCall [admin] webapp=null path=/admin/metrics params={prefix=CONTAINER.fs.usableSpace,CONTAINER.fs.totalSpace,CORE.coreName&wt=javabin&version=2&group=solr.node,solr.core} status=0 QTime=3
   [junit4]   2> 1517919 INFO  (qtp907302256-29907) [n:127.0.0.1:54422_solr    ] o.a.s.s.HttpSolrCall [admin] webapp=null path=/admin/metrics params={prefix=CONTAINER.fs.usableSpace,CONTAINER.fs.totalSpace,CORE.coreName&wt=javabin&version=2&group=solr.node,solr.core} status=0 QTime=3
   [junit4]   2> 1517934 INFO  (qtp907302256-29909) [n:127.0.0.1:54422_solr    ] o.a.s.s.HttpSolrCall [admin] webapp=null path=/admin/metrics params={prefix=CONTAINER.fs.usableSpace,CONTAINER.fs.totalSpace,CORE.coreName&wt=javabin&version=2&group=solr.node,solr.core} status=0 QTime=2
   [junit4]   2> 1517934 INFO  (qtp907302256-29910) [n:127.0.0.1:54422_solr    ] o.a.s.s.HttpSolrCall [admin] webapp=null path=/admin/metrics params={prefix=CONTAINER.fs.usableSpace,CONTAINER.fs.totalSpace,CORE.coreName&wt=javabin&version=2&group=solr.node,solr.core} status=0 QTime=2
   [junit4]   2> 1517934 INFO  (OverseerStateUpdate-72141174074441734-127.0.0.1:54422_solr-n_0000000000) [n:127.0.0.1:54422_solr    ] o.a.s.c.o.SliceMutator createReplica() {
   [junit4]   2>   "operation":"ADDREPLICA",
   [junit4]   2>   "collection":"MissingSegmentRecoveryTest",
   [junit4]   2>   "shard":"shard1",
   [junit4]   2>   "core":"MissingSegmentRecoveryTest_shard1_replica_n1",
   [junit4]   2>   "state":"down",
   [junit4]   2>   "base_url":"http://127.0.0.1:54422/solr",
   [junit4]   2>   "type":"NRT",
   [junit4]   2>   "waitForFinalState":"false"} 
   [junit4]   2> 1517934 INFO  (OverseerStateUpdate-72141174074441734-127.0.0.1:54422_solr-n_0000000000) [n:127.0.0.1:54422_solr    ] o.a.s.c.o.SliceMutator createReplica() {
   [junit4]   2>   "operation":"ADDREPLICA",
   [junit4]   2>   "collection":"MissingSegmentRecoveryTest",
   [junit4]   2>   "shard":"shard1",
   [junit4]   2>   "core":"MissingSegmentRecoveryTest_shard1_replica_n2",
   [junit4]   2>   "state":"down",
   [junit4]   2>   "base_url":"http://127.0.0.1:54421/solr",
   [junit4]   2>   "type":"NRT",
   [junit4]   2>   "waitForFinalState":"false"} 
   [junit4]   2> 1518151 INFO  (qtp907302256-29902) [n:127.0.0.1:54422_solr    x:MissingSegmentRecoveryTest_shard1_replica_n1] o.a.s.h.a.CoreAdminOperation core create command qt=/admin/cores&coreNodeName=core_node3&collection.configName=conf&newCollection=true&name=MissingSegmentRecoveryTest_shard1_replica_n1&action=CREATE&numShards=1&collection=MissingSegmentRecoveryTest&shard=shard1&wt=javabin&version=2&replicaType=NRT
   [junit4]   2> 1518151 INFO  (qtp907302256-29902) [n:127.0.0.1:54422_solr    x:MissingSegmentRecoveryTest_shard1_replica_n1] o.a.s.c.TransientSolrCoreCacheDefault Allocating transient cache for 2147483647 transient cores
   [junit4]   2> 1518151 INFO  (qtp1510713574-29903) [n:127.0.0.1:54421_solr    x:MissingSegmentRecoveryTest_shard1_replica_n2] o.a.s.h.a.CoreAdminOperation core create command qt=/admin/cores&coreNodeName=core_node4&collection.configName=conf&newCollection=true&name=MissingSegmentRecoveryTest_shard1_replica_n2&action=CREATE&numShards=1&collection=MissingSegmentRecoveryTest&shard=shard1&wt=javabin&version=2&replicaType=NRT
   [junit4]   2> 1519159 INFO  (qtp907302256-29902) [n:127.0.0.1:54422_solr c:MissingSegmentRecoveryTest s:shard1 r:core_node3 x:MissingSegmentRecoveryTest_shard1_replica_n1] o.a.s.c.SolrConfig Using Lucene MatchVersion: 8.0.0
   [junit4]   2> 1519159 INFO  (qtp1510713574-29903) [n:127.0.0.1:54421_solr c:MissingSegmentRecoveryTest s:shard1 r:core_node4 x:MissingSegmentRecoveryTest_shard1_replica_n2] o.a.s.c.SolrConfig Using Lucene MatchVersion: 8.0.0
   [junit4]   2> 1519173 INFO  (qtp1510713574-29903) [n:127.0.0.1:54421_solr c:MissingSegmentRecoveryTest s:shard1 r:core_node4 x:MissingSegmentRecoveryTest_shard1_replica_n2] o.a.s.s.IndexSchema [MissingSegmentRecoveryTest_shard1_replica_n2] Schema name=minimal
   [junit4]   2> 1519173 INFO  (qtp907302256-29902) [n:127.0.0.1:54422_solr c:MissingSegmentRecoveryTest s:shard1 r:core_node3 x:MissingSegmentRecoveryTest_shard1_replica_n1] o.a.s.s.IndexSchema [MissingSegmentRecoveryTest_shard1_replica_n1] Schema name=minimal
   [junit4]   2> 1519173 INFO  (qtp1510713574-29903) [n:127.0.0.1:54421_solr c:MissingSegmentRecoveryTest s:shard1 r:core_node4 x:MissingSegmentRecoveryTest_shard1_replica_n2] o.a.s.s.IndexSchema Loaded schema minimal/1.1 with uniqueid field id
   [junit4]   2> 1519173 INFO  (qtp1510713574-29903) [n:127.0.0.1:54421_solr c:MissingSegmentRecoveryTest s:shard1 r:core_node4 x:MissingSegmentRecoveryTest_shard1_replica_n2] o.a.s.c.CoreContainer Creating SolrCore 'MissingSegmentRecoveryTest_shard1_replica_n2' using configuration from collection MissingSegmentRecoveryTest, trusted=true
   [junit4]   2> 1519173 INFO  (qtp907302256-29902) [n:127.0.0.1:54422_solr c:MissingSegmentRecoveryTest s:shard1 r:core_node3 x:MissingSegmentRecoveryTest_shard1_replica_n1] o.a.s.s.IndexSchema Loaded schema minimal/1.1 with uniqueid field id
   [junit4]   2> 1519188 INFO  (qtp907302256-29902) [n:127.0.0.1:54422_solr c:MissingSegmentRecoveryTest s:shard1 r:core_node3 x:MissingSegmentRecoveryTest_shard1_replica_n1] o.a.s.c.CoreContainer Creating SolrCore 'MissingSegmentRecoveryTest_shard1_replica_n1' using configuration from collection MissingSegmentRecoveryTest, trusted=true
   [junit4]   2> 1519188 INFO  (qtp1510713574-29903) [n:127.0.0.1:54421_solr c:MissingSegmentRecoveryTest s:shard1 r:core_node4 x:MissingSegmentRecoveryTest_shard1_replica_n2] o.a.s.m.r.SolrJmxReporter JMX monitoring for 'solr_54421.solr.core.MissingSegmentRecoveryTest.shard1.replica_n2' (registry 'solr.core.MissingSegmentRecoveryTest.shard1.replica_n2') enabled at server: com.sun.jmx.mbeanserver.JmxMBeanServer@56f62a13
   [junit4]   2> 1519188 INFO  (qtp1510713574-29903) [n:127.0.0.1:54421_solr c:MissingSegmentRecoveryTest s:shard1 r:core_node4 x:MissingSegmentRecoveryTest_shard1_replica_n2] o.a.s.c.SolrCore [[MissingSegmentRecoveryTest_shard1_replica_n2] ] Opening new SolrCore at [C:\Users\jenkins\workspace\Lucene-Solr-master-Windows\solr\build\solr-core\test\J1\temp\solr.cloud.MissingSegmentRecoveryTest_657A612AB85F5D26-001\tempDir-001\node2\MissingSegmentRecoveryTest_shard1_replica_n2], dataDir=[C:\Users\jenkins\workspace\Lucene-Solr-master-Windows\solr\build\solr-core\test\J1\temp\solr.cloud.MissingSegmentRecoveryTest_657A612AB85F5D26-001\tempDir-001\node2\.\MissingSegmentRecoveryTest_shard1_replica_n2\data\]
   [junit4]   2> 1519188 INFO  (qtp907302256-29902) [n:127.0.0.1:54422_solr c:MissingSegmentRecoveryTest s:shard1 r:core_node3 x:MissingSegmentRecoveryTest_shard1_replica_n1] o.a.s.m.r.SolrJmxReporter JMX monitoring for 'solr_54422.solr.core.MissingSegmentRecoveryTest.shard1.replica_n1' (registry 'solr.core.MissingSegmentRecoveryTest.shard1.replica_n1') enabled at server: com.sun.jmx.mbeanserver.JmxMBeanServer@56f62a13
   [junit4]   2> 1519188 INFO  (qtp907302256-29902) [n:127.0.0.1:54422_solr c:MissingSegmentRecoveryTest s:shard1 r:core_node3 x:MissingSegmentRecoveryTest_shard1_replica_n1] o.a.s.c.SolrCore [[MissingSegmentRecoveryTest_shard1_replica_n1] ] Opening new SolrCore at [C:\Users\jenkins\workspace\Lucene-Solr-master-Windows\solr\build\solr-core\test\J1\temp\solr.cloud.MissingSegmentRecoveryTest_657A612AB85F5D26-001\tempDir-001\node1\MissingSegmentRecoveryTest_shard1_replica_n1], dataDir=[C:\Users\jenkins\workspace\Lucene-Solr-master-Windows\solr\build\solr-core\test\J1\temp\solr.cloud.MissingSegmentRecoveryTest_657A612AB85F5D26-001\tempDir-001\node1\.\MissingSegmentRecoveryTest_shard1_replica_n1\data\]
   [junit4]   2> 1519312 INFO  (qtp907302256-29902) [n:127.0.0.1:54422_solr c:MissingSegmentRecoveryTest s:shard1 r:core_node3 x:MissingSegmentRecoveryTest_shard1_replica_n1] o.a.s.u.UpdateHandler Using UpdateLog implementation: org.apache.solr.update.UpdateLog
   [junit4]   2> 1519312 INFO  (qtp907302256-29902) [n:127.0.0.1:54422_solr c:MissingSegmentRecoveryTest s:shard1 r:core_node3 x:MissingSegmentRecoveryTest_shard1_replica_n1] o.a.s.u.UpdateLog Initializing UpdateLog: dataDir=null defaultSyncLevel=FLUSH numRecordsToKeep=100 maxNumLogsToKeep=10 numVersionBuckets=65536
   [junit4]   2> 1519312 INFO  (qtp907302256-29902) [n:127.0.0.1:54422_solr c:MissingSegmentRecoveryTest s:shard1 r:core_node3 x:MissingSegmentRecoveryTest_shard1_replica_n1] o.a.s.u.CommitTracker Hard AutoCommit: disabled
   [junit4]   2> 1519312 INFO  (qtp907302256-29902) [n:127.0.0.1:54422_solr c:MissingSegmentRecoveryTest s:shard1 r:core_node3 x:MissingSegmentRecoveryTest_shard1_replica_n1] o.a.s.u.CommitTracker Soft AutoCommit: disabled
   [junit4]   2> 1519312 INFO  (qtp907302256-29902) [n:127.0.0.1:54422_solr c:MissingSegmentRecoveryTest s:shard1 r:core_node3 x:MissingSegmentRecoveryTest_shard1_replica_n1] o.a.s.s.SolrIndexSearcher Opening [Searcher@1421ad9b[MissingSegmentRecoveryTest_shard1_replica_n1] main]
   [junit4]   2> 1519312 INFO  (qtp907302256-29902) [n:127.0.0.1:54422_solr c:MissingSegmentRecoveryTest s:shard1 r:core_node3 x:MissingSegmentRecoveryTest_shard1_replica_n1] o.a.s.r.ManagedResourceStorage Configured ZooKeeperStorageIO with znodeBase: /configs/conf
   [junit4]   2> 1519312 INFO  (qtp907302256-29902) [n:127.0.0.1:54422_solr c:MissingSegmentRecoveryTest s:shard1 r:core_node3 x:MissingSegmentRecoveryTest_shard1_replica_n1] o.a.s.r.ManagedResourceStorage Loaded null at path _rest_managed.json using ZooKeeperStorageIO:path=/configs/conf
   [junit4]   2> 1519312 INFO  (qtp907302256-29902) [n:127.0.0.1:54422_solr c:MissingSegmentRecoveryTest s:shard1 r:core_node3 x:MissingSegmentRecoveryTest_shard1_replica_n1] o.a.s.h.ReplicationHandler Commits will be reserved for 10000ms.
   [junit4]   2> 1519312 INFO  (qtp907302256-29902) [n:127.0.0.1:54422_solr c:MissingSegmentRecoveryTest s:shard1 r:core_node3 x:MissingSegmentRecoveryTest_shard1_replica_n1] o.a.s.u.UpdateLog Could not find max version in index or recent updates, using new clock 1621783864178376704
   [junit4]   2> 1519312 INFO  (searcherExecutor-9775-thread-1-processing-n:127.0.0.1:54422_solr x:MissingSegmentRecoveryTest_shard1_replica_n1 c:MissingSegmentRecoveryTest s:shard1 r:core_node3) [n:127.0.0.1:54422_solr c:MissingSegmentRecoveryTest s:shard1 r:core_node3 x:MissingSegmentRecoveryTest_shard1_replica_n1] o.a.s.c.SolrCore [MissingSegmentRecoveryTest_shard1_replica_n1] Registered new searcher Searcher@1421ad9b[MissingSegmentRecoveryTest_shard1_replica_n1] main{ExitableDirectoryReader(UninvertingDirectoryReader())}
   [junit4]   2> 1519327 INFO  (qtp907302256-29902) [n:127.0.0.1:54422_solr c:MissingSegmentRecoveryTest s:shard1 r:core_node3 x:MissingSegmentRecoveryTest_shard1_replica_n1] o.a.s.c.ZkShardTerms Successful update of terms at /collections/MissingSegmentRecoveryTest/terms/shard1 to Terms{values={core_node3=0}, version=0}
   [junit4]   2> 1519327 INFO  (qtp907302256-29902) [n:127.0.0.1:54422_solr c:MissingSegmentRecoveryTest s:shard1 r:core_node3 x:MissingSegmentRecoveryTest_shard1_replica_n1] o.a.s.c.ShardLeaderElectionContextBase make sure parent is created /collections/MissingSegmentRecoveryTest/leaders/shard1
   [junit4]   2> 1519327 INFO  (qtp1510713574-29903) [n:127.0.0.1:54421_solr c:MissingSegmentRecoveryTest s:shard1 r:core_node4 x:MissingSegmentRecoveryTest_shard1_replica_n2] o.a.s.u.UpdateHandler Using UpdateLog implementation: org.apache.solr.update.UpdateLog
   [junit4]   2> 1519327 INFO  (qtp1510713574-29903) [n:127.0.0.1:54421_solr c:MissingSegmentRecoveryTest s:shard1 r:core_node4 x:MissingSegmentRecoveryTest_shard1_replica_n2] o.a.s.u.UpdateLog Initializing UpdateLog: dataDir=null defaultSyncLevel=FLUSH numRecordsToKeep=100 maxNumLogsToKeep=10 numVersionBuckets=65536
   [junit4]   2> 1519327 INFO  (qtp907302256-29902) [n:127.0.0.1:54422_solr c:MissingSegmentRecoveryTest s:shard1 r:core_node3 x:MissingSegmentRecoveryTest_shard1_replica_n1] o.a.s.c.ShardLeaderElectionContext Waiting until we see more replicas up for shard shard1: total=2 found=1 timeoutin=9999ms
   [junit4]   2> 1519327 INFO  (qtp1510713574-29903) [n:127.0.0.1:54421_solr c:MissingSegmentRecoveryTest s:shard1 r:core_node4 x:MissingSegmentRecoveryTest_shard1_replica_n2] o.a.s.u.CommitTracker Hard AutoCommit: disabled
   [junit4]   2> 1519327 INFO  (qtp1510713574-29903) [n:127.0.0.1:54421_solr c:MissingSegmentRecoveryTest s:shard1 r:core_node4 x:MissingSegmentRecoveryTest_shard1_replica_n2] o.a.s.u.CommitTracker Soft AutoCommit: disabled
   [junit4]   2> 1519327 INFO  (qtp1510713574-29903) [n:127.0.0.1:54421_solr c:MissingSegmentRecoveryTest s:shard1 r:core_node4 x:MissingSegmentRecoveryTest_shard1_replica_n2] o.a.s.s.SolrIndexSearcher Opening [Searcher@7f7549a3[MissingSegmentRecoveryTest_shard1_replica_n2] main]
   [junit4]   2> 1519327 INFO  (qtp1510713574-29903) [n:127.0.0.1:54421_solr c:MissingSegmentRecoveryTest s:shard1 r:core_node4 x:MissingSegmentRecoveryTest_shard1_replica_n2] o.a.s.r.ManagedResourceStorage Configured ZooKeeperStorageIO with znodeBase: /configs/conf
   [junit4]   2> 1519327 INFO  (qtp1510713574-29903) [n:127.0.0.1:54421_solr c:MissingSegmentRecoveryTest s:shard1 r:core_node4 x:MissingSegmentRecoveryTest_shard1_replica_n2] o.a.s.r.ManagedResourceStorage Loaded null at path _rest_managed.json using ZooKeeperStorageIO:path=/configs/conf
   [junit4]   2> 1519327 INFO  (qtp1510713574-29903) [n:127.0.0.1:54421_solr c:MissingSegmentRecoveryTest s:shard1 r:core_node4 x:MissingSegmentRecoveryTest_shard1_replica_n2] o.a.s.h.ReplicationHandler Commits will be reserved for 10000ms.
   [junit4]   2> 1519327 INFO  (qtp1510713574-29903) [n:127.0.0.1:54421_solr c:MissingSegmentRecoveryTest s:shard1 r:core_node4 x:MissingSegmentRecoveryTest_shard1_replica_n2] o.a.s.u.UpdateLog Could not find max version in index or recent updates, using new clock 1621783864194105344
   [junit4]   2> 1519342 INFO  (searcherExecutor-9774-thread-1-processing-n:127.0.0.1:54421_solr x:MissingSegmentRecoveryTest_shard1_replica_n2 c:MissingSegmentRecoveryTest s:shard1 r:core_node4) [n:127.0.0.1:54421_solr c:MissingSegmentRecoveryTest s:shard1 r:core_node4 x:MissingSegmentRecoveryTest_shard1_replica_n2] o.a.s.c.SolrCore [MissingSegmentRecoveryTest_shard1_replica_n2] Registered new searcher Searcher@7f7549a3[MissingSegmentRecoveryTest_shard1_replica_n2] main{ExitableDirectoryReader(UninvertingDirectoryReader())}
   [junit4]   2> 1519342 INFO  (qtp1510713574-29903) [n:127.0.0.1:54421_solr c:MissingSegmentRecoveryTest s:shard1 r:core_node4 x:MissingSegmentRecoveryTest_shard1_replica_n2] o.a.s.c.ZkShardTerms Successful update of terms at /collections/MissingSegmentRecoveryTest/terms/shard1 to Terms{values={core_node3=0, core_node4=0}, version=1}
   [junit4]   2> 1519342 INFO  (qtp1510713574-29903) [n:127.0.0.1:54421_solr c:MissingSegmentRecoveryTest s:shard1 r:core_node4 x:MissingSegmentRecoveryTest_shard1_replica_n2] o.a.s.c.ShardLeaderElectionContextBase make sure parent is created /collections/MissingSegmentRecoveryTest/leaders/shard1
   [junit4]   2> 1519838 INFO  (qtp907302256-29902) [n:127.0.0.1:54422_solr c:MissingSegmentRecoveryTest s:shard1 r:core_node3 x:MissingSegmentRecoveryTest_shard1_replica_n1] o.a.s.c.ShardLeaderElectionContext Enough replicas found to continue.
   [junit4]   2> 1519838 INFO  (qtp907302256-29902) [n:127.0.0.1:54422_solr c:MissingSegmentRecoveryTest s:shard1 r:core_node3 x:MissingSegmentRecoveryTest_shard1_replica_n1] o.a.s.c.ShardLeaderElectionContext I may be the new leader - try and sync
   [junit4]   2> 1519838 INFO  (qtp907302256-29902) [n:127.0.0.1:54422_solr c:MissingSegmentRecoveryTest s:shard1 r:core_node3 x:MissingSegmentRecoveryTest_shard1_replica_n1] o.a.s.c.SyncStrategy Sync replicas to http://127.0.0.1:54422/solr/MissingSegmentRecoveryTest_shard1_replica_n1/
   [junit4]   2> 1519838 INFO  (qtp907302256-29902) [n:127.0.0.1:54422_solr c:MissingSegmentRecoveryTest s:shard1 r:core_node3 x:MissingSegmentRecoveryTest_shard1_replica_n1] o.a.s.u.PeerSync PeerSync: core=MissingSegmentRecoveryTest_shard1_replica_n1 url=http://127.0.0.1:54422/solr START replicas=[http://127.0.0.1:54421/solr/MissingSegmentRecoveryTest_shard1_replica_n2/] nUpdates=100
   [junit4]   2> 1519838 INFO  (qtp907302256-29902) [n:127.0.0.1:54422_solr c:MissingSegmentRecoveryTest s:shard1 r:core_node3 x:MissingSegmentRecoveryTest_shard1_replica_n1] o.a.s.u.PeerSync PeerSync: core=MissingSegmentRecoveryTest_shard1_replica_n1 url=http://127.0.0.1:54422/solr DONE.  We have no versions.  sync failed.
   [junit4]   2> 1519838 INFO  (qtp1510713574-29908) [n:127.0.0.1:54421_solr c:MissingSegmentRecoveryTest s:shard1 r:core_node4 x:MissingSegmentRecoveryTest_shard1_replica_n2] o.a.s.c.S.Request [MissingSegmentRecoveryTest_shard1_replica_n2]  webapp=/solr path=/get params={distrib=false&qt=/get&fingerprint=false&getVersions=100&wt=javabin&version=2} status=0 QTime=0
   [junit4]   2> 1519838 INFO  (qtp907302256-29902) [n:127.0.0.1:54422_solr c:MissingSegmentRecoveryTest s:shard1 r:core_node3 x:MissingSegmentRecoveryTest_shard1_replica_n1] o.a.s.c.SyncStrategy Leader's attempt to sync with shard failed, moving to the next candidate
   [junit4]   2> 1519838 INFO  (qtp907302256-29902) [n:127.0.0.1:54422_solr c:MissingSegmentRecoveryTest s:shard1 r:core_node3 x:MissingSegmentRecoveryTest_shard1_replica_n1] o.a.s.c.ShardLeaderElectionContext We failed sync, but we have no versions - we can't sync in that case - we were active before, so become leader anyway
   [junit4]   2> 1519838 INFO  (qtp907302256-29902) [n:127.0.0.1:54422_solr c:MissingSegmentRecoveryTest s:shard1 r:core_node3 x:MissingSegmentRecoveryTest_shard1_replica_n1] o.a.s.c.ShardLeaderElectionContextBase Creating leader registration node /collections/MissingSegmentRecoveryTest/leaders/shard1/leader after winning as /collections/MissingSegmentRecoveryTest/leader_elect/shard1/election/72141174074441734-core_node3-n_0000000000
   [junit4]   2> 1519838 INFO  (qtp907302256-29902) [n:127.0.0.1:54422_solr c:MissingSegmentRecoveryTest s:shard1 r:core_node3 x:MissingSegmentRecoveryTest_shard1_replica_n1] o.a.s.c.ShardLeaderElectionContext I am the new leader: http://127.0.0.1:54422/solr/MissingSegmentRecoveryTest_shard1_replica_n1/ shard1
   [junit4]   2> 1519961 INFO  (zkCallback-11278-thread-1) [    ] o.a.s.c.c.ZkStateReader A cluster state change: [WatchedEvent state:SyncConnected type:NodeDataChanged path:/collections/MissingSegmentRecoveryTest/state.json] for collection [MissingSegmentRecoveryTest] has occurred - updating... (live nodes size: [2])
   [junit4]   2> 1519961 INFO  (qtp907302256-29902) [n:127.0.0.1:54422_solr c:MissingSegmentRecoveryTest s:shard1 r:core_node3 x:MissingSegmentRecoveryTest_shard1_replica_n1] o.a.s.c.ZkController I am the leader, no recovery necessary
   [junit4]   2> 1519961 INFO  (qtp907302256-29902) [n:127.0.0.1:54422_solr c:MissingSegmentRecoveryTest s:shard1 r:core_node3 x:MissingSegmentRecoveryTest_shard1_replica_n1] o.a.s.s.HttpSolrCall [admin] webapp=null path=/admin/cores params={qt=/admin/cores&coreNodeName=core_node3&collection.configName=conf&newCollection=true&name=MissingSegmentRecoveryTest_shard1_replica_n1&action=CREATE&numShards=1&collection=MissingSegmentRecoveryTest&shard=shard1&wt=javabin&version=2&replicaType=NRT} status=0 QTime=1819
   [junit4]   2> 1520089 INFO  (zkCallback-11278-thread-2) [    ] o.a.s.c.c.ZkStateReader A cluster state change: [WatchedEvent state:SyncConnected type:NodeDataChanged path:/collections/MissingSegmentRecoveryTest/state.json] for collection [MissingSegmentRecoveryTest] has occurred - updating... (live nodes size: [2])
   [junit4]   2> 1520089 INFO  (zkCallback-11278-thread-1) [    ] o.a.s.c.c.ZkStateReader A cluster state change: [WatchedEvent state:SyncConnected type:NodeDataChanged path:/collections/MissingSegmentRecoveryTest/state.json] for collection [MissingSegmentRecoveryTest] has occurred - updating... (live nodes size: [2])
   [junit4]   2> 1520349 INFO  (qtp1510713574-29903) [n:127.0.0.1:54421_solr c:MissingSegmentRecoveryTest s:shard1 r:core_node4 x:MissingSegmentRecoveryTest_shard1_replica_n2] o.a.s.s.HttpSolrCall [admin] webapp=null path=/admin/cores params={qt=/admin/cores&coreNodeName=core_node4&collection.configName=conf&newCollection=true&name=MissingSegmentRecoveryTest_shard1_replica_n2&action=CREATE&numShards=1&collection=MissingSegmentRecoveryTest&shard=shard1&wt=javabin&version=2&replicaType=NRT} status=0 QTime=2192
   [junit4]   2> 1520352 INFO  (qtp1510713574-29900) [n:127.0.0.1:54421_solr    ] o.a.s.h.a.CollectionsHandler Wait for new collection to be active for at most 45 seconds. Check all shard replicas
   [junit4]   2> 1520484 INFO  (zkCallback-11294-thread-1) [    ] o.a.s.c.c.ZkStateReader A cluster state change: [WatchedEvent state:SyncConnected type:NodeDataChanged path:/collections/MissingSegmentRecoveryTest/state.json] for collection [MissingSegmentRecoveryTest] has occurred - updating... (live nodes size: [2])
   [junit4]   2> 1520485 INFO  (zkCallback-11278-thread-3) [    ] o.a.s.c.c.ZkStateReader A cluster state change: [WatchedEvent state:SyncConnected type:NodeDataChanged path:/collections/MissingSegmentRecoveryTest/state.json] for collection [MissingSegmentRecoveryTest] has occurred - updating... (live nodes size: [2])
   [junit4]   2> 1520485 INFO  (zkCallback-11278-thread-1) [    ] o.a.s.c.c.ZkStateReader A cluster state change: [WatchedEvent state:SyncConnected type:NodeDataChanged path:/collections/MissingSegmentRecoveryTest/state.json] for collection [MissingSegmentRecoveryTest] has occurred - updating... (live nodes size: [2])
   [junit4]   2> 1520489 INFO  (qtp1510713574-29900) [n:127.0.0.1:54421_solr    ] o.a.s.s.HttpSolrCall [admin] webapp=null path=/admin/collections params={collection.configName=conf&maxShardsPerNode=1&name=MissingSegmentRecoveryTest&nrtReplicas=2&action=CREATE&numShards=1&wt=javabin&version=2} status=0 QTime=2695
   [junit4]   2> 1520491 INFO  (TEST-MissingSegmentRecoveryTest.testLeaderRecovery-seed#[657A612AB85F5D26]) [    ] o.a.s.c.SolrCloudTestCase active replica count: 2 expected replica count: 2
   [junit4]   2> 1520545 INFO  (zkCallback-11294-thread-2) [    ] o.a.s.c.c.ZkStateReader A cluster state change: [WatchedEvent state:SyncConnected type:NodeDataChanged path:/collections/MissingSegmentRecoveryTest/state.json] for collection [MissingSegmentRecoveryTest] has occurred - updating... (live nodes size: [2])
   [junit4]   2> 1520545 INFO  (qtp907302256-29904) [n:127.0.0.1:54422_solr c:MissingSegmentRecoveryTest s:shard1 r:core_node3 x:MissingSegmentRecoveryTest_shard1_replica_n1] o.a.s.c.ZkShardTerms Successful update of terms at /collections/MissingSegmentRecoveryTest/terms/shard1 to Terms{values={core_node3=1, core_node4=1}, version=2}
   [junit4]   2> 1520638 INFO  (qtp1510713574-29901) [n:127.0.0.1:54421_solr c:MissingSegmentRecoveryTest s:shard1 r:core_node4 x:MissingSegmentRecoveryTest_shard1_replica_n2] o.a.s.u.p.LogUpdateProcessorFactory [MissingSegmentRecoveryTest_shard1_replica_n2]  webapp=/solr path=/update params={update.distrib=FROMLEADER&distrib.from=http://127.0.0.1:54422/solr/MissingSegmentRecoveryTest_shard1_replica_n1/&wt=javabin&version=2}{add=[0 (1621783865471270912), 1 (1621783865471270913), 2 (1621783865471270914), 3 (1621783865471270915), 4 (1621783865471270916), 5 (1621783865471270917), 6 (1621783865471270918), 7 (1621783865471270919), 8 (1621783865471270920), 9 (1621783865471270921)]} 0 2
   [junit4]   2> 1520638 INFO  (qtp907302256-29904) [n:127.0.0.1:54422_solr c:MissingSegmentRecoveryTest s:shard1 r:core_node3 x:MissingSegmentRecoveryTest_shard1_replica_n1] o.a.s.u.p.LogUpdateProcessorFactory [MissingSegmentRecoveryTest_shard1_replica_n1]  webapp=/solr path=/update params={wt=javabin&version=2}{add=[0 (1621783865471270912), 1 (1621783865471270913), 2 (1621783865471270914), 3 (1621783865471270915), 4 (1621783865471270916), 5 (1621783865471270917), 6 (1621783865471270918), 7 (1621783865471270919), 8 (1621783865471270920), 9 (1621783865471270921)]} 0 89
   [junit4]   2> 1520638 INFO  (qtp907302256-29907) [n:127.0.0.1:54422_solr c:MissingSegmentRecoveryTest s:shard1 r:core_node3 x:MissingSegmentRecoveryTest_shard1_replica_n1] o.a.s.u.DirectUpdateHandler2 start commit{_version_=1621783865568788480,optimize=false,openSearcher=true,waitSearcher=true,expungeDeletes=false,softCommit=false,prepareCommit=false}
   [junit4]   2> 1520638 INFO  (qtp907302256-29907) [n:127.0.0.1:54422_solr c:MissingSegmentRecoveryTest s:shard1 r:core_node3 x:MissingSegmentRecoveryTest_shard1_replica_n1] o.a.s.u.SolrIndexWriter Calling setCommitData with IW:org.apache.solr.update.SolrIndexWriter@4baef31 commitCommandVersion:1621783865568788480
   [junit4]   2> 1520638 INFO  (qtp1510713574-29908) [n:127.0.0.1:54421_solr c:MissingSegmentRecoveryTest s:shard1 r:core_node4 x:MissingSegmentRecoveryTest_shard1_replica_n2] o.a.s.u.DirectUpdateHandler2 start commit{_version_=1621783865568788480,optimize=false,openSearcher=true,waitSearcher=true,expungeDeletes=false,softCommit=false,prepareCommit=false}
   [junit4]   2> 1520638 INFO  (qtp1510713574-29908) [n:127.0.0.1:54421_solr c:MissingSegmentRecoveryTest s:shard1 r:core_node4 x:MissingSegmentRecoveryTest_shard1_replica_n2] o.a.s.u.SolrIndexWriter Calling setCommitData with IW:org.apache.solr.update.SolrIndexWriter@d32a6f5 commitCommandVersion:1621783865568788480
   [junit4]   2> 1521411 INFO  (qtp1510713574-29908) [n:127.0.0.1:54421_solr c:MissingSegmentRecoveryTest s:shard1 r:core_node4 x:MissingSegmentRecoveryTest_shard1_replica_n2] o.a.s.s.SolrIndexSearcher Opening [Searcher@18a9b376[MissingSegmentRecoveryTest_shard1_replica_n2] main]
   [junit4]   2> 1521411 INFO  (qtp907302256-29907) [n:127.0.0.1:54422_solr c:MissingSegmentRecoveryTest s:shard1 r:core_node3 x:MissingSegmentRecoveryTest_shard1_replica_n1] o.a.s.s.SolrIndexSearcher Opening [Searcher@7bd3b508[MissingSegmentRecoveryTest_shard1_replica_n1] main]
   [junit4]   2> 1521411 INFO  (qtp907302256-29907) [n:127.0.0.1:54422_solr c:MissingSegmentRecoveryTest s:shard1 r:core_node3 x:MissingSegmentRecoveryTest_shard1_replica_n1] o.a.s.u.DirectUpdateHandler2 end_commit_flush
   [junit4]   2> 1521442 INFO  (searcherExecutor-9774-thread-1-processing-n:127.0.0.1:54421_solr x:MissingSegmentRecoveryTest_shard1_replica_n2 c:MissingSegmentRecoveryTest s:shard1 r:core_node4) [n:127.0.0.1:54421_solr c:MissingSegmentRecoveryTest s:shard1 r:core_node4 x:MissingSegmentRecoveryTest_shard1_replica_n2] o.a.s.c.SolrCore [MissingSegmentRecoveryTest_shard1_replica_n2] Registered new searcher Searcher@18a9b376[MissingSegmentRecoveryTest_shard1_replica_n2] main{ExitableDirectoryReader(UninvertingDirectoryReader(Uninverting(_0(8.0.0):C10:[diagnostics={os=Windows 10, java.vendor=Oracle Corporation, java.version=11, java.vm.version=11+28, lucene.version=8.0.0, os.arch=amd64, java.runtime.version=11+28, source=flush, os.version=10.0, timestamp=1546653619385}]:[attributes={Lucene50StoredFieldsFormat.mode=BEST_SPEED}])))}
   [junit4]   2> 1521442 INFO  (qtp1510713574-29908) [n:127.0.0.1:54421_solr c:MissingSegmentRecoveryTest s:shard1 r:core_node4 x:MissingSegmentRecoveryTest_shard1_replica_n2] o.a.s.u.DirectUpdateHandler2 end_commit_flush
   [junit4]   2> 1521442 INFO  (qtp1510713574-29908) [n:127.0.0.1:54421_solr c:MissingSegmentRecoveryTest s:shard1 r:core_node4 x:MissingSegmentRecoveryTest_shard1_replica_n2] o.a.s.u.p.LogUpdateProcessorFactory [MissingSegmentRecoveryTest_shard1_replica_n2]  webapp=/solr path=/update params={update.distrib=FROMLEADER&waitSearcher=true&openSearcher=true&commit=true&softCommit=false&distrib.from=http://127.0.0.1:54422/solr/MissingSegmentRecoveryTest_shard1_replica_n1/&commit_end_point=replicas&wt=javabin&version=2&expungeDeletes=false}{commit=} 0 803
   [junit4]   2> 1521442 INFO  (searcherExecutor-9775-thread-1-processing-n:127.0.0.1:54422_solr x:MissingSegmentRecoveryTest_shard1_replica_n1 c:MissingSegmentRecoveryTest s:shard1 r:core_node3) [n:127.0.0.1:54422_solr c:MissingSegmentRecoveryTest s:shard1 r:core_node3 x:MissingSegmentRecoveryTest_shard1_replica_n1] o.a.s.c.SolrCore [MissingSegmentRecoveryTest_shard1_replica_n1] Registered new searcher Searcher@7bd3b508[MissingSegmentRecoveryTest_shard1_replica_n1] main{ExitableDirectoryReader(UninvertingDirectoryReader(Uninverting(_0(8.0.0):C10:[diagnostics={os=Windows 10, java.vendor=Oracle Corporation, java.version=11, java.vm.version=11+28, lucene.version=8.0.0, os.arch=amd64, java.runtime.version=11+28, source=flush, os.version=10.0, timestamp=1546653619385}]:[attributes={Lucene50StoredFieldsFormat.mode=BEST_SPEED}])))}
   [junit4]   2> 1521442 INFO  (qtp907302256-29907) [n:127.0.0.1:54422_solr c:MissingSegmentRecoveryTest s:shard1 r:core_node3 x:MissingSegmentRecoveryTest_shard1_replica_n1] o.a.s.u.p.LogUpdateProcessorFactory [MissingSegmentRecoveryTest_shard1_replica_n1]  webapp=/solr path=/update params={_stateVer_=MissingSegmentRecoveryTest:6&waitSearcher=true&commit=true&softCommit=false&wt=javabin&version=2}{commit=} 0 806
   [junit4]   2> 1521442 INFO  (TEST-MissingSegmentRecoveryTest.testLeaderRecovery-seed#[657A612AB85F5D26]) [    ] o.a.s.c.CoreContainer Shutting down CoreContainer instance=2072731965
   [junit4]   2> 1521442 INFO  (TEST-MissingSegmentRecoveryTest.testLeaderRecovery-seed#[657A612AB85F5D26]) [    ] o.a.s.c.ZkController Remove node as live in ZooKeeper:/live_nodes/127.0.0.1:54421_solr
   [junit4]   2> 1521458 INFO  (TEST-MissingSegmentRecoveryTest.testLeaderRecovery-seed#[657A612AB85F5D26]) [    ] o.a.s.c.CoreContainer Publish this node as DOWN...
   [junit4]   2> 1521458 INFO  (TEST-MissingSegmentRecoveryTest.testLeaderRecovery-seed#[657A612AB85F5D26]) [    ] o.a.s.c.ZkController Publish node=127.0.0.1:54421_solr as DOWN
   [junit4]   2> 1521567 INFO  (coreCloseExecutor-9784-thread-1) [n:127.0.0.1:54421_solr c:MissingSegmentRecoveryTest s:shard1 r:core_node4 x:MissingSegmentRecoveryTest_shard1_replica_n2] o.a.s.c.SolrCore [MissingSegmentRecoveryTest_shard1_replica_n2]  CLOSING SolrCore org.apache.solr.core.SolrCore@26c5c31c
   [junit4]   2> 1521567 INFO  (coreCloseExecutor-9784-thread-1) [n:127.0.0.1:54421_solr c:MissingSegmentRecoveryTest s:shard1 r:core_node4 x:MissingSegmentRecoveryTest_shard1_replica_n2] o.a.s.m.SolrMetricManager Closing metric reporters for registry=solr.core.MissingSegmentRecoveryTest.shard1.replica_n2, tag=26c5c31c
   [junit4]   2> 1521567 INFO  (coreCloseExecutor-9784-thread-1) [n:127.0.0.1:54421_solr c:MissingSegmentRecoveryTest s:shard1 r:core_node4 x:MissingSegmentRecoveryTest_shard1_replica_n2] o.a.s.m.r.SolrJmxReporter Closing reporter [org.apache.solr.metrics.reporters.SolrJmxReporter@3a3821c9: rootName = solr_54421, domain = solr.core.MissingSegmentRecoveryTest.shard1.replica_n2, service url = null, agent id = null] for registry solr.core.MissingSegmentRecoveryTest.shard1.replica_n2 / com.codahale.metrics.MetricRegistry@49db2d70
   [junit4]   2> 1521830 INFO  (coreCloseExecutor-9784-thread-1) [n:127.0.0.1:54421_solr c:MissingSegmentRecoveryTest s:shard1 r:core_node4 x:MissingSegmentRecoveryTest_shard1_replica_n2] o.a.s.m.SolrMetricManager Closing metric reporters for registry=solr.collection.MissingSegmentRecoveryTest.shard1.leader, tag=26c5c31c
   [junit4]   2> 1521830 INFO  (zkCallback-11294-thread-1) [    ] o.a.s.c.c.ZkStateReader A cluster state change: [WatchedEvent state:SyncConnected type:NodeDataChanged path:/collections/MissingSegmentRecoveryTest/state.json] for collection [MissingSegmentRecoveryTest] has occurred - updating... (live nodes size: [2])
   [junit4]   2> 1521830 INFO  (zkCallback-11294-thread-2) [    ] o.a.s.c.c.ZkStateReader A cluster state change: [WatchedEvent state:SyncConnected type:NodeDataChanged path:/collections/MissingSegmentRecoveryTest/state.json] for collection [MissingSegmentRecoveryTest] has occurred - updating... (live nodes size: [2])
   [junit4]   2> 1521830 INFO  (zkCallback-11278-thread-2) [    ] o.a.s.c.c.ZkStateReader A cluster state change: [WatchedEvent state:SyncConnected type:NodeDataChanged path:/collections/MissingSegmentRecoveryTest/state.json] for collection [MissingSegmentRecoveryTest] has occurred - updating... (live nodes size: [2])
   [junit4]   2> 1521830 INFO  (zkCallback-11278-thread-1) [    ] o.a.s.c.c.ZkStateReader A cluster state change: [WatchedEvent state:SyncConnected type:NodeDataChanged path:/collections/MissingSegmentRecoveryTest/state.json] for collection [MissingSegmentRecoveryTest] has occurred - updating... (live nodes size: [2])
   [junit4]   2> 1521845 INFO  (OverseerCollectionConfigSetProcessor-72141174074441734-127.0.0.1:54422_solr-n_0000000000) [n:127.0.0.1:54422_solr    ] o.a.s.c.OverseerTaskQueue Response ZK path: /overseer/collection-queue-work/qnr-0000000000 doesn't exist.  Requestor may have disconnected from ZooKeeper
   [junit4]   2> 1522146 INFO  (TEST-MissingSegmentRecoveryTest.testLeaderRecovery-seed#[657A612AB85F5D26]) [    ] o.a.s.m.SolrMetricManager Closing metric reporters for registry=solr.node, tag=null
   [junit4]   2> 1522146 INFO  (TEST-MissingSegmentRecoveryTest.testLeaderRecovery-seed#[657A612AB85F5D26]) [    ] o.a.s.m.r.SolrJmxReporter Closing reporter [org.apache.solr.metrics.reporters.SolrJmxReporter@78625acb: rootName = solr_54421, domain = solr.node, service url = null, agent id = null] for registry solr.node / com.codahale.metrics.MetricRegistry@5e3a658b
   [junit4]   2> 1522155 INFO  (TEST-MissingSegmentRecoveryTest.testLeaderRecovery-seed#[657A612AB85F5D26]) [    ] o.a.s.m.SolrMetricManager Closing metric reporters for registry=solr.jvm, tag=null
   [junit4]   2> 1522155 INFO  (TEST-MissingSegmentRecoveryTest.testLeaderRecovery-seed#[657A612AB85F5D26]) [    ] o.a.s.m.r.SolrJmxReporter Closing reporter [org.apache.solr.metrics.reporters.SolrJmxReporter@75db1729: rootName = solr_54421, domain = solr.jvm, service url = null, agent id = null] for registry solr.jvm / com.codahale.metrics.MetricRegistry@79ba2db8
   [junit4]   2> 1522158 INFO  (TEST-MissingSegmentRecoveryTest.testLeaderRecovery-seed#[657A612AB85F5D26]) [    ] o.a.s.m.SolrMetricManager Closing metric reporters for registry=solr.jetty, tag=null
   [junit4]   2> 1522158 INFO  (TEST-MissingSegmentRecoveryTest.testLeaderRecovery-seed#[657A612AB85F5D26]) [    ] o.a.s.m.r.SolrJmxReporter Closing reporter [org.apache.solr.metrics.reporters.SolrJmxReporter@5241930e: rootName = solr_54421, domain = solr.jetty, service url = null, agent id = null] for registry solr.jetty / com.codahale.metrics.MetricRegistry@623fe85e
   [junit4]   2> 1522158 INFO  (TEST-MissingSegmentRecoveryTest.testLeaderRecovery-seed#[657A612AB85F5D26]) [    ] o.a.s.m.SolrMetricManager Closing metric reporters for registry=solr.cluster, tag=null
   [junit4]   2> 1522166 INFO  (zkCallback-11301-thread-1) [    ] o.a.s.c.c.ZkStateReader Updated live nodes from ZooKeeper... (2) -> (1)
   [junit4]   2> 1522166 INFO  (zkCallback-11307-thread-1) [    ] o.a.s.c.c.ZkStateReader Updated live nodes from ZooKeeper... (2) -> (1)
   [junit4]   2> 1522166 INFO  (zkCallback-11285-thread-1) [    ] o.a.s.c.c.ZkStateReader Updated live nodes from ZooKeeper... (2) -> (1)
   [junit4]   2> 1522166 INFO  (zkCallback-11278-thread-1) [    ] o.a.s.c.c.ZkStateReader Updated live nodes from ZooKeeper... (2) -> (1)
   [junit4]   1> Done close org.apache.solr.common.util.ExecutorUtil$MDCAwareThreadPoolExecutor@6ff585e0[Terminated, pool size = 0, active threads = 0, queued tasks = 0, completed tasks = 1]
   [junit4]   1> Done close org.apache.solr.common.util.ExecutorUtil$MDCAwareThreadPoolExecutor@1fb6f62b[Terminated, pool size = 0, active threads = 0, queued tasks = 0, completed tasks = 1]
   [junit4]   2> 1522463 INFO  (TEST-MissingSegmentRecoveryTest.testLeaderRecovery-seed#[657A612AB85F5D26]) [    ] o.e.j.s.AbstractConnector Stopped ServerConnector@2b3cccf8{HTTP/1.1,[http/1.1, h2c]}{127.0.0.1:0}
   [junit4]   2> 1522494 INFO  (TEST-MissingSegmentRecoveryTest.testLeaderRecovery-seed#[657A612AB85F5D26]) [    ] o.e.j.s.h.ContextHandler Stopped o.e.j.s.ServletContextHandler@25231ff8{/solr,null,UNAVAILABLE}
   [junit4]   2> 1522494 INFO  (TEST-MissingSegmentRecoveryTest.testLeaderRecovery-seed#[657A612AB85F5D26]) [    ] o.e.j.s.session node0 Stopped scavenging
   [junit4]   2> 1522494 INFO  (TEST-MissingSegmentRecoveryTest.testLeaderRecovery-seed#[657A612AB85F5D26]) [    ] o.a.s.c.s.e.JettySolrRunner Start Jetty (original configured port=0)
   [junit4]   2> 1522494 WARN  (TEST-MissingSegmentRecoveryTest.testLeaderRecovery-seed#[657A612AB85F5D26]) [    ] o.e.j.s.AbstractConnector Ignoring deprecated socket close linger time
   [junit4]   2> 1522494 INFO  (TEST-MissingSegmentRecoveryTest.testLeaderRecovery-seed#[657A612AB85F5D26]) [    ] o.a.s.c.s.e.JettySolrRunner Trying to start Jetty on port 54421 try number 1 ...
   [junit4]   2> 1522494 INFO  (TEST-MissingSegmentRecoveryTest.testLeaderRecovery-seed#[657A612AB85F5D26]) [    ] o.e.j.s.Server jetty-9.4.14.v20181114; built: 2018-11-14T21:20:31.478Z; git: c4550056e785fb5665914545889f21dc136ad9e6; jvm 11+28
   [junit4]   2> 1522494 INFO  (TEST-MissingSegmentRecoveryTest.testLeaderRecovery-seed#[657A612AB85F5D26]) [    ] o.e.j.s.session DefaultSessionIdManager workerName=node0
   [junit4]   2> 1522494 INFO  (TEST-MissingSegmentRecoveryTest.testLeaderRecovery-seed#[657A612AB85F5D26]) [    ] o.e.j.s.session No SessionScavenger set, using defaults
   [junit4]   2> 1522494 INFO  (TEST-MissingSegmentRecoveryTest.testLeaderRecovery-seed#[657A612AB85F5D26]) [    ] o.e.j.s.session node0 Scavenging every 600000ms
   [junit4]   2> 1522494 INFO  (TEST-MissingSegmentRecoveryTest.testLeaderRecovery-seed#[657A612AB85F5D26]) [    ] o.e.j.s.h.ContextHandler Started o.e.j.s.ServletContextHandler@ee93d77{/solr,null,AVAILABLE}
   [junit4]   2> 1522494 INFO  (TEST-MissingSegmentRecoveryTest.testLeaderRecovery-seed#[657A612AB85F5D26]) [    ] o.e.j.s.AbstractConnector Started ServerConnector@1ca045fd{HTTP/1.1,[http/1.1, h2c]}{127.0.0.1:54421}
   [junit4]   2> 1522494 INFO  (TEST-MissingSegmentRecoveryTest.testLeaderRecovery-seed#[657A612AB85F5D26]) [    ] o.e.j.s.Server Started @1507262ms
   [junit4]   2> 1522494 INFO  (TEST-MissingSegmentRecoveryTest.testLeaderRecovery-seed#[657A612AB85F5D26]) [    ] o.a.s.c.s.e.JettySolrRunner Jetty properties: {hostContext=/solr, hostPort=54421}
   [junit4]   2> 1522494 ERROR (TEST-MissingSegmentRecoveryTest.testLeaderRecovery-seed#[657A612AB85F5D26]) [    ] o.a.s.u.StartupLoggingUtils Missing Java Option solr.log.dir. Logging may be missing or incomplete.
   [junit4]   2> 1522494 INFO  (TEST-MissingSegmentRecoveryTest.testLeaderRecovery-seed#[657A612AB85F5D26]) [    ] o.a.s.s.SolrDispatchFilter Using logger factory org.apache.logging.slf4j.Log4jLoggerFactory
   [junit4]   2> 1522494 INFO  (TEST-MissingSegmentRecoveryTest.testLeaderRecovery-seed#[657A612AB85F5D26]) [    ] o.a.s.s.SolrDispatchFilter  ___      _       Welcome to Apache Solr? version 8.0.0
   [junit4]   2> 1522494 INFO  (TEST-MissingSegmentRecoveryTest.testLeaderRecovery-seed#[657A612AB85F5D26]) [    ] o.a.s.s.SolrDispatchFilter / __| ___| |_ _   Starting in cloud mode on port null
   [junit4]   2> 1522494 INFO  (TEST-MissingSegmentRecoveryTest.testLeaderRecovery-seed#[657A612AB85F5D26]) [    ] o.a.s.s.SolrDispatchFilter \__ \/ _ \ | '_|  Install dir: null
   [junit4]   2> 1522494 INFO  (TEST-MissingSegmentRecoveryTest.testLeaderRecovery-seed#[657A612AB85F5D26]) [    ] o.a.s.s.SolrDispatchFilter |___/\___/_|_|    Start time: 2019-01-05T02:00:21.211224800Z
   [junit4]   2> 1523113 INFO  (zkConnectionManagerCallback-11313-thread-1) [    ] o.a.s.c.c.ConnectionManager zkClient has connected
   [junit4]   2> 1523113 INFO  (TEST-MissingSegmentRecoveryTest.testLeaderRecovery-seed#[657A612AB85F5D26]) [    ] o.a.s.s.SolrDispatchFilter solr.xml found in ZooKeeper. Loading...
   [junit4]   2> 1523485 WARN  (TEST-MissingSegmentRecoveryTest.testLeaderRecovery-seed#[657A612AB85F5D26]) [    ] o.e.j.u.s.S.config No Client EndPointIdentificationAlgorithm configured for SslContextFactory@17599011[provider=null,keyStore=null,trustStore=null]
   [junit4]   2> 1523577 WARN  (TEST-MissingSegmentRecoveryTest.testLeaderRecovery-seed#[657A612AB85F5D26]) [    ] o.e.j.u.s.S.config No Client EndPointIdentificationAlgorithm configured for SslContextFactory@31b1ea5d[provider=null,keyStore=null,trustStore=null]
   [junit4]   2> 1523577 INFO  (TEST-MissingSegmentRecoveryTest.testLeaderRecovery-seed#[657A612AB85F5D

[...truncated too long message...]

 [junit4]   2> 43343 DEBUG (simCloudManagerPool-226-thread-6) [    ] o.a.s.c.a.OverseerTriggerThread Refreshing /autoscaling.json with znode version 6
   [junit4]   2> 43344 DEBUG (Simulated OverseerAutoScalingTriggerThread) [    ] o.a.s.c.a.OverseerTriggerThread Processed trigger updates upto znodeVersion 6
   [junit4]   2> 43344 INFO  (Simulated OverseerAutoScalingTriggerThread) [    ] o.a.s.c.a.s.TestSimTriggerIntegration TestTriggerAction init
   [junit4]   2> 43344 DEBUG (Simulated OverseerAutoScalingTriggerThread) [    ] o.a.s.c.a.NodeLostTrigger NodeLostTrigger node_lost_trigger2 - Initial livenodes: [127.0.0.1:10025_solr, 127.0.0.1:10026_solr, 127.0.0.1:10027_solr]
   [junit4]   2> 43344 DEBUG (Simulated OverseerAutoScalingTriggerThread) [    ] o.a.s.c.a.OverseerTriggerThread -- cleaning old nodeLost / nodeAdded markers
   [junit4]   2> 43344 DEBUG (ScheduledTrigger-227-thread-2) [    ] o.a.s.c.a.NodeLostTrigger Running NodeLostTrigger: node_lost_trigger2 with currently live nodes: 2 and last live nodes: 3
   [junit4]   2> 43344 DEBUG (TEST-TestSimTriggerIntegration.testTriggerThrottling-seed#[657A612AB85F5D26]) [    ] o.a.s.c.a.s.SimClusterStateProvider  -- created marker: /autoscaling/nodeLost/127.0.0.1:10027_solr
   [junit4]   2> 43344 DEBUG (ScheduledTrigger-227-thread-2) [    ] o.a.s.c.a.NodeLostTrigger Tracking lost node: 127.0.0.1:10027_solr
   [junit4]   2> 43344 DEBUG (Simulated OverseerAutoScalingTriggerThread) [    ] o.a.s.c.a.OverseerTriggerThread Current znodeVersion 6, lastZnodeVersion 6
   [junit4]   2> 43344 DEBUG (ScheduledTrigger-227-thread-2) [    ] o.a.s.c.a.NodeLostTrigger NodeLostTrigger firing registered processor for lost nodes: [127.0.0.1:10027_solr]
   [junit4]   2> 43344 DEBUG (ScheduledTrigger-227-thread-2) [    ] o.a.s.c.a.ScheduledTriggers ++++++++ Cooldown inactive - processing event: {
   [junit4]   2>   "id":"48aa4696ef8d8T8t1ylmyrqpwnankqio7p9r4gp",
   [junit4]   2>   "source":"node_lost_trigger2",
   [junit4]   2>   "eventTime":1278338654992600,
   [junit4]   2>   "eventType":"NODELOST",
   [junit4]   2>   "properties":{
   [junit4]   2>     "eventTimes":[1278338654992600],
   [junit4]   2>     "preferredOperation":"movereplica",
   [junit4]   2>     "nodeNames":["127.0.0.1:10027_solr"]}}
   [junit4]   2> 43344 DEBUG (ScheduledTrigger-227-thread-2) [    ] o.a.s.c.a.ScheduledTriggers Pausing all triggers: [node_lost_trigger2, .auto_add_replicas, node_added_trigger2, node_lost_trigger1, node_added_trigger1]
   [junit4]   2> 43345 INFO  (Simulated OverseerAutoScalingTriggerThread) [    ] o.a.s.c.a.OverseerTriggerThread OverseerTriggerThread woken up but we are closed, exiting.
   [junit4]   2> 43345 DEBUG (TEST-TestSimTriggerIntegration.testTriggerThrottling-seed#[657A612AB85F5D26]) [    ] o.a.s.c.a.ScheduledTriggers Shutting down scheduled thread pool executor now
   [junit4]   2> 43345 DEBUG (TEST-TestSimTriggerIntegration.testTriggerThrottling-seed#[657A612AB85F5D26]) [    ] o.a.s.c.a.ScheduledTriggers Shutting down action executor now
   [junit4]   2> 43345 WARN  (ScheduledTrigger-227-thread-2) [    ] o.a.s.c.a.SystemLogListener Exception sending event. Collection: .system, event: {
   [junit4]   2>   "id":"48aa4696ef8d8T8t1ylmyrqpwnankqio7p9r4gp",
   [junit4]   2>   "source":"node_lost_trigger2",
   [junit4]   2>   "eventTime":1278338654992600,
   [junit4]   2>   "eventType":"NODELOST",
   [junit4]   2>   "properties":{
   [junit4]   2>     "eventTimes":[1278338654992600],
   [junit4]   2>     "preferredOperation":"movereplica",
   [junit4]   2>     "_enqueue_time_":1278338666312600,
   [junit4]   2>     "nodeNames":["127.0.0.1:10027_solr"]}}, exception: java.io.IOException: already closed
   [junit4]   2> 43345 DEBUG (TEST-TestSimTriggerIntegration.testTriggerThrottling-seed#[657A612AB85F5D26]) [    ] o.a.s.c.a.ScheduledTriggers Awaiting termination for action executor
   [junit4]   2> 43346 DEBUG (TEST-TestSimTriggerIntegration.testTriggerThrottling-seed#[657A612AB85F5D26]) [    ] o.a.s.c.a.ScheduledTriggers Awaiting termination for scheduled thread pool executor
   [junit4]   2> 43346 WARN  (ScheduledTrigger-227-thread-2) [    ] o.a.s.c.a.SystemLogListener Exception sending event. Collection: .system, event: {
   [junit4]   2>   "id":"48aa4696ef8d8T8t1ylmyrqpwnankqio7p9r4gp",
   [junit4]   2>   "source":"node_lost_trigger2",
   [junit4]   2>   "eventTime":1278338654992600,
   [junit4]   2>   "eventType":"NODELOST",
   [junit4]   2>   "properties":{
   [junit4]   2>     "eventTimes":[1278338654992600],
   [junit4]   2>     "preferredOperation":"movereplica",
   [junit4]   2>     "_enqueue_time_":1278338666312600,
   [junit4]   2>     "nodeNames":["127.0.0.1:10027_solr"]}}, exception: java.io.IOException: already closed
   [junit4]   2> 43346 WARN  (ScheduledTrigger-227-thread-2) [    ] o.a.s.c.a.ScheduledTriggers Ignoring autoscaling event {
   [junit4]   2>   "id":"48aa4696ef8d8T8t1ylmyrqpwnankqio7p9r4gp",
   [junit4]   2>   "source":"node_lost_trigger2",
   [junit4]   2>   "eventTime":1278338654992600,
   [junit4]   2>   "eventType":"NODELOST",
   [junit4]   2>   "properties":{
   [junit4]   2>     "eventTimes":[1278338654992600],
   [junit4]   2>     "preferredOperation":"movereplica",
   [junit4]   2>     "_enqueue_time_":1278338666312600,
   [junit4]   2>     "nodeNames":["127.0.0.1:10027_solr"]}} from trigger org.apache.solr.cloud.autoscaling.NodeLostTrigger@161b5b6d because the executor has already been closed
   [junit4]   2> 43346 DEBUG (ScheduledTrigger-227-thread-2) [    ] o.a.s.c.a.NodeLostTrigger NodeLostTrigger processor for lost nodes: [127.0.0.1:10027_solr] is not ready, will try later
   [junit4]   2> 43346 DEBUG (TEST-TestSimTriggerIntegration.testTriggerThrottling-seed#[657A612AB85F5D26]) [    ] o.a.s.c.a.ScheduledTriggers ScheduledTriggers closed completely
   [junit4]   2> 43346 DEBUG (TEST-TestSimTriggerIntegration.testTriggerThrottling-seed#[657A612AB85F5D26]) [    ] o.a.s.c.a.OverseerTriggerThread OverseerTriggerThread has been closed explicitly
   [junit4]   2> 43347 INFO  (TEST-TestSimTriggerIntegration.testTriggerThrottling-seed#[657A612AB85F5D26]) [    ] o.a.s.SolrTestCaseJ4 ###Ending testTriggerThrottling
   [junit4] OK      0.11s J0 | TestSimTriggerIntegration.testTriggerThrottling
   [junit4]   2> NOTE: leaving temporary files on disk at: C:\Users\jenkins\workspace\Lucene-Solr-master-Windows\solr\build\solr-core\test\J0\temp\solr.cloud.autoscaling.sim.TestSimTriggerIntegration_657A612AB85F5D26-001
   [junit4]   2> NOTE: test params are: codec=FastDecompressionCompressingStoredFields(storedFieldsFormat=CompressingStoredFieldsFormat(compressionMode=FAST_DECOMPRESSION, chunkSize=10471, maxDocsPerChunk=3, blockSize=639), termVectorsFormat=CompressingTermVectorsFormat(compressionMode=FAST_DECOMPRESSION, chunkSize=10471, blockSize=639)), sim=Asserting(org.apache.lucene.search.similarities.AssertingSimilarity@5b730356), locale=fr-MA, timezone=Europe/Mariehamn
   [junit4]   2> NOTE: Windows 10 10.0 amd64/Oracle Corporation 11 (64-bit)/cpus=3,threads=1,free=89395992,total=318242816
   [junit4]   2> NOTE: All tests run in this JVM: [MissingSegmentRecoveryTest, MissingSegmentRecoveryTest, MissingSegmentRecoveryTest, TestSimTriggerIntegration]
   [junit4] Completed [9/10 (4!)] on J0 in 2.61s, 11 tests, 1 failure, 3 skipped <<< FAILURES!

[...truncated 17 lines...]
BUILD FAILED
C:\Users\jenkins\workspace\Lucene-Solr-master-Windows\lucene\common-build.xml:1572: The following error occurred while executing this line:
C:\Users\jenkins\workspace\Lucene-Solr-master-Windows\lucene\common-build.xml:1099: There were test failures: 10 suites, 60 tests, 4 failures, 15 ignored (15 assumptions) [seed: 657A612AB85F5D26]

Total time: 47 seconds

[repro] Setting last failure code to 1

[repro] Failures:
[repro]   0/5 failed: org.apache.solr.cloud.MissingSegmentRecoveryTest
[repro]   4/5 failed: org.apache.solr.cloud.autoscaling.sim.TestSimTriggerIntegration
[repro] Exiting with code 1

C:\Users\jenkins\workspace\Lucene-Solr-master-Windows>IF EXIST lucene\build move /y lucene\build lucene\build.repro 
        1 dir(s) moved.

C:\Users\jenkins\workspace\Lucene-Solr-master-Windows>IF EXIST solr\build move /y solr\build solr\build.repro 
        1 dir(s) moved.

C:\Users\jenkins\workspace\Lucene-Solr-master-Windows>IF EXIST lucene\build.orig move /y lucene\build.orig lucene\build 
        1 dir(s) moved.

C:\Users\jenkins\workspace\Lucene-Solr-master-Windows>IF EXIST solr\build.orig move /y solr\build.orig solr\build 
        1 dir(s) moved.

C:\Users\jenkins\workspace\Lucene-Solr-master-Windows>exit 0 
Archiving artifacts
Setting ANT_1_8_2_HOME=C:\Users\jenkins\tools\hudson.tasks.Ant_AntInstallation\ANT_1.8.2
[WARNINGS] Parsing warnings in console log with parser Java Compiler (javac)
Setting ANT_1_8_2_HOME=C:\Users\jenkins\tools\hudson.tasks.Ant_AntInstallation\ANT_1.8.2
Setting ANT_1_8_2_HOME=C:\Users\jenkins\tools\hudson.tasks.Ant_AntInstallation\ANT_1.8.2
<Git Blamer> Using GitBlamer to create author and commit information for all warnings.
<Git Blamer> GIT_COMMIT=73797f60ada12aa2a09180947d4bdf556a234fea, workspace=C:\Users\jenkins\workspace\Lucene-Solr-master-Windows
[WARNINGS] Computing warning deltas based on reference build #7675
Recording test results
Setting ANT_1_8_2_HOME=C:\Users\jenkins\tools\hudson.tasks.Ant_AntInstallation\ANT_1.8.2
Build step 'Publish JUnit test result report' changed build result to UNSTABLE
Email was triggered for: Unstable (Test Failures)
Sending email for trigger: Unstable (Test Failures)
Setting ANT_1_8_2_HOME=C:\Users\jenkins\tools\hudson.tasks.Ant_AntInstallation\ANT_1.8.2
Setting ANT_1_8_2_HOME=C:\Users\jenkins\tools\hudson.tasks.Ant_AntInstallation\ANT_1.8.2
Setting ANT_1_8_2_HOME=C:\Users\jenkins\tools\hudson.tasks.Ant_AntInstallation\ANT_1.8.2
Setting ANT_1_8_2_HOME=C:\Users\jenkins\tools\hudson.tasks.Ant_AntInstallation\ANT_1.8.2