You are viewing a plain text version of this content. The canonical link for it is here.
Posted to builds@beam.apache.org by Apache Jenkins Server <je...@builds.apache.org> on 2022/05/01 23:51:37 UTC

Build failed in Jenkins: beam_PostCommit_XVR_Samza #1126

See <https://ci-beam.apache.org/job/beam_PostCommit_XVR_Samza/1126/display/redirect>

Changes:


------------------------------------------
[...truncated 842.81 KB...]
Removing intermediate container bef4b209ecdf
 ---> b5d5be9c0778
Step 14/31 : RUN pip check || (echo "Container does not include required Beam dependencies or has conflicting dependencies. If Beam dependencies have changed, you need to regenerate base_image_requirements.txt files. See: https://s.apache.org/beam-python-requirements-generate" && exit 1)
 ---> Running in 9071481ec746
No broken requirements found.
Removing intermediate container 9071481ec746
 ---> 7f4f4bcaaa7f
Step 15/31 : RUN pip freeze --all
 ---> Running in bbb9a2916c24
absl-py==1.0.0
apache-beam @ file:///opt/apache/beam/tars/apache-beam.tar.gz
astunparse==1.6.3
atomicwrites==1.4.0
attrs==21.4.0
beautifulsoup4==4.10.0
bs4==0.0.1
cached-property==1.5.2
cachetools==4.2.4
certifi==2021.10.8
cffi==1.15.0
charset-normalizer==2.0.12
click==8.0.4
cloudpickle==2.0.0
crcmod==1.7
cryptography==36.0.2
Cython==0.29.28
deprecation==2.1.0
dill==0.3.1.1
docker==5.0.3
docopt==0.6.2
execnet==1.9.0
fastavro==1.4.10
fasteners==0.17.3
flatbuffers==2.0
freezegun==1.2.1
future==0.18.2
gast==0.5.3
google-api-core==1.31.5
google-api-python-client==2.41.0
google-apitools==0.5.31
google-auth==1.35.0
google-auth-httplib2==0.1.0
google-auth-oauthlib==0.4.6
google-cloud-bigquery==2.34.2
google-cloud-bigquery-storage==2.13.0
google-cloud-bigtable==1.7.0
google-cloud-core==1.7.2
google-cloud-datastore==1.15.3
google-cloud-dlp==3.6.2
google-cloud-language==1.3.0
google-cloud-profiler==3.0.7
google-cloud-pubsub==2.11.0
google-cloud-pubsublite==1.4.1
google-cloud-recommendations-ai==0.2.0
google-cloud-spanner==1.19.1
google-cloud-videointelligence==1.16.1
google-cloud-vision==1.0.0
google-crc32c==1.3.0
google-pasta==0.2.0
google-python-cloud-debugger==2.18
google-resumable-media==2.3.2
googleapis-common-protos==1.56.0
greenlet==1.1.2
grpc-google-iam-v1==0.12.3
grpcio==1.44.0
grpcio-gcp==0.2.2
grpcio-status==1.44.0
guppy3==3.1.2
h5py==3.6.0
hdfs==2.6.0
httplib2==0.19.1
idna==3.3
importlib-metadata==4.11.3
joblib==1.1.0
keras==2.8.0
Keras-Preprocessing==1.1.2
libclang==13.0.0
Markdown==3.3.6
mmh3==3.0.0
mock==2.0.0
more-itertools==8.12.0
nltk==3.7
nose==1.3.7
numpy==1.21.5
oauth2client==4.1.3
oauthlib==3.2.0
opt-einsum==3.3.0
orjson==3.6.7
overrides==6.1.0
packaging==21.3
pandas==1.3.5
parameterized==0.7.5
pbr==5.8.1
pip==22.0.4
pluggy==0.13.1
proto-plus==1.20.3
protobuf==3.19.4
psycopg2-binary==2.9.3
py==1.11.0
pyarrow==6.0.1
pyasn1==0.4.8
pyasn1-modules==0.2.8
pycparser==2.21
pydot==1.4.2
PyHamcrest==1.10.1
pymongo==3.12.3
PyMySQL==1.0.2
pyparsing==2.4.7
pytest==4.6.11
pytest-forked==1.4.0
pytest-timeout==1.4.2
pytest-xdist==1.34.0
python-dateutil==2.8.2
python-snappy==0.6.1
pytz==2021.3
PyYAML==6.0
regex==2022.3.15
requests==2.27.1
requests-mock==1.9.3
requests-oauthlib==1.3.1
rsa==4.8
scikit-learn==1.0.2
scipy==1.7.3
setuptools==57.5.0
six==1.16.0
soupsieve==2.3.1
SQLAlchemy==1.4.32
tenacity==5.1.5
tensorboard==2.8.0
tensorboard-data-server==0.6.1
tensorboard-plugin-wit==1.8.1
tensorflow==2.8.0
tensorflow-io-gcs-filesystem==0.24.0
termcolor==1.1.0
testcontainers==3.4.2
tf-estimator-nightly==2.8.0.dev2021122109
threadpoolctl==3.1.0
tqdm==4.63.0
typing-utils==0.1.0
typing_extensions==4.1.1
uritemplate==4.1.1
urllib3==1.26.9
wcwidth==0.2.5
websocket-client==1.3.1
Werkzeug==2.0.3
wheel==0.37.1
wrapt==1.14.0
zipp==3.7.0
Removing intermediate container bbb9a2916c24
 ---> a1867f93b496
Step 16/31 : COPY target/LICENSE /opt/apache/beam/
 ---> 7c8c4968426e
Step 17/31 : COPY target/LICENSE.python /opt/apache/beam/
 ---> 06dda918df66
Step 18/31 : COPY target/NOTICE /opt/apache/beam/
 ---> 858ea621310d
Step 19/31 : COPY target/launcher/linux_amd64/boot /opt/apache/beam/
 ---> f6043fd388e0
Step 20/31 : ENTRYPOINT ["/opt/apache/beam/boot"]
 ---> Running in 2882df1a73cf
Removing intermediate container 2882df1a73cf
 ---> 434e495c95a2
Step 21/31 : FROM beam as third_party_licenses
 ---> 434e495c95a2
Step 22/31 : ARG pull_licenses
 ---> Running in 3a684b022a01
Removing intermediate container 3a684b022a01
 ---> 259d60cd1547
Step 23/31 : COPY target/license_scripts /tmp/license_scripts/
 ---> d57627226f03
Step 24/31 : COPY target/LICENSE target/go-licenses/* /opt/apache/beam/third_party_licenses/golang/
 ---> 0418298a603d
Step 25/31 : RUN rm /opt/apache/beam/third_party_licenses/golang/LICENSE
 ---> Running in 65bfa4b03e6c
Removing intermediate container 65bfa4b03e6c
 ---> 0b2c16eb9240
Step 26/31 : COPY target/license_scripts /tmp/license_scripts/
 ---> 57ecf60f07ec
Step 27/31 : RUN if [ "$pull_licenses" = "true" ] ; then       pip install 'pip-licenses<4.0.0' pyyaml tenacity &&       python /tmp/license_scripts/pull_licenses_py.py ;     fi
 ---> Running in fc1edb956536
Collecting pip-licenses<4.0.0
  Downloading pip_licenses-3.5.4-py3-none-any.whl (17 kB)
Requirement already satisfied: pyyaml in /usr/local/lib/python3.7/site-packages (6.0)
Requirement already satisfied: tenacity in /usr/local/lib/python3.7/site-packages (5.1.5)
Collecting PTable
  Downloading PTable-0.9.2.tar.gz (31 kB)
  Preparing metadata (setup.py): started
  Preparing metadata (setup.py): finished with status 'done'
Requirement already satisfied: six>=1.9.0 in /usr/local/lib/python3.7/site-packages (from tenacity) (1.16.0)
Building wheels for collected packages: PTable
  Building wheel for PTable (setup.py): started
  Building wheel for PTable (setup.py): finished with status 'done'
  Created wheel for PTable: filename=PTable-0.9.2-py3-none-any.whl size=22925 sha256=162ba1f98f69f771b83a899e53bb7d50a7568a51a85e3b08d35d8f426606e5c3
  Stored in directory: /root/.cache/pip/wheels/33/df/2f/674985b3f8a2de3f96357d1eadef5110f74fa91b3785e52a54
Successfully built PTable
Installing collected packages: PTable, pip-licenses
Successfully installed PTable-0.9.2 pip-licenses-3.5.4
WARNING: Running pip as the 'root' user can result in broken permissions and conflicting behaviour with the system package manager. It is recommended to use a virtual environment instead: https://pip.pypa.io/warnings/venv
Skip pulling license for  bs4
INFO:root:Successfully pulled licenses for 135 dependencies
Removing intermediate container fc1edb956536
 ---> 4455b0c80737
Step 28/31 : FROM beam
 ---> 434e495c95a2
Step 29/31 : ARG pull_licenses
 ---> Running in 9cc3f6425d9d
Removing intermediate container 9cc3f6425d9d
 ---> c4967cbb1f11
Step 30/31 : COPY --from=third_party_licenses /opt/apache/beam/third_party_licenses /opt/apache/beam/third_party_licenses
 ---> cc27028bc619
Step 31/31 : RUN if [ "$pull_licenses" != "true" ] ; then       rm -rf /opt/apache/beam/third_party_licenses ;     fi
 ---> Running in a416d96ba639
Removing intermediate container a416d96ba639
 ---> 45fdcf21b41a
Successfully built 45fdcf21b41a
Successfully tagged apache/beam_python3.7_sdk:2.39.0.dev

> Task :runners:samza:job-server:samzaJobServerCleanup

FAILURE: Build failed with an exception.

* What went wrong:
Execution failed for task ':sdks:java:container:pullLicenses'.
> Process 'command './license_scripts/license_script.sh'' finished with non-zero exit value 1

* Try:
> Run with --stacktrace option to get the stack trace.
> Run with --info or --debug option to get more log output.
> Run with --scan to get full insights.

* Get more help at https://help.gradle.org

Deprecated Gradle features were used in this build, making it incompatible with Gradle 8.0.

You can use '--warning-mode all' to show the individual deprecation warnings and determine if they come from your own scripts or plugins.

See https://docs.gradle.org/7.4/userguide/command_line_interface.html#sec:command_line_warnings

Execution optimizations have been disabled for 1 invalid unit(s) of work during this build to ensure correctness.
Please consult deprecation warnings for more details.

BUILD FAILED in 9m 10s
234 actionable tasks: 151 executed, 72 from cache, 11 up-to-date

Publishing build scan...
https://gradle.com/s/d2d3vwdwuzalo

Build step 'Invoke Gradle script' changed build result to FAILURE
Build step 'Invoke Gradle script' marked build as failure

---------------------------------------------------------------------
To unsubscribe, e-mail: builds-unsubscribe@beam.apache.org
For additional commands, e-mail: builds-help@beam.apache.org


Jenkins build is back to normal : beam_PostCommit_XVR_Samza #1132

Posted by Apache Jenkins Server <je...@builds.apache.org>.
See <https://ci-beam.apache.org/job/beam_PostCommit_XVR_Samza/1132/display/redirect>


---------------------------------------------------------------------
To unsubscribe, e-mail: builds-unsubscribe@beam.apache.org
For additional commands, e-mail: builds-help@beam.apache.org


Build failed in Jenkins: beam_PostCommit_XVR_Samza #1131

Posted by Apache Jenkins Server <je...@builds.apache.org>.
See <https://ci-beam.apache.org/job/beam_PostCommit_XVR_Samza/1131/display/redirect>

Changes:


------------------------------------------
[...truncated 2.11 MB...]
        role_payload: "\n8cldrdata-YqzuKX1QnLCOo0cwjKRdBhGrip_ltIJZg-APT60tUPA.jar"
      >
      dependencies: <
        type_urn: "beam:artifact:type:file:v1"
        type_payload: "\nD/tmp/artifacts/dnsns-dhEp186udEF6X6chZus-RJzWRmzlccxx1_btlXWayVI.jar\022@761129d7ceae74417a5fa72166eb3e449cd6466ce571cc71d7f6ed95759ac952"
        role_urn: "beam:artifact:role:staging_to:v1"
        role_payload: "\n5dnsns-dhEp186udEF6X6chZus-RJzWRmzlccxx1_btlXWayVI.jar"
      >
      dependencies: <
        type_urn: "beam:artifact:type:file:v1"
        type_payload: "\n\203\001/tmp/artifacts/beam-sdks-java-extensions-schemaio-expansion-service-2.39.0-SNAPSHOT-oJVQ4_4NU5Ylz-B1RVmTh9pYYE2KHx9C0vnkqad0kcg.jar\022@a09550e3fe0d539625cfe07545599387da58604d8a1f1f42d2f9e4a9a77491c8"
        role_urn: "beam:artifact:role:staging_to:v1"
        role_payload: "\ntbeam-sdks-java-extensions-schemaio-expansion-service-2.39.0-SNAPSHOT-oJVQ4_4NU5Ylz-B1RVmTh9pYYE2KHx9C0vnkqad0kcg.jar"
      >
    >
  >
  environments: <
    key: "go"
    value: <
      urn: "beam:env:docker:v1"
      payload: "\n\026apache/beam_go_sdk:dev"
      capabilities: "beam:protocol:progress_reporting:v0"
      capabilities: "beam:protocol:multi_core_bundle_processing:v1"
      capabilities: "beam:version:sdk_base:go"
      capabilities: "beam:coder:bytes:v1"
      capabilities: "beam:coder:bool:v1"
      capabilities: "beam:coder:varint:v1"
      capabilities: "beam:coder:double:v1"
      capabilities: "beam:coder:string_utf8:v1"
      capabilities: "beam:coder:length_prefix:v1"
      capabilities: "beam:coder:kv:v1"
      capabilities: "beam:coder:iterable:v1"
      capabilities: "beam:coder:state_backed_iterable:v1"
      capabilities: "beam:coder:windowed_value:v1"
      capabilities: "beam:coder:global_window:v1"
      capabilities: "beam:coder:interval_window:v1"
      capabilities: "beam:coder:row:v1"
      capabilities: "beam:coder:nullable:v1"
      dependencies: <
        type_urn: "beam:artifact:type:file:v1"
        role_urn: "beam:artifact:role:go_worker_binary:v1"
      >
    >
  >
>
root_transform_ids: "e2"
root_transform_ids: "e3"
root_transform_ids: "s1"
root_transform_ids: "s3"
requirements: "beam:requirement:pardo:splittable_dofn:v1"
2022/05/03 06:27:00 Cross-compiling <https://ci-beam.apache.org/job/beam_PostCommit_XVR_Samza/ws/src/sdks/go/test/integration/io/xlang/jdbc/jdbc_test.go> as /tmp/worker-4-1651559220870255624
2022/05/03 06:27:05 Prepared job with id: go-testjdbcio_postgresreadwrite_8664b926-5fff-49f9-8acc-f4c3e4b889ab and staging token: go-testjdbcio_postgresreadwrite_8664b926-5fff-49f9-8acc-f4c3e4b889ab
2022/05/03 06:27:05 Staged binary artifact with token: 
2022/05/03 06:27:05 Submitted job: go0testjdbcio0postgresreadwrite-jenkins-0503062705-cc2fad6e_37bb0a85-0c01-47e6-bbc8-3af4ffba0552
2022/05/03 06:27:05 Job state: STOPPED
2022/05/03 06:27:05 Job state: STARTING
2022/05/03 06:27:05 Job state: RUNNING
2022/05/03 06:27:24 Job state: DONE
--- PASS: TestJDBCIO_PostgresReadWrite (48.44s)
PASS
ok  	github.com/apache/beam/sdks/v2/go/test/integration/io/xlang/jdbc	102.024s
=== RUN   TestKafkaIO_BasicReadWrite
--- FAIL: TestKafkaIO_BasicReadWrite (0.01s)
panic: 	tried cross-language for beam:transform:org.apache.beam:kafka_write:v1 against localhost:33819 and failed
	expanding external transform
	expanding transform with ExpansionRequest: components:{pcollections:{key:"n4" value:{unique_name:"n4" coder_id:"c1@yOoKtucEFB" is_bounded:BOUNDED windowing_strategy_id:"w0@yOoKtucEFB"}} windowing_strategies:{key:"w0@yOoKtucEFB" value:{window_fn:{urn:"beam:window_fn:global_windows:v1"} merge_status:NON_MERGING window_coder_id:"c2@yOoKtucEFB" trigger:{default:{}} accumulation_mode:DISCARDING output_time:END_OF_WINDOW closing_behavior:EMIT_IF_NONEMPTY on_time_behavior:FIRE_IF_NONEMPTY environment_id:"go"}} coders:{key:"c0@yOoKtucEFB" value:{spec:{urn:"beam:coder:bytes:v1"}}} coders:{key:"c1@yOoKtucEFB" value:{spec:{urn:"beam:coder:kv:v1"} component_coder_ids:"c0@yOoKtucEFB" component_coder_ids:"c0@yOoKtucEFB"}} coders:{key:"c2@yOoKtucEFB" value:{spec:{urn:"beam:coder:global_window:v1"}}} environments:{key:"go" value:{}}} transform:{unique_name:"External" spec:{urn:"beam:transform:org.apache.beam:kafka_write:v1" payload:"\n}\n\x1c\n\x0eProducerConfig\x1a\n*\x08\n\x02\x10\x07\x12\x02\x10\x07\n\x0b\n\x05Topic\x1a\x02\x10\x07\n\x13\n\rKeySerializer\x1a\x02\x10\x07\n\x15\n\x0fValueSerializer\x1a\x02\x10\x07\x12$d97fbd8d-dde2-46d8-babd-f5372b6ab5e6\x12\xda\x01\x04\x00\x00\x00\x00\x01\x11bootstrap.servers\x0flocalhost:42989=xlang_kafkaio_basic_test_36e32633-78da-4261-8e20-3976346af34b9org.apache.kafka.common.serialization.ByteArraySerializer9org.apache.kafka.common.serialization.ByteArraySerializer"} inputs:{key:"i0" value:"n4"} environment_id:"go"} namespace:"yOoKtucEFB"
expansion failed
	caused by:
rpc error: code = Unavailable desc = connection error: desc = "transport: Error while dialing dial tcp 127.0.0.1:33819: connect: connection refused" [recovered]
	panic: 	tried cross-language for beam:transform:org.apache.beam:kafka_write:v1 against localhost:33819 and failed
	expanding external transform
	expanding transform with ExpansionRequest: components:{pcollections:{key:"n4" value:{unique_name:"n4" coder_id:"c1@yOoKtucEFB" is_bounded:BOUNDED windowing_strategy_id:"w0@yOoKtucEFB"}} windowing_strategies:{key:"w0@yOoKtucEFB" value:{window_fn:{urn:"beam:window_fn:global_windows:v1"} merge_status:NON_MERGING window_coder_id:"c2@yOoKtucEFB" trigger:{default:{}} accumulation_mode:DISCARDING output_time:END_OF_WINDOW closing_behavior:EMIT_IF_NONEMPTY on_time_behavior:FIRE_IF_NONEMPTY environment_id:"go"}} coders:{key:"c0@yOoKtucEFB" value:{spec:{urn:"beam:coder:bytes:v1"}}} coders:{key:"c1@yOoKtucEFB" value:{spec:{urn:"beam:coder:kv:v1"} component_coder_ids:"c0@yOoKtucEFB" component_coder_ids:"c0@yOoKtucEFB"}} coders:{key:"c2@yOoKtucEFB" value:{spec:{urn:"beam:coder:global_window:v1"}}} environments:{key:"go" value:{}}} transform:{unique_name:"External" spec:{urn:"beam:transform:org.apache.beam:kafka_write:v1" payload:"\n}\n\x1c\n\x0eProducerConfig\x1a\n*\x08\n\x02\x10\x07\x12\x02\x10\x07\n\x0b\n\x05Topic\x1a\x02\x10\x07\n\x13\n\rKeySerializer\x1a\x02\x10\x07\n\x15\n\x0fValueSerializer\x1a\x02\x10\x07\x12$d97fbd8d-dde2-46d8-babd-f5372b6ab5e6\x12\xda\x01\x04\x00\x00\x00\x00\x01\x11bootstrap.servers\x0flocalhost:42989=xlang_kafkaio_basic_test_36e32633-78da-4261-8e20-3976346af34b9org.apache.kafka.common.serialization.ByteArraySerializer9org.apache.kafka.common.serialization.ByteArraySerializer"} inputs:{key:"i0" value:"n4"} environment_id:"go"} namespace:"yOoKtucEFB"
expansion failed
	caused by:
rpc error: code = Unavailable desc = connection error: desc = "transport: Error while dialing dial tcp 127.0.0.1:33819: connect: connection refused"

goroutine 5 [running]:
testing.tRunner.func1.2(0xd6eb00, 0xc0003dfd40)
	/home/jenkins/sdk/go1.16.12/src/testing/testing.go:1143 +0x332
testing.tRunner.func1(0xc0000fd680)
	/home/jenkins/sdk/go1.16.12/src/testing/testing.go:1146 +0x4b6
panic(0xd6eb00, 0xc0003dfd40)
	/home/jenkins/sdk/go1.16.12/src/runtime/panic.go:965 +0x1b9
github.com/apache/beam/sdks/v2/go/pkg/beam.CrossLanguage(0xc0000a1c00, 0xc0000e1400, 0xeaaa19, 0x2d, 0xc00064c000, 0x15c, 0x15c, 0xc000040ff0, 0xf, 0xc0001c7c78, ...)
	<https://ci-beam.apache.org/job/beam_PostCommit_XVR_Samza/ws/src/sdks/go/pkg/beam/xlang.go>:162 +0x1f7
github.com/apache/beam/sdks/v2/go/pkg/beam/io/xlang/kafkaio.Write(0xc0000a19a0, 0xc0000e1400, 0xc000040ff0, 0xf, 0xc000040fb0, 0xf, 0xc00004e700, 0x3d, 0xc000647bf0, 0x0, ...)
	<https://ci-beam.apache.org/job/beam_PostCommit_XVR_Samza/ws/src/sdks/go/pkg/beam/io/xlang/kafkaio/kafka.go>:278 +0x487
github.com/apache/beam/sdks/v2/go/test/integration/io/xlang/kafka.writeInts(0xc0000a1980, 0xc0000e1400, 0xc000040ff0, 0xf, 0xc000040fb0, 0xf, 0xc00004e700, 0x3d, 0xc000560000, 0x3e8, ...)
	<https://ci-beam.apache.org/job/beam_PostCommit_XVR_Samza/ws/src/sdks/go/test/integration/io/xlang/kafka/kafka.go>:48 +0x25c
github.com/apache/beam/sdks/v2/go/test/integration/io/xlang/kafka.WritePipeline(0xc000040ff0, 0xf, 0xc000040fb0, 0xf, 0xc00004e700, 0x3d, 0xc000560000, 0x3e8, 0x3e8, 0x6270cb54)
	<https://ci-beam.apache.org/job/beam_PostCommit_XVR_Samza/ws/src/sdks/go/test/integration/io/xlang/kafka/kafka.go>:70 +0x13f
github.com/apache/beam/sdks/v2/go/test/integration/io/xlang/kafka.TestKafkaIO_BasicReadWrite(0xc0000fd680)
	<https://ci-beam.apache.org/job/beam_PostCommit_XVR_Samza/ws/src/sdks/go/test/integration/io/xlang/kafka/kafka_test.go>:61 +0x115
testing.tRunner(0xc0000fd680, 0xec74c0)
	/home/jenkins/sdk/go1.16.12/src/testing/testing.go:1193 +0xef
created by testing.(*T).Run
	/home/jenkins/sdk/go1.16.12/src/testing/testing.go:1238 +0x2b3
FAIL	github.com/apache/beam/sdks/v2/go/test/integration/io/xlang/kafka	6.096s
FAIL
$ TEST_EXIT_CODE=0
$ cd ../..
$ exit 1
$ exit 1

> Task :runners:samza:job-server:validatesCrossLanguageRunnerGoUsingJava FAILED
> Task :runners:samza:job-server:validatesCrossLanguageRunnerJavaUsingJava
> Task :runners:samza:job-server:validatesCrossLanguageRunnerJavaUsingPython
> Task :runners:samza:job-server:validatesCrossLanguageRunnerJavaUsingPythonOnly

> Task :runners:samza:job-server:validatesCrossLanguageRunnerPythonUsingJava
>>> RUNNING integration tests with pipeline options: --runner=PortableRunner --job_endpoint=localhost:34261 --environment_cache_millis=10000 --experiments=beam_fn_api
>>>   pytest options: 
>>>   collect markers: -m=xlang_transforms
============================= test session starts ==============================
platform linux -- Python 3.9.10, pytest-4.6.11, py-1.11.0, pluggy-0.13.1
rootdir: <https://ci-beam.apache.org/job/beam_PostCommit_XVR_Samza/ws/src/sdks/python,> inifile: pytest.ini
plugins: xdist-1.34.0, timeout-1.4.2, forked-1.4.0, requests-mock-1.9.3
timeout: 600.0s
timeout method: signal
timeout func_only: False
collected 5387 items / 5377 deselected / 1 skipped / 9 selected

apache_beam/io/external/generate_sequence_test.py ...                    [ 30%]
apache_beam/transforms/validate_runner_xlang_test.py .......             [100%]

=============================== warnings summary ===============================
apache_beam/io/filesystems_test.py:54
  <https://ci-beam.apache.org/job/beam_PostCommit_XVR_Samza/ws/src/sdks/python/apache_beam/io/filesystems_test.py>:54: DeprecationWarning: invalid escape sequence \c
    self.assertIsNone(FileSystems.get_scheme('c:\\abc\cdf'))  # pylint: disable=anomalous-backslash-in-string

apache_beam/io/filesystems_test.py:62
  <https://ci-beam.apache.org/job/beam_PostCommit_XVR_Samza/ws/src/sdks/python/apache_beam/io/filesystems_test.py>:62: DeprecationWarning: invalid escape sequence \d
    self.assertTrue(isinstance(FileSystems.get_filesystem('c:\\abc\def'),  # pylint: disable=anomalous-backslash-in-string

<unknown>:54
  <unknown>:54: DeprecationWarning: invalid escape sequence \c

<unknown>:62
  <unknown>:62: DeprecationWarning: invalid escape sequence \d

<https://ci-beam.apache.org/job/beam_PostCommit_XVR_Samza/ws/src/build/gradleenv/1922375555/lib/python3.9/site-packages/tenacity/_asyncio.py>:42
  <https://ci-beam.apache.org/job/beam_PostCommit_XVR_Samza/ws/src/build/gradleenv/1922375555/lib/python3.9/site-packages/tenacity/_asyncio.py>:42: DeprecationWarning: "@coroutine" decorator is deprecated since Python 3.8, use "async def" instead
    def call(self, fn, *args, **kwargs):

-- Docs: https://docs.pytest.org/en/latest/warnings.html
- generated xml file: <https://ci-beam.apache.org/job/beam_PostCommit_XVR_Samza/ws/src/sdks/python/pytest_xlangValidateRunner.xml> -
===== 10 passed, 1 skipped, 5377 deselected, 5 warnings in 119.00 seconds ======

> Task :runners:samza:job-server:validatesCrossLanguageRunnerPythonUsingPython
>>> RUNNING integration tests with pipeline options: --runner=PortableRunner --job_endpoint=localhost:34261 --environment_cache_millis=10000 --experiments=beam_fn_api
>>>   pytest options: 
>>>   collect markers: -m=xlang_transforms
============================= test session starts ==============================
platform linux -- Python 3.9.10, pytest-4.6.11, py-1.11.0, pluggy-0.13.1
rootdir: <https://ci-beam.apache.org/job/beam_PostCommit_XVR_Samza/ws/src/sdks/python,> inifile: pytest.ini
plugins: xdist-1.34.0, timeout-1.4.2, forked-1.4.0, requests-mock-1.9.3
timeout: 600.0s
timeout method: signal
timeout func_only: False
collected 5387 items / 5377 deselected / 1 skipped / 9 selected

apache_beam/io/external/generate_sequence_test.py .ss                    [ 30%]
apache_beam/transforms/validate_runner_xlang_test.py .......             [100%]

=============================== warnings summary ===============================
<unknown>:54
  <unknown>:54: DeprecationWarning: invalid escape sequence \c

<unknown>:62
  <unknown>:62: DeprecationWarning: invalid escape sequence \d

<https://ci-beam.apache.org/job/beam_PostCommit_XVR_Samza/ws/src/build/gradleenv/1922375555/lib/python3.9/site-packages/tenacity/_asyncio.py>:42
  <https://ci-beam.apache.org/job/beam_PostCommit_XVR_Samza/ws/src/build/gradleenv/1922375555/lib/python3.9/site-packages/tenacity/_asyncio.py>:42: DeprecationWarning: "@coroutine" decorator is deprecated since Python 3.8, use "async def" instead
    def call(self, fn, *args, **kwargs):

-- Docs: https://docs.pytest.org/en/latest/warnings.html
- generated xml file: <https://ci-beam.apache.org/job/beam_PostCommit_XVR_Samza/ws/src/sdks/python/pytest_xlangValidateRunner.xml> -
====== 8 passed, 3 skipped, 5377 deselected, 3 warnings in 69.42 seconds =======

> Task :runners:samza:job-server:validatesCrossLanguageRunnerPythonUsingSql
>>> RUNNING integration tests with pipeline options: --runner=PortableRunner --job_endpoint=localhost:34261 --environment_cache_millis=10000 --experiments=beam_fn_api
>>>   pytest options: 
>>>   collect markers: -m=xlang_sql_expansion_service
============================= test session starts ==============================
platform linux -- Python 3.9.10, pytest-4.6.11, py-1.11.0, pluggy-0.13.1
rootdir: <https://ci-beam.apache.org/job/beam_PostCommit_XVR_Samza/ws/src/sdks/python,> inifile: pytest.ini
plugins: xdist-1.34.0, timeout-1.4.2, forked-1.4.0, requests-mock-1.9.3
timeout: 600.0s
timeout method: signal
timeout func_only: False
collected 5387 items / 5378 deselected / 1 skipped / 8 selected

apache_beam/transforms/sql_test.py .........                             [100%]

=============================== warnings summary ===============================
<unknown>:54
  <unknown>:54: DeprecationWarning: invalid escape sequence \c

<unknown>:62
  <unknown>:62: DeprecationWarning: invalid escape sequence \d

<https://ci-beam.apache.org/job/beam_PostCommit_XVR_Samza/ws/src/build/gradleenv/1922375555/lib/python3.9/site-packages/tenacity/_asyncio.py>:42
  <https://ci-beam.apache.org/job/beam_PostCommit_XVR_Samza/ws/src/build/gradleenv/1922375555/lib/python3.9/site-packages/tenacity/_asyncio.py>:42: DeprecationWarning: "@coroutine" decorator is deprecated since Python 3.8, use "async def" instead
    def call(self, fn, *args, **kwargs):

-- Docs: https://docs.pytest.org/en/latest/warnings.html
- generated xml file: <https://ci-beam.apache.org/job/beam_PostCommit_XVR_Samza/ws/src/sdks/python/pytest_xlangSqlValidateRunner.xml> -
====== 9 passed, 1 skipped, 5378 deselected, 3 warnings in 258.78 seconds ======

> Task :runners:samza:job-server:validatesCrossLanguageRunnerCleanup
Stopping expansion service pid: 2657688.
Stopping expansion service pid: 2657689.

> Task :runners:samza:job-server:samzaJobServerCleanup
Stopping job server pid: 2646492.

FAILURE: Build failed with an exception.

* Where:
Build file '<https://ci-beam.apache.org/job/beam_PostCommit_XVR_Samza/ws/src/sdks/go/test/build.gradle'> line: 195

* What went wrong:
Execution failed for task ':runners:samza:job-server:validatesCrossLanguageRunnerGoUsingJava'.
> Process 'command 'sh'' finished with non-zero exit value 1

* Try:
> Run with --stacktrace option to get the stack trace.
> Run with --info or --debug option to get more log output.
> Run with --scan to get full insights.

* Get more help at https://help.gradle.org

Deprecated Gradle features were used in this build, making it incompatible with Gradle 8.0.

You can use '--warning-mode all' to show the individual deprecation warnings and determine if they come from your own scripts or plugins.

See https://docs.gradle.org/7.4/userguide/command_line_interface.html#sec:command_line_warnings

Execution optimizations have been disabled for 1 invalid unit(s) of work during this build to ensure correctness.
Please consult deprecation warnings for more details.

BUILD FAILED in 33m 8s
231 actionable tasks: 35 executed, 196 up-to-date

Publishing build scan...
https://gradle.com/s/7wjlnangpou2s

Build step 'Invoke Gradle script' changed build result to FAILURE
Build step 'Invoke Gradle script' marked build as failure

---------------------------------------------------------------------
To unsubscribe, e-mail: builds-unsubscribe@beam.apache.org
For additional commands, e-mail: builds-help@beam.apache.org


Build failed in Jenkins: beam_PostCommit_XVR_Samza #1130

Posted by Apache Jenkins Server <je...@builds.apache.org>.
See <https://ci-beam.apache.org/job/beam_PostCommit_XVR_Samza/1130/display/redirect?page=changes>

Changes:

[Robert Bradshaw] Allow arithmetic between deferred scalars.

[noreply] [BEAM-14253] patch SubscriptionPartitionLoader to work around a dataflow

[noreply] Add website link log to notify user of pre-build workflow. (#17498)

[noreply] [BEAM-11105] Add timestamp observing watermark estimation (#17476)

[noreply] Merge pull request #17487 from Adding user-agent to GCS client in Python

[noreply] [BEAM-10265] Display error message if trying to infer recursive schema

[noreply] [BEAM-12575] Upgraded ipykernel from v5 to v6 (#17526)

[noreply] [BEAM-11105] Add docs + CHANGES.md entry for Go Watermark Estimation

[noreply] Merge pull request #17380 from [BEAM-14314][BEAM-9532] Add last_updated


------------------------------------------
[...truncated 2.52 MB...]
        role_payload: "\n8cldrdata-YqzuKX1QnLCOo0cwjKRdBhGrip_ltIJZg-APT60tUPA.jar"
      >
      dependencies: <
        type_urn: "beam:artifact:type:file:v1"
        type_payload: "\nD/tmp/artifacts/dnsns-dhEp186udEF6X6chZus-RJzWRmzlccxx1_btlXWayVI.jar\022@761129d7ceae74417a5fa72166eb3e449cd6466ce571cc71d7f6ed95759ac952"
        role_urn: "beam:artifact:role:staging_to:v1"
        role_payload: "\n5dnsns-dhEp186udEF6X6chZus-RJzWRmzlccxx1_btlXWayVI.jar"
      >
      dependencies: <
        type_urn: "beam:artifact:type:file:v1"
        type_payload: "\n\203\001/tmp/artifacts/beam-sdks-java-extensions-schemaio-expansion-service-2.39.0-SNAPSHOT-oJVQ4_4NU5Ylz-B1RVmTh9pYYE2KHx9C0vnkqad0kcg.jar\022@a09550e3fe0d539625cfe07545599387da58604d8a1f1f42d2f9e4a9a77491c8"
        role_urn: "beam:artifact:role:staging_to:v1"
        role_payload: "\ntbeam-sdks-java-extensions-schemaio-expansion-service-2.39.0-SNAPSHOT-oJVQ4_4NU5Ylz-B1RVmTh9pYYE2KHx9C0vnkqad0kcg.jar"
      >
    >
  >
  environments: <
    key: "go"
    value: <
      urn: "beam:env:docker:v1"
      payload: "\n\026apache/beam_go_sdk:dev"
      capabilities: "beam:protocol:progress_reporting:v0"
      capabilities: "beam:protocol:multi_core_bundle_processing:v1"
      capabilities: "beam:version:sdk_base:go"
      capabilities: "beam:coder:bytes:v1"
      capabilities: "beam:coder:bool:v1"
      capabilities: "beam:coder:varint:v1"
      capabilities: "beam:coder:double:v1"
      capabilities: "beam:coder:string_utf8:v1"
      capabilities: "beam:coder:length_prefix:v1"
      capabilities: "beam:coder:kv:v1"
      capabilities: "beam:coder:iterable:v1"
      capabilities: "beam:coder:state_backed_iterable:v1"
      capabilities: "beam:coder:windowed_value:v1"
      capabilities: "beam:coder:global_window:v1"
      capabilities: "beam:coder:interval_window:v1"
      capabilities: "beam:coder:row:v1"
      capabilities: "beam:coder:nullable:v1"
      dependencies: <
        type_urn: "beam:artifact:type:file:v1"
        role_urn: "beam:artifact:role:go_worker_binary:v1"
      >
    >
  >
>
root_transform_ids: "e2"
root_transform_ids: "s1"
root_transform_ids: "e3"
root_transform_ids: "s3"
requirements: "beam:requirement:pardo:splittable_dofn:v1"
2022/05/03 00:27:27 Cross-compiling <https://ci-beam.apache.org/job/beam_PostCommit_XVR_Samza/ws/src/sdks/go/test/integration/io/xlang/jdbc/jdbc_test.go> as /tmp/worker-4-1651537647964270368
2022/05/03 00:27:32 Prepared job with id: go-testjdbcio_postgresreadwrite_b2d3996f-170c-48ac-a48f-c95f27c77651 and staging token: go-testjdbcio_postgresreadwrite_b2d3996f-170c-48ac-a48f-c95f27c77651
2022/05/03 00:27:33 Staged binary artifact with token: 
2022/05/03 00:27:33 Submitted job: go0testjdbcio0postgresreadwrite-jenkins-0503002733-da4ed8b1_f44a02b6-d94b-42d1-b73a-fc2fbd313af3
2022/05/03 00:27:33 Job state: STOPPED
2022/05/03 00:27:33 Job state: STARTING
2022/05/03 00:27:33 Job state: RUNNING
2022/05/03 00:27:48 Job state: DONE
--- PASS: TestJDBCIO_PostgresReadWrite (50.64s)
PASS
ok  	github.com/apache/beam/sdks/v2/go/test/integration/io/xlang/jdbc	113.357s
=== RUN   TestKafkaIO_BasicReadWrite
--- FAIL: TestKafkaIO_BasicReadWrite (0.01s)
panic: 	tried cross-language for beam:transform:org.apache.beam:kafka_write:v1 against localhost:43081 and failed
	expanding external transform
	expanding transform with ExpansionRequest: components:{pcollections:{key:"n4" value:{unique_name:"n4" coder_id:"c1@khvCiddExi" is_bounded:BOUNDED windowing_strategy_id:"w0@khvCiddExi"}} windowing_strategies:{key:"w0@khvCiddExi" value:{window_fn:{urn:"beam:window_fn:global_windows:v1"} merge_status:NON_MERGING window_coder_id:"c2@khvCiddExi" trigger:{default:{}} accumulation_mode:DISCARDING output_time:END_OF_WINDOW closing_behavior:EMIT_IF_NONEMPTY on_time_behavior:FIRE_IF_NONEMPTY environment_id:"go"}} coders:{key:"c0@khvCiddExi" value:{spec:{urn:"beam:coder:bytes:v1"}}} coders:{key:"c1@khvCiddExi" value:{spec:{urn:"beam:coder:kv:v1"} component_coder_ids:"c0@khvCiddExi" component_coder_ids:"c0@khvCiddExi"}} coders:{key:"c2@khvCiddExi" value:{spec:{urn:"beam:coder:global_window:v1"}}} environments:{key:"go" value:{}}} transform:{unique_name:"External" spec:{urn:"beam:transform:org.apache.beam:kafka_write:v1" payload:"\n}\n\x1c\n\x0eProducerConfig\x1a\n*\x08\n\x02\x10\x07\x12\x02\x10\x07\n\x0b\n\x05Topic\x1a\x02\x10\x07\n\x13\n\rKeySerializer\x1a\x02\x10\x07\n\x15\n\x0fValueSerializer\x1a\x02\x10\x07\x12$d97fbd8d-dde2-46d8-babd-f5372b6ab5e6\x12\xda\x01\x04\x00\x00\x00\x00\x01\x11bootstrap.servers\x0flocalhost:37891=xlang_kafkaio_basic_test_ff97fe77-bf86-49c1-b092-0779a3f3c5fa9org.apache.kafka.common.serialization.ByteArraySerializer9org.apache.kafka.common.serialization.ByteArraySerializer"} inputs:{key:"i0" value:"n4"} environment_id:"go"} namespace:"khvCiddExi"
expansion failed
	caused by:
rpc error: code = Unavailable desc = connection error: desc = "transport: Error while dialing dial tcp 127.0.0.1:43081: connect: connection refused" [recovered]
	panic: 	tried cross-language for beam:transform:org.apache.beam:kafka_write:v1 against localhost:43081 and failed
	expanding external transform
	expanding transform with ExpansionRequest: components:{pcollections:{key:"n4" value:{unique_name:"n4" coder_id:"c1@khvCiddExi" is_bounded:BOUNDED windowing_strategy_id:"w0@khvCiddExi"}} windowing_strategies:{key:"w0@khvCiddExi" value:{window_fn:{urn:"beam:window_fn:global_windows:v1"} merge_status:NON_MERGING window_coder_id:"c2@khvCiddExi" trigger:{default:{}} accumulation_mode:DISCARDING output_time:END_OF_WINDOW closing_behavior:EMIT_IF_NONEMPTY on_time_behavior:FIRE_IF_NONEMPTY environment_id:"go"}} coders:{key:"c0@khvCiddExi" value:{spec:{urn:"beam:coder:bytes:v1"}}} coders:{key:"c1@khvCiddExi" value:{spec:{urn:"beam:coder:kv:v1"} component_coder_ids:"c0@khvCiddExi" component_coder_ids:"c0@khvCiddExi"}} coders:{key:"c2@khvCiddExi" value:{spec:{urn:"beam:coder:global_window:v1"}}} environments:{key:"go" value:{}}} transform:{unique_name:"External" spec:{urn:"beam:transform:org.apache.beam:kafka_write:v1" payload:"\n}\n\x1c\n\x0eProducerConfig\x1a\n*\x08\n\x02\x10\x07\x12\x02\x10\x07\n\x0b\n\x05Topic\x1a\x02\x10\x07\n\x13\n\rKeySerializer\x1a\x02\x10\x07\n\x15\n\x0fValueSerializer\x1a\x02\x10\x07\x12$d97fbd8d-dde2-46d8-babd-f5372b6ab5e6\x12\xda\x01\x04\x00\x00\x00\x00\x01\x11bootstrap.servers\x0flocalhost:37891=xlang_kafkaio_basic_test_ff97fe77-bf86-49c1-b092-0779a3f3c5fa9org.apache.kafka.common.serialization.ByteArraySerializer9org.apache.kafka.common.serialization.ByteArraySerializer"} inputs:{key:"i0" value:"n4"} environment_id:"go"} namespace:"khvCiddExi"
expansion failed
	caused by:
rpc error: code = Unavailable desc = connection error: desc = "transport: Error while dialing dial tcp 127.0.0.1:43081: connect: connection refused"

goroutine 5 [running]:
testing.tRunner.func1.2(0xd6eb00, 0xc0000ab000)
	/home/jenkins/sdk/go1.16.12/src/testing/testing.go:1143 +0x332
testing.tRunner.func1(0xc0005ca780)
	/home/jenkins/sdk/go1.16.12/src/testing/testing.go:1146 +0x4b6
panic(0xd6eb00, 0xc0000ab000)
	/home/jenkins/sdk/go1.16.12/src/runtime/panic.go:965 +0x1b9
github.com/apache/beam/sdks/v2/go/pkg/beam.CrossLanguage(0xc00058a960, 0xc0005d3310, 0xeaaa19, 0x2d, 0xc00018c580, 0x15c, 0x15c, 0xc00058ca80, 0xf, 0xc0000d5c78, ...)
	<https://ci-beam.apache.org/job/beam_PostCommit_XVR_Samza/ws/src/sdks/go/pkg/beam/xlang.go>:162 +0x1f7
github.com/apache/beam/sdks/v2/go/pkg/beam/io/xlang/kafkaio.Write(0xc00058a700, 0xc0005d3310, 0xc00058ca80, 0xf, 0xc00058ca40, 0xf, 0xc0005f43c0, 0x3d, 0xc000015d10, 0x0, ...)
	<https://ci-beam.apache.org/job/beam_PostCommit_XVR_Samza/ws/src/sdks/go/pkg/beam/io/xlang/kafkaio/kafka.go>:278 +0x487
github.com/apache/beam/sdks/v2/go/test/integration/io/xlang/kafka.writeInts(0xc00058a6e0, 0xc0005d3310, 0xc00058ca80, 0xf, 0xc00058ca40, 0xf, 0xc0005f43c0, 0x3d, 0xc0000d8000, 0x3e8, ...)
	<https://ci-beam.apache.org/job/beam_PostCommit_XVR_Samza/ws/src/sdks/go/test/integration/io/xlang/kafka/kafka.go>:48 +0x25c
github.com/apache/beam/sdks/v2/go/test/integration/io/xlang/kafka.WritePipeline(0xc00058ca80, 0xf, 0xc00058ca40, 0xf, 0xc0005f43c0, 0x3d, 0xc0000d8000, 0x3e8, 0x3e8, 0x6270770d)
	<https://ci-beam.apache.org/job/beam_PostCommit_XVR_Samza/ws/src/sdks/go/test/integration/io/xlang/kafka/kafka.go>:70 +0x13f
github.com/apache/beam/sdks/v2/go/test/integration/io/xlang/kafka.TestKafkaIO_BasicReadWrite(0xc0005ca780)
	<https://ci-beam.apache.org/job/beam_PostCommit_XVR_Samza/ws/src/sdks/go/test/integration/io/xlang/kafka/kafka_test.go>:61 +0x115
testing.tRunner(0xc0005ca780, 0xec74c0)
	/home/jenkins/sdk/go1.16.12/src/testing/testing.go:1193 +0xef
created by testing.(*T).Run
	/home/jenkins/sdk/go1.16.12/src/testing/testing.go:1238 +0x2b3
FAIL	github.com/apache/beam/sdks/v2/go/test/integration/io/xlang/kafka	6.057s
FAIL
$ TEST_EXIT_CODE=0
$ cd ../..
$ exit 1
$ exit 1

> Task :runners:samza:job-server:validatesCrossLanguageRunnerGoUsingJava FAILED
> Task :runners:samza:job-server:validatesCrossLanguageRunnerJavaUsingJava
> Task :runners:samza:job-server:validatesCrossLanguageRunnerJavaUsingPython
> Task :runners:samza:job-server:validatesCrossLanguageRunnerJavaUsingPythonOnly

> Task :runners:samza:job-server:validatesCrossLanguageRunnerPythonUsingJava
>>> RUNNING integration tests with pipeline options: --runner=PortableRunner --job_endpoint=localhost:42567 --environment_cache_millis=10000 --experiments=beam_fn_api
>>>   pytest options: 
>>>   collect markers: -m=xlang_transforms
============================= test session starts ==============================
platform linux -- Python 3.9.10, pytest-4.6.11, py-1.11.0, pluggy-0.13.1
rootdir: <https://ci-beam.apache.org/job/beam_PostCommit_XVR_Samza/ws/src/sdks/python,> inifile: pytest.ini
plugins: xdist-1.34.0, timeout-1.4.2, forked-1.4.0, requests-mock-1.9.3
timeout: 600.0s
timeout method: signal
timeout func_only: False
collected 5387 items / 5377 deselected / 1 skipped / 9 selected

apache_beam/io/external/generate_sequence_test.py ...                    [ 30%]
apache_beam/transforms/validate_runner_xlang_test.py .......             [100%]

=============================== warnings summary ===============================
apache_beam/io/filesystems_test.py:54
  <https://ci-beam.apache.org/job/beam_PostCommit_XVR_Samza/ws/src/sdks/python/apache_beam/io/filesystems_test.py>:54: DeprecationWarning: invalid escape sequence \c
    self.assertIsNone(FileSystems.get_scheme('c:\\abc\cdf'))  # pylint: disable=anomalous-backslash-in-string

apache_beam/io/filesystems_test.py:62
  <https://ci-beam.apache.org/job/beam_PostCommit_XVR_Samza/ws/src/sdks/python/apache_beam/io/filesystems_test.py>:62: DeprecationWarning: invalid escape sequence \d
    self.assertTrue(isinstance(FileSystems.get_filesystem('c:\\abc\def'),  # pylint: disable=anomalous-backslash-in-string

<unknown>:54
  <unknown>:54: DeprecationWarning: invalid escape sequence \c

<unknown>:62
  <unknown>:62: DeprecationWarning: invalid escape sequence \d

<https://ci-beam.apache.org/job/beam_PostCommit_XVR_Samza/ws/src/build/gradleenv/1922375555/lib/python3.9/site-packages/tenacity/_asyncio.py>:42
  <https://ci-beam.apache.org/job/beam_PostCommit_XVR_Samza/ws/src/build/gradleenv/1922375555/lib/python3.9/site-packages/tenacity/_asyncio.py>:42: DeprecationWarning: "@coroutine" decorator is deprecated since Python 3.8, use "async def" instead
    def call(self, fn, *args, **kwargs):

-- Docs: https://docs.pytest.org/en/latest/warnings.html
- generated xml file: <https://ci-beam.apache.org/job/beam_PostCommit_XVR_Samza/ws/src/sdks/python/pytest_xlangValidateRunner.xml> -
===== 10 passed, 1 skipped, 5377 deselected, 5 warnings in 298.23 seconds ======

> Task :runners:samza:job-server:validatesCrossLanguageRunnerPythonUsingPython
>>> RUNNING integration tests with pipeline options: --runner=PortableRunner --job_endpoint=localhost:42567 --environment_cache_millis=10000 --experiments=beam_fn_api
>>>   pytest options: 
>>>   collect markers: -m=xlang_transforms
============================= test session starts ==============================
platform linux -- Python 3.9.10, pytest-4.6.11, py-1.11.0, pluggy-0.13.1
rootdir: <https://ci-beam.apache.org/job/beam_PostCommit_XVR_Samza/ws/src/sdks/python,> inifile: pytest.ini
plugins: xdist-1.34.0, timeout-1.4.2, forked-1.4.0, requests-mock-1.9.3
timeout: 600.0s
timeout method: signal
timeout func_only: False
collected 5387 items / 5377 deselected / 1 skipped / 9 selected

apache_beam/io/external/generate_sequence_test.py .ss                    [ 30%]
apache_beam/transforms/validate_runner_xlang_test.py .......             [100%]

=============================== warnings summary ===============================
<unknown>:54
  <unknown>:54: DeprecationWarning: invalid escape sequence \c

<unknown>:62
  <unknown>:62: DeprecationWarning: invalid escape sequence \d

<https://ci-beam.apache.org/job/beam_PostCommit_XVR_Samza/ws/src/build/gradleenv/1922375555/lib/python3.9/site-packages/tenacity/_asyncio.py>:42
  <https://ci-beam.apache.org/job/beam_PostCommit_XVR_Samza/ws/src/build/gradleenv/1922375555/lib/python3.9/site-packages/tenacity/_asyncio.py>:42: DeprecationWarning: "@coroutine" decorator is deprecated since Python 3.8, use "async def" instead
    def call(self, fn, *args, **kwargs):

-- Docs: https://docs.pytest.org/en/latest/warnings.html
- generated xml file: <https://ci-beam.apache.org/job/beam_PostCommit_XVR_Samza/ws/src/sdks/python/pytest_xlangValidateRunner.xml> -
====== 8 passed, 3 skipped, 5377 deselected, 3 warnings in 120.17 seconds ======

> Task :runners:samza:job-server:validatesCrossLanguageRunnerPythonUsingSql
>>> RUNNING integration tests with pipeline options: --runner=PortableRunner --job_endpoint=localhost:42567 --environment_cache_millis=10000 --experiments=beam_fn_api
>>>   pytest options: 
>>>   collect markers: -m=xlang_sql_expansion_service
============================= test session starts ==============================
platform linux -- Python 3.9.10, pytest-4.6.11, py-1.11.0, pluggy-0.13.1
rootdir: <https://ci-beam.apache.org/job/beam_PostCommit_XVR_Samza/ws/src/sdks/python,> inifile: pytest.ini
plugins: xdist-1.34.0, timeout-1.4.2, forked-1.4.0, requests-mock-1.9.3
timeout: 600.0s
timeout method: signal
timeout func_only: False
collected 5387 items / 5378 deselected / 1 skipped / 8 selected

apache_beam/transforms/sql_test.py .........                             [100%]

=============================== warnings summary ===============================
<unknown>:54
  <unknown>:54: DeprecationWarning: invalid escape sequence \c

<unknown>:62
  <unknown>:62: DeprecationWarning: invalid escape sequence \d

<https://ci-beam.apache.org/job/beam_PostCommit_XVR_Samza/ws/src/build/gradleenv/1922375555/lib/python3.9/site-packages/tenacity/_asyncio.py>:42
  <https://ci-beam.apache.org/job/beam_PostCommit_XVR_Samza/ws/src/build/gradleenv/1922375555/lib/python3.9/site-packages/tenacity/_asyncio.py>:42: DeprecationWarning: "@coroutine" decorator is deprecated since Python 3.8, use "async def" instead
    def call(self, fn, *args, **kwargs):

-- Docs: https://docs.pytest.org/en/latest/warnings.html
- generated xml file: <https://ci-beam.apache.org/job/beam_PostCommit_XVR_Samza/ws/src/sdks/python/pytest_xlangSqlValidateRunner.xml> -
====== 9 passed, 1 skipped, 5378 deselected, 3 warnings in 258.73 seconds ======

> Task :runners:samza:job-server:validatesCrossLanguageRunnerCleanup
Stopping expansion service pid: 2094719.
Stopping expansion service pid: 2094720.

> Task :runners:samza:job-server:samzaJobServerCleanup
Stopping job server pid: 2084749.

FAILURE: Build failed with an exception.

* Where:
Build file '<https://ci-beam.apache.org/job/beam_PostCommit_XVR_Samza/ws/src/sdks/go/test/build.gradle'> line: 195

* What went wrong:
Execution failed for task ':runners:samza:job-server:validatesCrossLanguageRunnerGoUsingJava'.
> Process 'command 'sh'' finished with non-zero exit value 1

* Try:
> Run with --stacktrace option to get the stack trace.
> Run with --info or --debug option to get more log output.
> Run with --scan to get full insights.

* Get more help at https://help.gradle.org

Deprecated Gradle features were used in this build, making it incompatible with Gradle 8.0.

You can use '--warning-mode all' to show the individual deprecation warnings and determine if they come from your own scripts or plugins.

See https://docs.gradle.org/7.4/userguide/command_line_interface.html#sec:command_line_warnings

Execution optimizations have been disabled for 1 invalid unit(s) of work during this build to ensure correctness.
Please consult deprecation warnings for more details.

BUILD FAILED in 39m 5s
231 actionable tasks: 35 executed, 196 up-to-date

Publishing build scan...
https://gradle.com/s/opnigqrul7azc

Build step 'Invoke Gradle script' changed build result to FAILURE
Build step 'Invoke Gradle script' marked build as failure

---------------------------------------------------------------------
To unsubscribe, e-mail: builds-unsubscribe@beam.apache.org
For additional commands, e-mail: builds-help@beam.apache.org


Build failed in Jenkins: beam_PostCommit_XVR_Samza #1129

Posted by Apache Jenkins Server <je...@builds.apache.org>.
See <https://ci-beam.apache.org/job/beam_PostCommit_XVR_Samza/1129/display/redirect?page=changes>

Changes:

[yathu] [BEAM-14375] Fix Java Wordcount Dataflow postcommit

[noreply] [BEAM-14390] Set user-agent when pulling licenses to avoid 403s (#17521)

[noreply] [BEAM-8688] Upgrade GCSIO to 2.2.6 (#17486)


------------------------------------------
[...truncated 1.35 MB...]
  coders: <
    key: "EPesNjviRVTimestampedValueCoder"
    value: <
      spec: <
        urn: "beam:coders:javasdk:0.1"
        payload: "\202SNAPPY\000\000\000\000\001\000\000\000\001\000\000\001?\315\003\270\254\355\000\005sr\000Aorg.apache.beam.sdk.values.TimestampedV\001\022\000$>\021\000LCoder\364\376\202p\274iX-\002\000\001L\000\nv\001)\005\030\034t\000\"Lorg/\t]\000/\001],/sdk/coders/\005$\020;xr\000*N\202\000\t%(.Structured\005/8s\277\022\016\325\3246\021\002\000\000xr\000 j9\000\005/\034C\335\325\211\256\274~\370\001/\020psr\000,j1\000(Serializabl\t\277\034\010\364 \216\305ynl\005\327\\\004typet\000\021Ljava/lang/Class\001\300\000&jV\000\024Custom\005\215Pj\260\010\235\013;\035\013\002\000\000xq\000~\000\003vr\000;N;\000Pio.BoundedReadFromUnb\t\021`Source$Shardd\236\240U\205\000j\363\002\000\000xp"
      >
    >
  >
  coders: <
    key: "EPesNjviRVValueWithRecordIdCoder"
    value: <
      spec: <
        urn: "beam:coders:javasdk:0.1"
        payload: "\202SNAPPY\000\000\000\000\001\000\000\000\001\000\000\001\213\311\005\320\254\355\000\005sr\000Corg.apache.beam.sdk.values.ValueWithRecordId$B\022\000LCoder{\343\376bQ\014\204>\002\000\002L\000\007i\t\025\034t\000+Lorg/\t\\\000/\001\\\024/sdk/c\0012(s/ByteArray\005B\014;L\000\n\005u\005\016\010t\000\"n;\000\005$\020;xr\000*N\274\000\t`(.Structured\005/8s\277\022\016\325\3246\021\002\000\000xr\000 j9\000\005/\034C\335\325\211\256\274~\370\001/\020psr\000)j1\0006\312\000\034\351\277\005|\263\3746\333\001:\010r\000&j8\000\024Atomic\005o\034\307\354\265\314\205tPF\0015 q\000~\000\003sr\000-N;\000$io.kafka.K\001\006\000R%\227\005B<I\320\251Y\032\341{#\002\000\001L\000\007kv\005\025\010t\000$nH\001\000K\t&\000;\025s\000\"Ns\000-P\r- j\000\275\271\035\243\3126\002!\353\010\010ke)\277\001\264\000\0022\303\001\005\022\025Y\000(jY\000\030Nullabl)\372\034E\333\0336>\220\247\007\005\307]\022.O\000\001\014,\006sq\000~\000\016q\000~\000\020"
      >
    >
  >
  coders: <
    key: "EPesNjviRVVarIntCoder"
    value: <
      spec: <
        urn: "beam:coders:javasdk:0.1"
        payload: "\202SNAPPY\000\000\000\000\001\000\000\000\001\000\000\000\210\330\001\350\254\355\000\005sr\000&org.apache.beam.sdk.coders.VarIntCoder\300K2\332\251KVh\002\000\000xrr5\000\024Atomic\0055 \307\354\265\314\205tPF\002\0055\000*jj\000$Structured\0059\034s\277\022\016\325\3246\021\t9\000 j9\000\005/0C\335\325\211\256\274~\370\002\000\000xp"
      >
    >
  >
  coders: <
    key: "EPesNjviRVVoidCoder"
    value: <
      spec: <
        urn: "beam:coders:javasdk:0.1"
        payload: "\202SNAPPY\000\000\000\000\001\000\000\000\001\000\000\000\210\326\001\350\254\355\000\005sr\000$org.apache.beam.sdk.coders.VoidCoder\271\277U\233\350\r\257U\002\000\000xr\000&j3\000\024Atomic\0055 \307\354\265\314\205tPF\002\0055\000*j5\000$Structured\0059\034s\277\022\016\325\3246\021\t9\000 j9\000\005/0C\335\325\211\256\274~\370\002\000\000xp"
      >
    >
  >
  coders: <
    key: "c0"
    value: <
      spec: <
        urn: "beam:coder:bytes:v1"
      >
    >
  >
  coders: <
    key: "c1"
    value: <
      spec: <
        urn: "beam:coder:global_window:v1"
      >
    >
  >
  coders: <
    key: "c2"
    value: <
      spec: <
        urn: "beam:go:coder:custom:v1"
        payload: "Cgd2YXJpbnR6EgIIAhpdCklnaXRodWIuY29tL2FwYWNoZS9iZWFtL3Nka3MvdjIvZ28vcGtnL2JlYW0vY29yZS9ydW50aW1lL2NvZGVyeC5lbmNWYXJJbnRaEhAIFiIECBlADyoGCBQSAggIImkKSWdpdGh1Yi5jb20vYXBhY2hlL2JlYW0vc2Rrcy92Mi9nby9wa2cvYmVhbS9jb3JlL3J1bnRpbWUvY29kZXJ4LmRlY1ZhckludFoSHAgWIgQIGUADIgYIFBICCAgqBAgZQA8qBAgZQAE="
      >
    >
  >
  coders: <
    key: "c3"
    value: <
      spec: <
        urn: "beam:coder:length_prefix:v1"
      >
      component_coder_ids: "c2"
    >
  >
  coders: <
    key: "c4"
    value: <
      spec: <
        urn: "beam:coder:kv:v1"
      >
      component_coder_ids: "c0"
      component_coder_ids: "c0"
    >
  >
  environments: <
    key: "EPesNjviRVbeam:env:docker:v1"
    value: <
      urn: "beam:env:docker:v1"
      payload: "\n apache/beam_java8_sdk:2.39.0.dev"
      capabilities: "beam:coder:bytes:v1"
      capabilities: "beam:coder:bool:v1"
      capabilities: "beam:coder:varint:v1"
      capabilities: "beam:coder:string_utf8:v1"
      capabilities: "beam:coder:iterable:v1"
      capabilities: "beam:coder:timer:v1"
      capabilities: "beam:coder:kv:v1"
      capabilities: "beam:coder:length_prefix:v1"
      capabilities: "beam:coder:global_window:v1"
      capabilities: "beam:coder:interval_window:v1"
      capabilities: "beam:coder:custom_window:v1"
      capabilities: "beam:coder:windowed_value:v1"
      capabilities: "beam:coder:double:v1"
      capabilities: "beam:coder:row:v1"
      capabilities: "beam:coder:param_windowed_value:v1"
      capabilities: "beam:coder:state_backed_iterable:v1"
      capabilities: "beam:coder:sharded_key:v1"
      capabilities: "beam:coder:nullable:v1"
      capabilities: "beam:protocol:multi_core_bundle_processing:v1"
      capabilities: "beam:protocol:progress_reporting:v1"
      capabilities: "beam:protocol:harness_monitoring_infos:v1"
      capabilities: "beam:protocol:control_request_elements_embedding:v1"
      capabilities: "beam:protocol:state_caching:v1"
      capabilities: "beam:version:sdk_base:apache/beam_java8_sdk:2.39.0.dev"
      capabilities: "beam:transform:sdf_truncate_sized_restrictions:v1"
      capabilities: "beam:transform:to_string:v1"
      dependencies: <
        type_urn: "beam:artifact:type:file:v1"
        type_payload: "\nL/tmp/artifacts/icedtea-sound-ebvtNFkfFXg4aaYFuDnwKpwDSjzsaZqlqv5iKxPTr-U.jar\022@79bbed34591f15783869a605b839f02a9c034a3cec699aa5aafe622b13d3afe5"
        role_urn: "beam:artifact:role:staging_to:v1"
        role_payload: "\n=icedtea-sound-ebvtNFkfFXg4aaYFuDnwKpwDSjzsaZqlqv5iKxPTr-U.jar"
      >
      dependencies: <
        type_urn: "beam:artifact:type:file:v1"
        type_payload: "\nF/tmp/artifacts/jaccess-ULFTCPsb6cLYZ0f1BG1FQfczmHNaZCx8plXuRDKpBqE.jar\022@50b15308fb1be9c2d86747f5046d4541f73398735a642c7ca655ee4432a906a1"
        role_urn: "beam:artifact:role:staging_to:v1"
        role_payload: "\n7jaccess-ULFTCPsb6cLYZ0f1BG1FQfczmHNaZCx8plXuRDKpBqE.jar"
      >
      dependencies: <
        type_urn: "beam:artifact:type:file:v1"
        type_payload: "\nI/tmp/artifacts/localedata-dUHqyGxaTVCjfTI8MckPYarZ3_mwf62udkxaHi1aKns.jar\022@7541eac86c5a4d50a37d323c31c90f61aad9dff9b07fadae764c5a1e2d5a2a7b"
        role_urn: "beam:artifact:role:staging_to:v1"
        role_payload: "\n:localedata-dUHqyGxaTVCjfTI8MckPYarZ3_mwf62udkxaHi1aKns.jar"
      >
      dependencies: <
        type_urn: "beam:artifact:type:file:v1"
        type_payload: "\nF/tmp/artifacts/nashorn-XdUndQGroXOP9NCsfITpBERYcbbGXVHLjbvNWXCh-3A.jar\022@5dd5277501aba1738ff4d0ac7c84e904445871b6c65d51cb8dbbcd5970a1fb70"
        role_urn: "beam:artifact:role:staging_to:v1"
        role_payload: "\n7nashorn-XdUndQGroXOP9NCsfITpBERYcbbGXVHLjbvNWXCh-3A.jar"
      >
      dependencies: <
        type_urn: "beam:artifact:type:file:v1"
        type_payload: "\nG/tmp/artifacts/cldrdata-YqzuKX1QnLCOo0cwjKRdBhGrip_ltIJZg-APT60tUPA.jar\022@62acee297d509cb08ea347308ca45d0611ab8a9fe5b4825983e00f4fad2d50f0"
        role_urn: "beam:artifact:role:staging_to:v1"
        role_payload: "\n8cldrdata-YqzuKX1QnLCOo0cwjKRdBhGrip_ltIJZg-APT60tUPA.jar"
      >
      dependencies: <
        type_urn: "beam:artifact:type:file:v1"
        type_payload: "\nD/tmp/artifacts/dnsns-dhEp186udEF6X6chZus-RJzWRmzlccxx1_btlXWayVI.jar\022@761129d7ceae74417a5fa72166eb3e449cd6466ce571cc71d7f6ed95759ac952"
        role_urn: "beam:artifact:role:staging_to:v1"
        role_payload: "\n5dnsns-dhEp186udEF6X6chZus-RJzWRmzlccxx1_btlXWayVI.jar"
      >
      dependencies: <
        type_urn: "beam:artifact:type:file:v1"
        type_payload: "\nr/tmp/artifacts/beam-sdks-java-io-expansion-service-2.39.0-SNAPSHOT-qHAniawVaDYKLrqil8029bipkbF9gzRd_IJfPLM1MFI.jar\022@a8702789ac1568360a2ebaa297cd36f5b8a991b17d83345dfc825f3cb3353052"
        role_urn: "beam:artifact:role:staging_to:v1"
        role_payload: "\ncbeam-sdks-java-io-expansion-service-2.39.0-SNAPSHOT-qHAniawVaDYKLrqil8029bipkbF9gzRd_IJfPLM1MFI.jar"
      >
    >
  >
  environments: <
    key: "go"
    value: <
      urn: "beam:env:docker:v1"
      payload: "\n\026apache/beam_go_sdk:dev"
      capabilities: "beam:protocol:progress_reporting:v0"
      capabilities: "beam:protocol:multi_core_bundle_processing:v1"
      capabilities: "beam:version:sdk_base:go"
      capabilities: "beam:coder:bytes:v1"
      capabilities: "beam:coder:bool:v1"
      capabilities: "beam:coder:varint:v1"
      capabilities: "beam:coder:double:v1"
      capabilities: "beam:coder:string_utf8:v1"
      capabilities: "beam:coder:length_prefix:v1"
      capabilities: "beam:coder:kv:v1"
      capabilities: "beam:coder:iterable:v1"
      capabilities: "beam:coder:state_backed_iterable:v1"
      capabilities: "beam:coder:windowed_value:v1"
      capabilities: "beam:coder:global_window:v1"
      capabilities: "beam:coder:interval_window:v1"
      capabilities: "beam:coder:row:v1"
      capabilities: "beam:coder:nullable:v1"
      dependencies: <
        type_urn: "beam:artifact:type:file:v1"
        role_urn: "beam:artifact:role:go_worker_binary:v1"
      >
    >
  >
>
root_transform_ids: "e4"
root_transform_ids: "e5"
root_transform_ids: "s1"
root_transform_ids: "s3"
requirements: "beam:requirement:pardo:splittable_dofn:v1"
2022/05/02 18:00:53 Cross-compiling <https://ci-beam.apache.org/job/beam_PostCommit_XVR_Samza/ws/src/sdks/go/test/integration/io/xlang/kafka/kafka_test.go> as /tmp/worker-2-1651514453392646316
2022/05/02 18:00:54 Prepared job with id: go-testkafkaio_basicreadwrite_d646f69a-8cfe-4df4-b8e0-efdcbc21082f and staging token: go-testkafkaio_basicreadwrite_d646f69a-8cfe-4df4-b8e0-efdcbc21082f
2022/05/02 18:00:55 Staged binary artifact with token: 
2022/05/02 18:00:55 Submitted job: go0testkafkaio0basicreadwrite-jenkins-0502180055-d6e70203_0c455270-c277-4214-8218-d3df910a2929
2022/05/02 18:00:55 Job state: STOPPED
2022/05/02 18:00:55 Job state: STARTING
2022/05/02 18:00:55 Job state: RUNNING
2022/05/02 18:01:05 Job state: DONE
--- PASS: TestKafkaIO_BasicReadWrite (28.45s)
PASS
ok  	github.com/apache/beam/sdks/v2/go/test/integration/io/xlang/kafka	34.493s
FAIL
$ TEST_EXIT_CODE=0
$ cd ../..
$ exit 1
$ exit 1

> Task :runners:samza:job-server:validatesCrossLanguageRunnerGoUsingJava FAILED
> Task :runners:samza:job-server:validatesCrossLanguageRunnerJavaUsingJava
> Task :runners:samza:job-server:validatesCrossLanguageRunnerJavaUsingPython
> Task :runners:samza:job-server:validatesCrossLanguageRunnerJavaUsingPythonOnly
> Task :runners:samza:job-server:validatesCrossLanguageRunnerPythonUsingJava
> Task :runners:samza:job-server:validatesCrossLanguageRunnerPythonUsingPython
> Task :runners:samza:job-server:validatesCrossLanguageRunnerPythonUsingSql
> Task :runners:samza:job-server:validatesCrossLanguageRunnerCleanup
> Task :runners:samza:job-server:samzaJobServerCleanup

FAILURE: Build failed with an exception.

* Where:
Build file '<https://ci-beam.apache.org/job/beam_PostCommit_XVR_Samza/ws/src/sdks/go/test/build.gradle'> line: 195

* What went wrong:
Execution failed for task ':runners:samza:job-server:validatesCrossLanguageRunnerGoUsingJava'.
> Process 'command 'sh'' finished with non-zero exit value 1

* Try:
> Run with --stacktrace option to get the stack trace.
> Run with --info or --debug option to get more log output.
> Run with --scan to get full insights.

* Get more help at https://help.gradle.org

Deprecated Gradle features were used in this build, making it incompatible with Gradle 8.0.

You can use '--warning-mode all' to show the individual deprecation warnings and determine if they come from your own scripts or plugins.

See https://docs.gradle.org/7.4/userguide/command_line_interface.html#sec:command_line_warnings

Execution optimizations have been disabled for 1 invalid unit(s) of work during this build to ensure correctness.
Please consult deprecation warnings for more details.

BUILD FAILED in 37m 56s
246 actionable tasks: 227 executed, 10 from cache, 9 up-to-date

Publishing build scan...
https://gradle.com/s/xsy7mt2gsxje2

Build step 'Invoke Gradle script' changed build result to FAILURE
Build step 'Invoke Gradle script' marked build as failure

---------------------------------------------------------------------
To unsubscribe, e-mail: builds-unsubscribe@beam.apache.org
For additional commands, e-mail: builds-help@beam.apache.org


Build failed in Jenkins: beam_PostCommit_XVR_Samza #1128

Posted by Apache Jenkins Server <je...@builds.apache.org>.
See <https://ci-beam.apache.org/job/beam_PostCommit_XVR_Samza/1128/display/redirect>

Changes:


------------------------------------------
[...truncated 844.29 KB...]
Removing intermediate container 8ea5475c261a
 ---> 67fac2bae3c6
Step 14/31 : RUN pip check || (echo "Container does not include required Beam dependencies or has conflicting dependencies. If Beam dependencies have changed, you need to regenerate base_image_requirements.txt files. See: https://s.apache.org/beam-python-requirements-generate" && exit 1)
 ---> Running in 08a7adc20e5e
No broken requirements found.
Removing intermediate container 08a7adc20e5e
 ---> ee35dd50b37c
Step 15/31 : RUN pip freeze --all
 ---> Running in cb4c9d01d918
absl-py==1.0.0
apache-beam @ file:///opt/apache/beam/tars/apache-beam.tar.gz
astunparse==1.6.3
atomicwrites==1.4.0
attrs==21.4.0
beautifulsoup4==4.10.0
bs4==0.0.1
cached-property==1.5.2
cachetools==4.2.4
certifi==2021.10.8
cffi==1.15.0
charset-normalizer==2.0.12
click==8.0.4
cloudpickle==2.0.0
crcmod==1.7
cryptography==36.0.2
Cython==0.29.28
deprecation==2.1.0
dill==0.3.1.1
docker==5.0.3
docopt==0.6.2
execnet==1.9.0
fastavro==1.4.10
fasteners==0.17.3
flatbuffers==2.0
freezegun==1.2.1
future==0.18.2
gast==0.5.3
google-api-core==1.31.5
google-api-python-client==2.41.0
google-apitools==0.5.31
google-auth==1.35.0
google-auth-httplib2==0.1.0
google-auth-oauthlib==0.4.6
google-cloud-bigquery==2.34.2
google-cloud-bigquery-storage==2.13.0
google-cloud-bigtable==1.7.0
google-cloud-core==1.7.2
google-cloud-datastore==1.15.3
google-cloud-dlp==3.6.2
google-cloud-language==1.3.0
google-cloud-profiler==3.0.7
google-cloud-pubsub==2.11.0
google-cloud-pubsublite==1.4.1
google-cloud-recommendations-ai==0.2.0
google-cloud-spanner==1.19.1
google-cloud-videointelligence==1.16.1
google-cloud-vision==1.0.0
google-crc32c==1.3.0
google-pasta==0.2.0
google-python-cloud-debugger==2.18
google-resumable-media==2.3.2
googleapis-common-protos==1.56.0
greenlet==1.1.2
grpc-google-iam-v1==0.12.3
grpcio==1.44.0
grpcio-gcp==0.2.2
grpcio-status==1.44.0
guppy3==3.1.2
h5py==3.6.0
hdfs==2.6.0
httplib2==0.19.1
idna==3.3
importlib-metadata==4.11.3
joblib==1.1.0
keras==2.8.0
Keras-Preprocessing==1.1.2
libclang==13.0.0
Markdown==3.3.6
mmh3==3.0.0
mock==2.0.0
more-itertools==8.12.0
nltk==3.7
nose==1.3.7
numpy==1.21.5
oauth2client==4.1.3
oauthlib==3.2.0
opt-einsum==3.3.0
orjson==3.6.7
overrides==6.1.0
packaging==21.3
pandas==1.3.5
parameterized==0.7.5
pbr==5.8.1
pip==22.0.4
pluggy==0.13.1
proto-plus==1.20.3
protobuf==3.19.4
psycopg2-binary==2.9.3
py==1.11.0
pyarrow==6.0.1
pyasn1==0.4.8
pyasn1-modules==0.2.8
pycparser==2.21
pydot==1.4.2
PyHamcrest==1.10.1
pymongo==3.12.3
PyMySQL==1.0.2
pyparsing==2.4.7
pytest==4.6.11
pytest-forked==1.4.0
pytest-timeout==1.4.2
pytest-xdist==1.34.0
python-dateutil==2.8.2
python-snappy==0.6.1
pytz==2021.3
PyYAML==6.0
regex==2022.3.15
requests==2.27.1
requests-mock==1.9.3
requests-oauthlib==1.3.1
rsa==4.8
scikit-learn==1.0.2
scipy==1.7.3
setuptools==57.5.0
six==1.16.0
soupsieve==2.3.1
SQLAlchemy==1.4.32
tenacity==5.1.5
tensorboard==2.8.0
tensorboard-data-server==0.6.1
tensorboard-plugin-wit==1.8.1
tensorflow==2.8.0
tensorflow-io-gcs-filesystem==0.24.0
termcolor==1.1.0
testcontainers==3.4.2
tf-estimator-nightly==2.8.0.dev2021122109
threadpoolctl==3.1.0
tqdm==4.63.0
typing-utils==0.1.0
typing_extensions==4.1.1
uritemplate==4.1.1
urllib3==1.26.9
wcwidth==0.2.5
websocket-client==1.3.1
Werkzeug==2.0.3
wheel==0.37.1
wrapt==1.14.0
zipp==3.7.0
Removing intermediate container cb4c9d01d918
 ---> 8130de1c7c09
Step 16/31 : COPY target/LICENSE /opt/apache/beam/
 ---> aac40fe21c8c
Step 17/31 : COPY target/LICENSE.python /opt/apache/beam/
 ---> 85f3c396be4c
Step 18/31 : COPY target/NOTICE /opt/apache/beam/
 ---> 17db852b8cd3
Step 19/31 : COPY target/launcher/linux_amd64/boot /opt/apache/beam/
 ---> eba329740a23
Step 20/31 : ENTRYPOINT ["/opt/apache/beam/boot"]
 ---> Running in 1bafc93d1763
Removing intermediate container 1bafc93d1763
 ---> 2a0fc1fdb76b
Step 21/31 : FROM beam as third_party_licenses
 ---> 2a0fc1fdb76b
Step 22/31 : ARG pull_licenses
 ---> Running in 2612db7b0646
Removing intermediate container 2612db7b0646
 ---> 76ebfbcf7856
Step 23/31 : COPY target/license_scripts /tmp/license_scripts/
 ---> 9302ebe6cdcd
Step 24/31 : COPY target/LICENSE target/go-licenses/* /opt/apache/beam/third_party_licenses/golang/
 ---> a142306f14d3
Step 25/31 : RUN rm /opt/apache/beam/third_party_licenses/golang/LICENSE
 ---> Running in 9cea8c7602aa
Removing intermediate container 9cea8c7602aa
 ---> eddc40642eac
Step 26/31 : COPY target/license_scripts /tmp/license_scripts/
 ---> 7ca96e010718
Step 27/31 : RUN if [ "$pull_licenses" = "true" ] ; then       pip install 'pip-licenses<4.0.0' pyyaml tenacity &&       python /tmp/license_scripts/pull_licenses_py.py ;     fi
 ---> Running in a13fdc5a9a56
Collecting pip-licenses<4.0.0
  Downloading pip_licenses-3.5.4-py3-none-any.whl (17 kB)
Requirement already satisfied: pyyaml in /usr/local/lib/python3.7/site-packages (6.0)
Requirement already satisfied: tenacity in /usr/local/lib/python3.7/site-packages (5.1.5)
Collecting PTable
  Downloading PTable-0.9.2.tar.gz (31 kB)
  Preparing metadata (setup.py): started
  Preparing metadata (setup.py): finished with status 'done'
Requirement already satisfied: six>=1.9.0 in /usr/local/lib/python3.7/site-packages (from tenacity) (1.16.0)
Building wheels for collected packages: PTable
  Building wheel for PTable (setup.py): started
  Building wheel for PTable (setup.py): finished with status 'done'
  Created wheel for PTable: filename=PTable-0.9.2-py3-none-any.whl size=22925 sha256=28c5e0c044a9fc4c48e658ef40d9937a1d8fec132a5bef55e7f85e7e568b3f6f
  Stored in directory: /root/.cache/pip/wheels/33/df/2f/674985b3f8a2de3f96357d1eadef5110f74fa91b3785e52a54
Successfully built PTable
Installing collected packages: PTable, pip-licenses
Successfully installed PTable-0.9.2 pip-licenses-3.5.4
WARNING: Running pip as the 'root' user can result in broken permissions and conflicting behaviour with the system package manager. It is recommended to use a virtual environment instead: https://pip.pypa.io/warnings/venv
Skip pulling license for  bs4
INFO:root:Successfully pulled licenses for 135 dependencies
Removing intermediate container a13fdc5a9a56
 ---> 64c6f5881589
Step 28/31 : FROM beam
 ---> 2a0fc1fdb76b
Step 29/31 : ARG pull_licenses
 ---> Running in f01625f9d574
Removing intermediate container f01625f9d574
 ---> aeadeb017260
Step 30/31 : COPY --from=third_party_licenses /opt/apache/beam/third_party_licenses /opt/apache/beam/third_party_licenses
 ---> 063930ed2b28
Step 31/31 : RUN if [ "$pull_licenses" != "true" ] ; then       rm -rf /opt/apache/beam/third_party_licenses ;     fi
 ---> Running in 6cb0729590e1
Removing intermediate container 6cb0729590e1
 ---> c6748e504612
Successfully built c6748e504612
Successfully tagged apache/beam_python3.7_sdk:2.39.0.dev

> Task :runners:samza:job-server:samzaJobServerCleanup

FAILURE: Build failed with an exception.

* What went wrong:
Execution failed for task ':sdks:java:container:pullLicenses'.
> Process 'command './license_scripts/license_script.sh'' finished with non-zero exit value 1

* Try:
> Run with --stacktrace option to get the stack trace.
> Run with --info or --debug option to get more log output.
> Run with --scan to get full insights.

* Get more help at https://help.gradle.org

Deprecated Gradle features were used in this build, making it incompatible with Gradle 8.0.

You can use '--warning-mode all' to show the individual deprecation warnings and determine if they come from your own scripts or plugins.

See https://docs.gradle.org/7.4/userguide/command_line_interface.html#sec:command_line_warnings

Execution optimizations have been disabled for 1 invalid unit(s) of work during this build to ensure correctness.
Please consult deprecation warnings for more details.

BUILD FAILED in 9m 7s
234 actionable tasks: 151 executed, 72 from cache, 11 up-to-date

Publishing build scan...
https://gradle.com/s/r2oqmez42bwca

Build step 'Invoke Gradle script' changed build result to FAILURE
Build step 'Invoke Gradle script' marked build as failure

---------------------------------------------------------------------
To unsubscribe, e-mail: builds-unsubscribe@beam.apache.org
For additional commands, e-mail: builds-help@beam.apache.org


Build failed in Jenkins: beam_PostCommit_XVR_Samza #1127

Posted by Apache Jenkins Server <je...@builds.apache.org>.
See <https://ci-beam.apache.org/job/beam_PostCommit_XVR_Samza/1127/display/redirect?page=changes>

Changes:

[noreply] [BEAM-11105] Add manual watermark estimation (#17475)


------------------------------------------
[...truncated 493.76 KB...]
Traceback (most recent call last):
  File "<https://ci-beam.apache.org/job/beam_PostCommit_XVR_Samza/ws/src/sdks/java/container/license_scripts/pull_licenses_java.py",> line 58, in pull_from_url
    url_read = urlopen(url)
  File "/usr/lib/python3.7/urllib/request.py", line 222, in urlopen
    return opener.open(url, data, timeout)
  File "/usr/lib/python3.7/urllib/request.py", line 531, in open
    response = meth(req, response)
  File "/usr/lib/python3.7/urllib/request.py", line 641, in http_response
    'http', request, response, code, msg, hdrs)
  File "/usr/lib/python3.7/urllib/request.py", line 569, in error
    return self._call_chain(*args)
  File "/usr/lib/python3.7/urllib/request.py", line 503, in _call_chain
    result = func(*args)
  File "/usr/lib/python3.7/urllib/request.py", line 649, in http_error_default
    raise HTTPError(req.full_url, code, msg, hdrs, fp)
urllib.error.HTTPError: HTTP Error 403: Forbidden
ERROR:root:Invalid url for kafka-1.16.3: http://opensource.org/licenses/MIT. Retrying...
Traceback (most recent call last):
  File "<https://ci-beam.apache.org/job/beam_PostCommit_XVR_Samza/ws/src/sdks/java/container/license_scripts/pull_licenses_java.py",> line 58, in pull_from_url
    url_read = urlopen(url)
  File "/usr/lib/python3.7/urllib/request.py", line 222, in urlopen
    return opener.open(url, data, timeout)
  File "/usr/lib/python3.7/urllib/request.py", line 531, in open
    response = meth(req, response)
  File "/usr/lib/python3.7/urllib/request.py", line 641, in http_response
    'http', request, response, code, msg, hdrs)
  File "/usr/lib/python3.7/urllib/request.py", line 569, in error
    return self._call_chain(*args)
  File "/usr/lib/python3.7/urllib/request.py", line 503, in _call_chain
    result = func(*args)
  File "/usr/lib/python3.7/urllib/request.py", line 649, in http_error_default
    raise HTTPError(req.full_url, code, msg, hdrs, fp)
urllib.error.HTTPError: HTTP Error 403: Forbidden
ERROR:root:Invalid url for kafka-1.16.3: http://opensource.org/licenses/MIT. Retrying...
Traceback (most recent call last):
  File "<https://ci-beam.apache.org/job/beam_PostCommit_XVR_Samza/ws/src/sdks/java/container/license_scripts/pull_licenses_java.py",> line 58, in pull_from_url
    url_read = urlopen(url)
  File "/usr/lib/python3.7/urllib/request.py", line 222, in urlopen
    return opener.open(url, data, timeout)
  File "/usr/lib/python3.7/urllib/request.py", line 531, in open
    response = meth(req, response)
  File "/usr/lib/python3.7/urllib/request.py", line 641, in http_response
    'http', request, response, code, msg, hdrs)
  File "/usr/lib/python3.7/urllib/request.py", line 569, in error
    return self._call_chain(*args)
  File "/usr/lib/python3.7/urllib/request.py", line 503, in _call_chain
    result = func(*args)
  File "/usr/lib/python3.7/urllib/request.py", line 649, in http_error_default
    raise HTTPError(req.full_url, code, msg, hdrs, fp)
urllib.error.HTTPError: HTTP Error 403: Forbidden
ERROR:root:Invalid url for kafka-1.16.3: http://opensource.org/licenses/MIT. Retrying...
Traceback (most recent call last):
  File "<https://ci-beam.apache.org/job/beam_PostCommit_XVR_Samza/ws/src/sdks/java/container/license_scripts/pull_licenses_java.py",> line 58, in pull_from_url
    url_read = urlopen(url)
  File "/usr/lib/python3.7/urllib/request.py", line 222, in urlopen
    return opener.open(url, data, timeout)
  File "/usr/lib/python3.7/urllib/request.py", line 531, in open
    response = meth(req, response)
  File "/usr/lib/python3.7/urllib/request.py", line 641, in http_response
    'http', request, response, code, msg, hdrs)
  File "/usr/lib/python3.7/urllib/request.py", line 569, in error
    return self._call_chain(*args)
  File "/usr/lib/python3.7/urllib/request.py", line 503, in _call_chain
    result = func(*args)
  File "/usr/lib/python3.7/urllib/request.py", line 649, in http_error_default
    raise HTTPError(req.full_url, code, msg, hdrs, fp)
urllib.error.HTTPError: HTTP Error 403: Forbidden
ERROR:root:Invalid url for kafka-1.16.3: http://opensource.org/licenses/MIT. Retrying...
Traceback (most recent call last):
  File "<https://ci-beam.apache.org/job/beam_PostCommit_XVR_Samza/ws/src/sdks/java/container/license_scripts/pull_licenses_java.py",> line 58, in pull_from_url
    url_read = urlopen(url)
  File "/usr/lib/python3.7/urllib/request.py", line 222, in urlopen
    return opener.open(url, data, timeout)
  File "/usr/lib/python3.7/urllib/request.py", line 531, in open
    response = meth(req, response)
  File "/usr/lib/python3.7/urllib/request.py", line 641, in http_response
    'http', request, response, code, msg, hdrs)
  File "/usr/lib/python3.7/urllib/request.py", line 569, in error
    return self._call_chain(*args)
  File "/usr/lib/python3.7/urllib/request.py", line 503, in _call_chain
    result = func(*args)
  File "/usr/lib/python3.7/urllib/request.py", line 649, in http_error_default
    raise HTTPError(req.full_url, code, msg, hdrs, fp)
urllib.error.HTTPError: HTTP Error 403: Forbidden
ERROR:root:Invalid url for kafka-1.16.3: http://opensource.org/licenses/MIT. Retrying...
Traceback (most recent call last):
  File "<https://ci-beam.apache.org/job/beam_PostCommit_XVR_Samza/ws/src/sdks/java/container/license_scripts/pull_licenses_java.py",> line 58, in pull_from_url
    url_read = urlopen(url)
  File "/usr/lib/python3.7/urllib/request.py", line 222, in urlopen
    return opener.open(url, data, timeout)
  File "/usr/lib/python3.7/urllib/request.py", line 531, in open
    response = meth(req, response)
  File "/usr/lib/python3.7/urllib/request.py", line 641, in http_response
    'http', request, response, code, msg, hdrs)
  File "/usr/lib/python3.7/urllib/request.py", line 569, in error
    return self._call_chain(*args)
  File "/usr/lib/python3.7/urllib/request.py", line 503, in _call_chain
    result = func(*args)
  File "/usr/lib/python3.7/urllib/request.py", line 649, in http_error_default
    raise HTTPError(req.full_url, code, msg, hdrs, fp)
urllib.error.HTTPError: HTTP Error 403: Forbidden
ERROR:root:Invalid url for kafka-1.16.3: http://opensource.org/licenses/MIT. Retrying...

> Task :sdks:python:container:py37:docker
Collecting tensorflow-io-gcs-filesystem==0.24.0
  Downloading tensorflow_io_gcs_filesystem-0.24.0-cp37-cp37m-manylinux_2_12_x86_64.manylinux2010_x86_64.whl (2.1 MB)
     ━━━━━━━━━━━━━━━━━━━━━━━━━━━━━━━━━━━━━━━━ 2.1/2.1 MB 76.8 MB/s eta 0:00:00
Collecting termcolor==1.1.0
  Downloading termcolor-1.1.0.tar.gz (3.9 kB)
  Preparing metadata (setup.py): started
  Preparing metadata (setup.py): finished with status 'done'
Collecting testcontainers==3.4.2
  Downloading testcontainers-3.4.2-py2.py3-none-any.whl (31 kB)
Collecting tf-estimator-nightly==2.8.0.dev2021122109
  Downloading tf_estimator_nightly-2.8.0.dev2021122109-py2.py3-none-any.whl (462 kB)
     ━━━━━━━━━━━━━━━━━━━━━━━━━━━━━━━━━━━━━━ 462.5/462.5 KB 41.9 MB/s eta 0:00:00
Collecting threadpoolctl==3.1.0
  Downloading threadpoolctl-3.1.0-py3-none-any.whl (14 kB)
Collecting tqdm==4.63.0
  Downloading tqdm-4.63.0-py2.py3-none-any.whl (76 kB)
     ━━━━━━━━━━━━━━━━━━━━━━━━━━━━━━━━━━━━━━━━ 76.6/76.6 KB 12.1 MB/s eta 0:00:00
Collecting typing-utils==0.1.0
  Downloading typing_utils-0.1.0-py3-none-any.whl (10 kB)
Collecting typing_extensions==4.1.1
  Downloading typing_extensions-4.1.1-py3-none-any.whl (26 kB)
Collecting uritemplate==4.1.1
  Downloading uritemplate-4.1.1-py2.py3-none-any.whl (10 kB)
Collecting urllib3==1.26.9
  Downloading urllib3-1.26.9-py2.py3-none-any.whl (138 kB)
     ━━━━━━━━━━━━━━━━━━━━━━━━━━━━━━━━━━━━━━ 139.0/139.0 KB 20.8 MB/s eta 0:00:00
Collecting wcwidth==0.2.5
  Downloading wcwidth-0.2.5-py2.py3-none-any.whl (30 kB)
Collecting websocket-client==1.3.1
  Downloading websocket_client-1.3.1-py3-none-any.whl (54 kB)
     ━━━━━━━━━━━━━━━━━━━━━━━━━━━━━━━━━━━━━━━━ 54.2/54.2 KB 8.9 MB/s eta 0:00:00
Collecting Werkzeug==2.0.3
  Downloading Werkzeug-2.0.3-py3-none-any.whl (289 kB)
     ━━━━━━━━━━━━━━━━━━━━━━━━━━━━━━━━━━━━━━ 289.2/289.2 KB 32.7 MB/s eta 0:00:00
Collecting wrapt==1.14.0
  Downloading wrapt-1.14.0-cp37-cp37m-manylinux_2_5_x86_64.manylinux1_x86_64.manylinux_2_17_x86_64.manylinux2014_x86_64.whl (75 kB)
     ━━━━━━━━━━━━━━━━━━━━━━━━━━━━━━━━━━━━━━━━ 75.2/75.2 KB 10.6 MB/s eta 0:00:00
Collecting zipp==3.7.0
  Downloading zipp-3.7.0-py3-none-any.whl (5.3 kB)
Building wheels for collected packages: bs4, crcmod, dill, docopt, future, google-apitools, google-cloud-profiler, grpc-google-iam-v1, termcolor
  Building wheel for bs4 (setup.py): started
  Building wheel for bs4 (setup.py): finished with status 'done'
  Created wheel for bs4: filename=bs4-0.0.1-py3-none-any.whl size=1272 sha256=e8a0e8540047a05279228459030ce1bccf5566562895d989a9365f0b7066d91f
  Stored in directory: /root/.cache/pip/wheels/0a/9e/ba/20e5bbc1afef3a491f0b3bb74d508f99403aabe76eda2167ca
  Building wheel for crcmod (setup.py): started
  Building wheel for crcmod (setup.py): finished with status 'done'
  Created wheel for crcmod: filename=crcmod-1.7-cp37-cp37m-linux_x86_64.whl size=30705 sha256=6999cb92c8dbc28b0dbd749d3a091a2d7c9dc74969e93f69f9ee47bf14eaab27
  Stored in directory: /root/.cache/pip/wheels/dc/9a/e9/49e627353476cec8484343c4ab656f1e0d783ee77b9dde2d1f
  Building wheel for dill (setup.py): started
  Building wheel for dill (setup.py): finished with status 'done'
  Created wheel for dill: filename=dill-0.3.1.1-py3-none-any.whl size=78544 sha256=73b42a9e1956be0572deada67f5f8a45c2817cea958db3c52e0c716bf02a2c9c
  Stored in directory: /root/.cache/pip/wheels/a4/61/fd/c57e374e580aa78a45ed78d5859b3a44436af17e22ca53284f
  Building wheel for docopt (setup.py): started
  Building wheel for docopt (setup.py): finished with status 'done'
  Created wheel for docopt: filename=docopt-0.6.2-py2.py3-none-any.whl size=13723 sha256=8b6649e19fec0ce7d22db34c803518c0656d608fd1b8f493f5ae0d5a6b03aa63
  Stored in directory: /root/.cache/pip/wheels/72/b0/3f/1d95f96ff986c7dfffe46ce2be4062f38ebd04b506c77c81b9
  Building wheel for future (setup.py): started
  Building wheel for future (setup.py): finished with status 'done'
  Created wheel for future: filename=future-0.18.2-py3-none-any.whl size=491070 sha256=032ca37ca63f0fb54abc2def934dcfe43eda40962e4802f26491c5b2bf0ebb76
  Stored in directory: /root/.cache/pip/wheels/56/b0/fe/4410d17b32f1f0c3cf54cdfb2bc04d7b4b8f4ae377e2229ba0
  Building wheel for google-apitools (setup.py): started
  Building wheel for google-apitools (setup.py): finished with status 'done'
  Created wheel for google-apitools: filename=google_apitools-0.5.31-py3-none-any.whl size=131039 sha256=c1902851ba592e8d84dab4536388a8b96b7533ac071a9c1d6343907c3063e586
  Stored in directory: /root/.cache/pip/wheels/19/b5/2f/1cc3cf2b31e7a9cd1508731212526d9550271274d351c96f16
  Building wheel for google-cloud-profiler (setup.py): started
  Building wheel for google-cloud-profiler (setup.py): finished with status 'done'
  Created wheel for google-cloud-profiler: filename=google_cloud_profiler-3.0.7-cp37-cp37m-linux_x86_64.whl size=736728 sha256=4d926fdc24f4d97e40baad21a1fe5f80ef9726af06c4934aaa990c308d240caa
  Stored in directory: /root/.cache/pip/wheels/2c/23/76/4731bc57d1175097a1e678491bcf817fcfecdd5932f44f12fa
  Building wheel for grpc-google-iam-v1 (setup.py): started
  Building wheel for grpc-google-iam-v1 (setup.py): finished with status 'done'
  Created wheel for grpc-google-iam-v1: filename=grpc_google_iam_v1-0.12.3-py3-none-any.whl size=18515 sha256=009457c4d07f15dc21461163166d96f5ac1cc84b1a8fd2d789f46f0846df3d0e
  Stored in directory: /root/.cache/pip/wheels/b9/ee/67/2e444183030cb8d31ce8b34cee34a7afdbd3ba5959ea846380
  Building wheel for termcolor (setup.py): started
  Building wheel for termcolor (setup.py): finished with status 'done'
  Created wheel for termcolor: filename=termcolor-1.1.0-py3-none-any.whl size=4848 sha256=a746fbb4b4f9816c30806cb61466da93bcc7052b33358c9a38246a232b7d97c8
  Stored in directory: /root/.cache/pip/wheels/3f/e3/ec/8a8336ff196023622fbcb36de0c5a5c218cbb24111d1d4c7f2
Successfully built bs4 crcmod dill docopt future google-apitools google-cloud-profiler grpc-google-iam-v1 termcolor
Installing collected packages: wcwidth, tf-estimator-nightly, termcolor, tensorflow, tensorboard-plugin-wit, tenacity, requests-mock, pytz, python-snappy, pytest-timeout, pyasn1-modules, pyasn1, parameterized, oauth2client, nose, mock, mmh3, libclang, Keras-Preprocessing, keras, httplib2, hdfs, grpcio-gcp, grpc-google-iam-v1, google-python-cloud-debugger, google-pasta, google-cloud-profiler, google-auth-httplib2, flatbuffers, docopt, deprecation, crcmod, cffi, certifi, cached-property, bs4, astunparse, zipp, wrapt, Werkzeug, websocket-client, urllib3, uritemplate, typing-utils, typing_extensions, tqdm, threadpoolctl, testcontainers, tensorflow-io-gcs-filesystem, tensorboard-data-server, tensorboard, SQLAlchemy, soupsieve, six, scipy, scikit-learn, rsa, requests-oauthlib, requests, regex, PyYAML, python-dateutil, pytest-xdist, pytest-forked, pytest, pyparsing, PyMySQL, pymongo, PyHamcrest, pydot, pycparser, pyarrow, py, psycopg2-binary, protobuf, proto-plus, pluggy, pbr, pandas, packaging, overrides, orjson, opt-einsum, oauthlib, numpy, nltk, more-itertools, Markdown, joblib, importlib-metadata, idna, h5py, guppy3, grpcio-status, grpcio, greenlet, googleapis-common-protos, google-resumable-media, google-crc32c, google-cloud-vision, google-cloud-videointelligence, google-cloud-spanner, google-cloud-recommendations-ai, google-cloud-pubsublite, google-cloud-pubsub, google-cloud-language, google-cloud-dlp, google-cloud-datastore, google-cloud-core, google-cloud-bigtable, google-cloud-bigquery-storage, google-cloud-bigquery, google-auth-oauthlib, google-auth, google-apitools, google-api-python-client, google-api-core, gast, future, freezegun, fasteners, fastavro, execnet, docker, dill, Cython, cryptography, cloudpickle, click, charset-normalizer, cachetools, beautifulsoup4, attrs, atomicwrites, absl-py

> Task :sdks:java:container:pullLicenses FAILED
Traceback (most recent call last):
  File "<https://ci-beam.apache.org/job/beam_PostCommit_XVR_Samza/ws/src/sdks/java/container/license_scripts/pull_licenses_java.py",> line 58, in pull_from_url
    url_read = urlopen(url)
  File "/usr/lib/python3.7/urllib/request.py", line 222, in urlopen
    return opener.open(url, data, timeout)
  File "/usr/lib/python3.7/urllib/request.py", line 531, in open
    response = meth(req, response)
  File "/usr/lib/python3.7/urllib/request.py", line 641, in http_response
    'http', request, response, code, msg, hdrs)
  File "/usr/lib/python3.7/urllib/request.py", line 569, in error
    return self._call_chain(*args)
  File "/usr/lib/python3.7/urllib/request.py", line 503, in _call_chain
    result = func(*args)
  File "/usr/lib/python3.7/urllib/request.py", line 649, in http_error_default
    raise HTTPError(req.full_url, code, msg, hdrs, fp)
urllib.error.HTTPError: HTTP Error 403: Forbidden
ERROR:root:Invalid url for kafka-1.16.3: http://opensource.org/licenses/MIT after 9 retries.
ERROR:root:['reflectasm-1.07', 'system-rules-1.19.0', 'google-auth-library-oauth2-http-1.4.0', 'zstd-jni-1.4.3-1', 'software-and-algorithms-1.0', 'kryo-2.21', 'google-auth-library-credentials-1.4.0', 'junit-quickcheck-generators-0.8', 'protobuf-java-util-3.19.3', 'classgraph-4.8.104', 'protobuf-java-3.19.3', 'grpc-context-1.44.0', 'grpc-protobuf-1.44.0', 'grpc-alts-1.44.0', 'perfmark-api-0.23.0', 'junit-dep-4.11', 'zstd-jni-1.5.2-1', 'minlog-1.2', 'junit-quickcheck-core-0.8', 'checker-compat-qual-2.5.3', 'grpc-core-1.44.0', 'grpc-protobuf-lite-1.44.0', 'hamcrest-2.1', 'grpc-api-1.44.0', 'pcollections-2.1.2', 'duct-tape-1.0.8', 'slf4j-jdk14-1.7.30', 'database-commons-1.16.3', 'mysql-1.16.3', 'checker-compat-qual-2.5.5', 'grpc-grpclb-1.44.0', 'grpc-stub-1.44.0', 'grpc-auth-1.44.0', 'slf4j-api-1.7.30', 'slf4j-simple-1.7.30', 'jdbc-1.16.3', 'postgresql-1.16.3', 'kafka-1.16.3']
ERROR:root:**************************************** Licenses were not able to be pulled automatically for some dependencies. Please search source code of the dependencies on the internet and add "license" and "notice" (if available) field to <https://ci-beam.apache.org/job/beam_PostCommit_XVR_Samza/ws/src/sdks/java/container/license_scripts/dep_urls_java.yaml> for each missing license. Dependency List: [checker-compat-qual-2.5.3,checker-compat-qual-2.5.5,classgraph-4.8.104,database-commons-1.16.3,duct-tape-1.0.8,google-auth-library-credentials-1.4.0,google-auth-library-oauth2-http-1.4.0,grpc-alts-1.44.0,grpc-api-1.44.0,grpc-auth-1.44.0,grpc-context-1.44.0,grpc-core-1.44.0,grpc-grpclb-1.44.0,grpc-protobuf-1.44.0,grpc-protobuf-lite-1.44.0,grpc-stub-1.44.0,hamcrest-2.1,jdbc-1.16.3,junit-dep-4.11,junit-quickcheck-core-0.8,junit-quickcheck-generators-0.8,kafka-1.16.3,kryo-2.21,minlog-1.2,mysql-1.16.3,pcollections-2.1.2,perfmark-api-0.23.0,postgresql-1.16.3,protobuf-java-3.19.3,protobuf-java-util-3.19.3,reflectasm-1.07,slf4j-api-1.7.30,slf4j-jdk14-1.7.30,slf4j-simple-1.7.30,software-and-algorithms-1.0,system-rules-1.19.0,zstd-jni-1.4.3-1,zstd-jni-1.5.2-1]
INFO:root:pull_licenses_java.py failed. It took 162.794408 seconds with 16 threads.
Traceback (most recent call last):
  File "<https://ci-beam.apache.org/job/beam_PostCommit_XVR_Samza/ws/src/sdks/java/container/license_scripts/pull_licenses_java.py",> line 322, in <module>
    error_msg)
RuntimeError: ('1 error(s) occurred.', ['**************************************** Licenses were not able to be pulled automatically for some dependencies. Please search source code of the dependencies on the internet and add "license" and "notice" (if available) field to <https://ci-beam.apache.org/job/beam_PostCommit_XVR_Samza/ws/src/sdks/java/container/license_scripts/dep_urls_java.yaml> for each missing license. Dependency List: [checker-compat-qual-2.5.3,checker-compat-qual-2.5.5,classgraph-4.8.104,database-commons-1.16.3,duct-tape-1.0.8,google-auth-library-credentials-1.4.0,google-auth-library-oauth2-http-1.4.0,grpc-alts-1.44.0,grpc-api-1.44.0,grpc-auth-1.44.0,grpc-context-1.44.0,grpc-core-1.44.0,grpc-grpclb-1.44.0,grpc-protobuf-1.44.0,grpc-protobuf-lite-1.44.0,grpc-stub-1.44.0,hamcrest-2.1,jdbc-1.16.3,junit-dep-4.11,junit-quickcheck-core-0.8,junit-quickcheck-generators-0.8,kafka-1.16.3,kryo-2.21,minlog-1.2,mysql-1.16.3,pcollections-2.1.2,perfmark-api-0.23.0,postgresql-1.16.3,protobuf-java-3.19.3,protobuf-java-util-3.19.3,reflectasm-1.07,slf4j-api-1.7.30,slf4j-jdk14-1.7.30,slf4j-simple-1.7.30,software-and-algorithms-1.0,system-rules-1.19.0,zstd-jni-1.4.3-1,zstd-jni-1.5.2-1]'])

> Task :sdks:java:container:goPrepare UP-TO-DATE
> Task :sdks:java:container:goBuild

> Task :sdks:java:container:java8:copySdkHarnessLauncher
Execution optimizations have been disabled for task ':sdks:java:container:java8:copySdkHarnessLauncher' to ensure correctness due to the following reasons:
  - Gradle detected a problem with the following location: '<https://ci-beam.apache.org/job/beam_PostCommit_XVR_Samza/ws/src/sdks/java/container/build/target'.> Reason: Task ':sdks:java:container:java8:copySdkHarnessLauncher' uses this output of task ':sdks:java:container:downloadCloudProfilerAgent' without declaring an explicit or implicit dependency. This can lead to incorrect results being produced, depending on what order the tasks are executed. Please refer to https://docs.gradle.org/7.4/userguide/validation_problems.html#implicit_dependency for more details about this problem.
  - Gradle detected a problem with the following location: '<https://ci-beam.apache.org/job/beam_PostCommit_XVR_Samza/ws/src/sdks/java/container/build/target'.> Reason: Task ':sdks:java:container:java8:copySdkHarnessLauncher' uses this output of task ':sdks:java:container:pullLicenses' without declaring an explicit or implicit dependency. This can lead to incorrect results being produced, depending on what order the tasks are executed. Please refer to https://docs.gradle.org/7.4/userguide/validation_problems.html#implicit_dependency for more details about this problem.

> Task :runners:samza:job-server:samzaJobServerCleanup

FAILURE: Build failed with an exception.

* What went wrong:
Execution failed for task ':sdks:java:container:pullLicenses'.
> Process 'command './license_scripts/license_script.sh'' finished with non-zero exit value 1

* Try:
> Run with --stacktrace option to get the stack trace.
> Run with --info or --debug option to get more log output.
> Run with --scan to get full insights.

* Get more help at https://help.gradle.org

Deprecated Gradle features were used in this build, making it incompatible with Gradle 8.0.

You can use '--warning-mode all' to show the individual deprecation warnings and determine if they come from your own scripts or plugins.

See https://docs.gradle.org/7.4/userguide/command_line_interface.html#sec:command_line_warnings

Execution optimizations have been disabled for 1 invalid unit(s) of work during this build to ensure correctness.
Please consult deprecation warnings for more details.

BUILD FAILED in 9m 5s
234 actionable tasks: 151 executed, 72 from cache, 11 up-to-date

Publishing build scan...
https://gradle.com/s/da7zbfjljqc6a

Build step 'Invoke Gradle script' changed build result to FAILURE
Build step 'Invoke Gradle script' marked build as failure

---------------------------------------------------------------------
To unsubscribe, e-mail: builds-unsubscribe@beam.apache.org
For additional commands, e-mail: builds-help@beam.apache.org