You are viewing a plain text version of this content. The canonical link for it is here.
Posted to builds@solr.apache.org by Apache Jenkins Server <je...@builds.apache.org> on 2024/02/20 18:31:40 UTC
[JENKINS] Solr » Solr-Smoketest-9.4 - Build # 221 - Failure!
Build: https://ci-builds.apache.org/job/Solr/job/Solr-Smoketest-9.4/221/
Log:
Started by timer
Running as SYSTEM
[EnvInject] - Loading node environment variables.
Building remotely on lucene-solr-1 (solr lucene) in workspace /home/jenkins/jenkins-slave/workspace/Solr/Solr-Smoketest-9.4
[WS-CLEANUP] Deleting project workspace...
[WS-CLEANUP] Deferred wipeout is used...
[WS-CLEANUP] Done
The recommended git tool is: NONE
No credentials specified
Cloning the remote Git repository
Cloning repository https://github.com/apache/solr.git
> git init /home/jenkins/jenkins-slave/workspace/Solr/Solr-Smoketest-9.4 # timeout=10
Fetching upstream changes from https://github.com/apache/solr.git
> git --version # timeout=10
> git --version # 'git version 2.17.1'
> git fetch --tags --progress -- https://github.com/apache/solr.git +refs/heads/*:refs/remotes/origin/* # timeout=10
> git config remote.origin.url https://github.com/apache/solr.git # timeout=10
> git config --add remote.origin.fetch +refs/heads/*:refs/remotes/origin/* # timeout=10
Avoid second fetch
> git rev-parse origin/branch_9_4^{commit} # timeout=10
Checking out Revision ba5a79afcdac73e87dfa28ea9eeeb7c5951c479e (origin/branch_9_4)
> git config core.sparsecheckout # timeout=10
> git checkout -f ba5a79afcdac73e87dfa28ea9eeeb7c5951c479e # timeout=10
> git branch -a -v --no-abbrev # timeout=10
> git checkout -b branch_9_4 ba5a79afcdac73e87dfa28ea9eeeb7c5951c479e # timeout=10
Commit message: "Add next bugfix version 9.4.2"
> git rev-list --no-walk ba5a79afcdac73e87dfa28ea9eeeb7c5951c479e # timeout=10
No emails were triggered.
provisioning config files...
copy managed file [gradle.properties] to file:/home/jenkins/jenkins-slave/workspace/Solr/Solr-Smoketest-9.4/gradle.properties
[Gradle] - Launching build.
[Solr-Smoketest-9.4] $ /home/jenkins/jenkins-slave/workspace/Solr/Solr-Smoketest-9.4/gradlew -Dversion.suffix= -Dgradle.user.home=/home/jenkins/jenkins-slave/workspace/Solr/.gradle -Porg.gradle.daemon=false -Pvalidation.git.failOnModified=false --continue -x signJarsPublication clean assembleRelease
Downloading gradle-wrapper.jar from https://raw.githubusercontent.com/gradle/gradle/v7.6.0/gradle/wrapper/gradle-wrapper.jar
To honour the JVM settings for this build a single-use Daemon process will be forked. See https://docs.gradle.org/7.6/userguide/gradle_daemon.html#sec:disabling_the_daemon.
Daemon will be stopped at the end of the build
> Task :buildSrc:compileJava
> Task :buildSrc:compileGroovy NO-SOURCE
> Task :buildSrc:processResources NO-SOURCE
> Task :buildSrc:classes
> Task :buildSrc:jar
> Task :buildSrc:assemble
> Task :buildSrc:compileTestJava NO-SOURCE
> Task :buildSrc:compileTestGroovy NO-SOURCE
> Task :buildSrc:processTestResources NO-SOURCE
> Task :buildSrc:testClasses UP-TO-DATE
> Task :buildSrc:test NO-SOURCE
> Task :buildSrc:check UP-TO-DATE
> Task :buildSrc:build
> Task :clean
> Task :solr:clean UP-TO-DATE
> Task :solr:api:clean
> Task :solr:benchmark:clean
> Task :solr:core:clean
> Task :solr:distribution:clean UP-TO-DATE
> Task :solr:docker:clean UP-TO-DATE
> Task :solr:documentation:clean UP-TO-DATE
> Task :solr:example:clean UP-TO-DATE
> Task :solr:modules:clean UP-TO-DATE
> Task :solr:packaging:clean UP-TO-DATE
> Task :solr:prometheus-exporter:clean
> Task :solr:server:clean
> Task :solr:solr-ref-guide:clean
> Task :solr:solrj:clean
> Task :solr:solrj-streaming:clean
> Task :solr:solrj-zookeeper:clean
> Task :solr:test-framework:clean
> Task :solr:webapp:clean
> Task :solr:modules:analysis-extras:clean
> Task :solr:modules:analytics:clean
> Task :solr:modules:clustering:clean
> Task :solr:modules:extraction:clean
> Task :solr:modules:gcs-repository:clean
> Task :solr:modules:hadoop-auth:clean
> Task :solr:modules:hdfs:clean
> Task :solr:modules:jaegertracer-configurator:clean
> Task :solr:modules:jwt-auth:clean
> Task :solr:modules:langid:clean
> Task :solr:modules:ltr:clean
> Task :solr:modules:opentelemetry:clean
> Task :solr:modules:s3-repository:clean
> Task :solr:modules:scripting:clean
> Task :solr:modules:sql:clean
> Task :mavenLocalClean UP-TO-DATE
> Task :solr-missing-doclet:compileJava
> Task :solr-missing-doclet:processResources NO-SOURCE
> Task :solr-missing-doclet:classes
> Task :solr-missing-doclet:jar
> Task :gitStatus
> Task :checkJdkInternalsExportedToGradle
> Task :solr:api:compileJava
> Task :solr:api:processResources NO-SOURCE
> Task :solr:api:classes
> Task :solr:api:jar
> Task :solr:api:generateMetadataFileForJarsPublication SKIPPED
> Task :solr:api:generatePomFileForJarsPublication
> Task :solr:api:renderJavadoc
> Task :solr:api:javadoc SKIPPED
> Task :solr:api:javadocJar
> Task :solr:api:sourcesJar
> Task :solr:api:publishJarsPublicationToBuildRepository
> Task :solr:api:resolve
SLF4J(W): No SLF4J providers were found.
SLF4J(W): Defaulting to no-operation (NOP) logger implementation
SLF4J(W): See https://www.slf4j.org/codes.html#noProviders for further details.
> Task :solr:solrj:openApiGenerate
################################################################################
# Thanks for using OpenAPI Generator. #
# Please consider donation to help us maintain this project 🙏 #
# https://opencollective.com/openapi_generator/donate #
################################################################################
Successfully generated code to /home/jenkins/jenkins-slave/workspace/Solr/Solr-Smoketest-9.4/solr/solrj/build/generated/
> Task :spotlessInternalRegisterDependencies
> Task :solr:solrj:generatedSpotlessHelper
> Task :solr:solrj:generatedSpotless
> Task :solr:solrj:compileJava
Note: Some input files use or override a deprecated API.
Note: Recompile with -Xlint:deprecation for details.
> Task :solr:solrj-streaming:compileJava
Note: Some input files use or override a deprecated API.
Note: Recompile with -Xlint:deprecation for details.
> Task :solr:solrj-zookeeper:compileJava
Note: Some input files use or override a deprecated API.
Note: Recompile with -Xlint:deprecation for details.
> Task :solr:core:compileJava
Note: Some input files use or override a deprecated API.
Note: Recompile with -Xlint:deprecation for details.
> Task :solr:core:processResources
> Task :solr:core:classes
> Task :solr:core:jar
> Task :solr:core:generateMetadataFileForJarsPublication SKIPPED
> Task :solr:core:generatePomFileForJarsPublication
> Task :solr:solrj:renderJavadoc
> Task :solr:solrj-streaming:renderJavadoc
> Task :solr:solrj-zookeeper:renderJavadoc
> Task :solr:core:renderJavadoc
> Task :solr:core:javadoc SKIPPED
> Task :solr:core:javadocJar
> Task :solr:core:sourcesJar
> Task :solr:core:publishJarsPublicationToBuildRepository
> Task :solr:prometheus-exporter:compileJava
Note: Some input files use or override a deprecated API.
Note: Recompile with -Xlint:deprecation for details.
> Task :solr:prometheus-exporter:processResources NO-SOURCE
> Task :solr:prometheus-exporter:classes
> Task :solr:prometheus-exporter:jar
> Task :solr:prometheus-exporter:generateMetadataFileForJarsPublication SKIPPED
> Task :solr:prometheus-exporter:generatePomFileForJarsPublication
> Task :solr:prometheus-exporter:renderJavadoc
> Task :solr:prometheus-exporter:javadoc SKIPPED
> Task :solr:prometheus-exporter:javadocJar
> Task :solr:prometheus-exporter:sourcesJar
> Task :solr:prometheus-exporter:publishJarsPublicationToBuildRepository
> Task :solr:solrj:processResources
> Task :solr:solrj:classes
> Task :solr:solrj:jar
> Task :solr:solrj:generateMetadataFileForJarsPublication SKIPPED
> Task :solr:solrj:generatePomFileForJarsPublication
> Task :solr:solrj:javadoc SKIPPED
> Task :solr:solrj:javadocJar
> Task :solr:solrj:sourcesJar
> Task :solr:solrj:publishJarsPublicationToBuildRepository
> Task :solr:solrj-streaming:processResources
> Task :solr:solrj-streaming:classes
> Task :solr:solrj-streaming:jar
> Task :solr:solrj-streaming:generateMetadataFileForJarsPublication SKIPPED
> Task :solr:solrj-streaming:generatePomFileForJarsPublication
> Task :solr:solrj-streaming:javadoc SKIPPED
> Task :solr:solrj-streaming:javadocJar
> Task :solr:solrj-streaming:sourcesJar
> Task :solr:solrj-streaming:publishJarsPublicationToBuildRepository
> Task :solr:solrj-zookeeper:processResources NO-SOURCE
> Task :solr:solrj-zookeeper:classes
> Task :solr:solrj-zookeeper:jar
> Task :solr:solrj-zookeeper:generateMetadataFileForJarsPublication SKIPPED
> Task :solr:solrj-zookeeper:generatePomFileForJarsPublication
> Task :solr:solrj-zookeeper:javadoc SKIPPED
> Task :solr:solrj-zookeeper:javadocJar
> Task :solr:solrj-zookeeper:sourcesJar
> Task :solr:solrj-zookeeper:publishJarsPublicationToBuildRepository
> Task :solr:test-framework:compileJava
Note: Some input files use or override a deprecated API.
Note: Recompile with -Xlint:deprecation for details.
> Task :solr:test-framework:processResources
> Task :solr:test-framework:classes
> Task :solr:test-framework:jar
> Task :solr:test-framework:generateMetadataFileForJarsPublication SKIPPED
> Task :solr:test-framework:generatePomFileForJarsPublication
> Task :solr:test-framework:renderJavadoc
> Task :solr:test-framework:javadoc SKIPPED
> Task :solr:test-framework:javadocJar
> Task :solr:test-framework:sourcesJar
> Task :solr:test-framework:publishJarsPublicationToBuildRepository
> Task :solr:modules:analysis-extras:compileJava
Note: /home/jenkins/jenkins-slave/workspace/Solr/Solr-Smoketest-9.4/solr/modules/analysis-extras/src/java/org/apache/solr/schema/ICUCollationField.java uses or overrides a deprecated API.
Note: Recompile with -Xlint:deprecation for details.
> Task :solr:modules:analysis-extras:processResources NO-SOURCE
> Task :solr:modules:analysis-extras:classes
> Task :solr:modules:analysis-extras:jar
> Task :solr:modules:analysis-extras:generateMetadataFileForJarsPublication SKIPPED
> Task :solr:modules:analysis-extras:generatePomFileForJarsPublication
> Task :solr:modules:analysis-extras:renderJavadoc
> Task :solr:modules:analysis-extras:javadoc SKIPPED
> Task :solr:modules:analysis-extras:javadocJar
> Task :solr:modules:analysis-extras:sourcesJar
> Task :solr:modules:analysis-extras:publishJarsPublicationToBuildRepository
> Task :solr:modules:analytics:compileJava
Note: Some input files use or override a deprecated API.
Note: Recompile with -Xlint:deprecation for details.
> Task :solr:modules:analytics:processResources NO-SOURCE
> Task :solr:modules:analytics:classes
> Task :solr:modules:analytics:jar
> Task :solr:modules:analytics:generateMetadataFileForJarsPublication SKIPPED
> Task :solr:modules:analytics:generatePomFileForJarsPublication
> Task :solr:modules:analytics:renderJavadoc
> Task :solr:modules:analytics:javadoc SKIPPED
> Task :solr:modules:analytics:javadocJar
> Task :solr:modules:analytics:sourcesJar
> Task :solr:modules:analytics:publishJarsPublicationToBuildRepository
> Task :solr:modules:clustering:compileJava
> Task :solr:modules:clustering:processResources NO-SOURCE
> Task :solr:modules:clustering:classes
> Task :solr:modules:clustering:jar
> Task :solr:modules:clustering:generateMetadataFileForJarsPublication SKIPPED
> Task :solr:modules:clustering:generatePomFileForJarsPublication
> Task :solr:modules:clustering:renderJavadoc
> Task :solr:modules:clustering:javadoc SKIPPED
> Task :solr:modules:clustering:javadocJar
> Task :solr:modules:clustering:sourcesJar
> Task :solr:modules:clustering:publishJarsPublicationToBuildRepository
> Task :solr:modules:extraction:compileJava
Note: /home/jenkins/jenkins-slave/workspace/Solr/Solr-Smoketest-9.4/solr/modules/extraction/src/java/org/apache/solr/handler/extraction/ExtractingDocumentLoader.java uses or overrides a deprecated API.
Note: Recompile with -Xlint:deprecation for details.
> Task :solr:modules:extraction:processResources
> Task :solr:modules:extraction:classes
> Task :solr:modules:extraction:jar
> Task :solr:modules:extraction:generateMetadataFileForJarsPublication SKIPPED
> Task :solr:modules:extraction:generatePomFileForJarsPublication
> Task :solr:modules:extraction:renderJavadoc
> Task :solr:modules:extraction:javadoc SKIPPED
> Task :solr:modules:extraction:javadocJar
> Task :solr:modules:extraction:sourcesJar
> Task :solr:modules:extraction:publishJarsPublicationToBuildRepository
> Task :solr:modules:gcs-repository:compileJava
Note: /home/jenkins/jenkins-slave/workspace/Solr/Solr-Smoketest-9.4/solr/modules/gcs-repository/src/java/org/apache/solr/gcs/GCSConfigParser.java uses or overrides a deprecated API.
Note: Recompile with -Xlint:deprecation for details.
> Task :solr:modules:gcs-repository:processResources NO-SOURCE
> Task :solr:modules:gcs-repository:classes
> Task :solr:modules:gcs-repository:jar
> Task :solr:modules:gcs-repository:generateMetadataFileForJarsPublication SKIPPED
> Task :solr:modules:gcs-repository:generatePomFileForJarsPublication
> Task :solr:modules:gcs-repository:renderJavadoc
> Task :solr:modules:gcs-repository:javadoc SKIPPED
> Task :solr:modules:gcs-repository:javadocJar
> Task :solr:modules:gcs-repository:sourcesJar
> Task :solr:modules:gcs-repository:publishJarsPublicationToBuildRepository
> Task :solr:modules:hadoop-auth:compileJava
Note: Some input files use or override a deprecated API.
Note: Recompile with -Xlint:deprecation for details.
> Task :solr:modules:hadoop-auth:processResources NO-SOURCE
> Task :solr:modules:hadoop-auth:classes
> Task :solr:modules:hadoop-auth:jar
> Task :solr:modules:hadoop-auth:generateMetadataFileForJarsPublication SKIPPED
> Task :solr:modules:hadoop-auth:generatePomFileForJarsPublication
> Task :solr:modules:hadoop-auth:renderJavadoc
> Task :solr:modules:hadoop-auth:javadoc SKIPPED
> Task :solr:modules:hadoop-auth:javadocJar
> Task :solr:modules:hadoop-auth:sourcesJar
> Task :solr:modules:hadoop-auth:publishJarsPublicationToBuildRepository
> Task :solr:modules:hdfs:compileJava
Note: Some input files use or override a deprecated API.
Note: Recompile with -Xlint:deprecation for details.
> Task :solr:modules:hdfs:processResources NO-SOURCE
> Task :solr:modules:hdfs:classes
> Task :solr:modules:hdfs:jar
> Task :solr:modules:hdfs:generateMetadataFileForJarsPublication SKIPPED
> Task :solr:modules:hdfs:generatePomFileForJarsPublication
> Task :solr:modules:hdfs:renderJavadoc
> Task :solr:modules:hdfs:javadoc SKIPPED
> Task :solr:modules:hdfs:javadocJar
> Task :solr:modules:hdfs:sourcesJar
> Task :solr:modules:hdfs:publishJarsPublicationToBuildRepository
> Task :solr:modules:jaegertracer-configurator:compileJava
> Task :solr:modules:jaegertracer-configurator:processResources NO-SOURCE
> Task :solr:modules:jaegertracer-configurator:classes
> Task :solr:modules:jaegertracer-configurator:jar
> Task :solr:modules:jaegertracer-configurator:generateMetadataFileForJarsPublication SKIPPED
> Task :solr:modules:jaegertracer-configurator:generatePomFileForJarsPublication
> Task :solr:modules:jaegertracer-configurator:renderJavadoc
> Task :solr:modules:jaegertracer-configurator:javadoc SKIPPED
> Task :solr:modules:jaegertracer-configurator:javadocJar
> Task :solr:modules:jaegertracer-configurator:sourcesJar
> Task :solr:modules:jaegertracer-configurator:publishJarsPublicationToBuildRepository
> Task :solr:modules:jwt-auth:compileJava
> Task :solr:modules:jwt-auth:processResources NO-SOURCE
> Task :solr:modules:jwt-auth:classes
> Task :solr:modules:jwt-auth:jar
> Task :solr:modules:jwt-auth:generateMetadataFileForJarsPublication SKIPPED
> Task :solr:modules:jwt-auth:generatePomFileForJarsPublication
> Task :solr:modules:jwt-auth:renderJavadoc
> Task :solr:modules:jwt-auth:javadoc SKIPPED
> Task :solr:modules:jwt-auth:javadocJar
> Task :solr:modules:jwt-auth:sourcesJar
> Task :solr:modules:jwt-auth:publishJarsPublicationToBuildRepository
> Task :solr:modules:langid:compileJava
Note: Some input files use or override a deprecated API.
Note: Recompile with -Xlint:deprecation for details.
> Task :solr:modules:langid:processResources
> Task :solr:modules:langid:classes
> Task :solr:modules:langid:jar
> Task :solr:modules:langid:generateMetadataFileForJarsPublication SKIPPED
> Task :solr:modules:langid:generatePomFileForJarsPublication
> Task :solr:modules:langid:renderJavadoc
> Task :solr:modules:langid:javadoc SKIPPED
> Task :solr:modules:langid:javadocJar
> Task :solr:modules:langid:sourcesJar
> Task :solr:modules:langid:publishJarsPublicationToBuildRepository
> Task :solr:modules:ltr:compileJava
Note: Some input files use or override a deprecated API.
Note: Recompile with -Xlint:deprecation for details.
> Task :solr:modules:ltr:processResources NO-SOURCE
> Task :solr:modules:ltr:classes
> Task :solr:modules:ltr:jar
> Task :solr:modules:ltr:generateMetadataFileForJarsPublication SKIPPED
> Task :solr:modules:ltr:generatePomFileForJarsPublication
> Task :solr:modules:ltr:renderJavadoc
> Task :solr:modules:ltr:javadoc SKIPPED
> Task :solr:modules:ltr:javadocJar
> Task :solr:modules:ltr:sourcesJar
> Task :solr:modules:ltr:publishJarsPublicationToBuildRepository
> Task :solr:modules:opentelemetry:compileJava
> Task :solr:modules:opentelemetry:processResources NO-SOURCE
> Task :solr:modules:opentelemetry:classes
> Task :solr:modules:opentelemetry:jar
> Task :solr:modules:opentelemetry:generateMetadataFileForJarsPublication SKIPPED
> Task :solr:modules:opentelemetry:generatePomFileForJarsPublication
> Task :solr:modules:opentelemetry:renderJavadoc
> Task :solr:modules:opentelemetry:javadoc SKIPPED
> Task :solr:modules:opentelemetry:javadocJar
> Task :solr:modules:opentelemetry:sourcesJar
> Task :solr:modules:opentelemetry:publishJarsPublicationToBuildRepository
> Task :solr:modules:s3-repository:compileJava
> Task :solr:modules:s3-repository:processResources NO-SOURCE
> Task :solr:modules:s3-repository:classes
> Task :solr:modules:s3-repository:jar
> Task :solr:modules:s3-repository:generateMetadataFileForJarsPublication SKIPPED
> Task :solr:modules:s3-repository:generatePomFileForJarsPublication
> Task :solr:modules:s3-repository:renderJavadoc
> Task :solr:modules:s3-repository:javadoc SKIPPED
> Task :solr:modules:s3-repository:javadocJar
> Task :solr:modules:s3-repository:sourcesJar
> Task :solr:modules:s3-repository:publishJarsPublicationToBuildRepository
> Task :solr:modules:scripting:compileJava
Note: /home/jenkins/jenkins-slave/workspace/Solr/Solr-Smoketest-9.4/solr/modules/scripting/src/java/org/apache/solr/scripting/xslt/XSLTUpdateRequestHandler.java uses or overrides a deprecated API.
Note: Recompile with -Xlint:deprecation for details.
> Task :solr:modules:scripting:processResources NO-SOURCE
> Task :solr:modules:scripting:classes
> Task :solr:modules:scripting:jar
> Task :solr:modules:scripting:generateMetadataFileForJarsPublication SKIPPED
> Task :solr:modules:scripting:generatePomFileForJarsPublication
> Task :solr:modules:scripting:renderJavadoc
> Task :solr:modules:scripting:javadoc SKIPPED
> Task :solr:modules:scripting:javadocJar
> Task :solr:modules:scripting:sourcesJar
> Task :solr:modules:scripting:publishJarsPublicationToBuildRepository
> Task :solr:modules:sql:compileJava
Note: Some input files use or override a deprecated API.
Note: Recompile with -Xlint:deprecation for details.
> Task :solr:modules:sql:processResources
> Task :solr:modules:sql:classes
> Task :solr:modules:sql:jar
> Task :solr:modules:sql:generateMetadataFileForJarsPublication SKIPPED
> Task :solr:modules:sql:generatePomFileForJarsPublication
> Task :solr:modules:sql:renderJavadoc
> Task :solr:modules:sql:javadoc SKIPPED
> Task :solr:modules:sql:javadocJar
> Task :solr:modules:sql:sourcesJar
> Task :solr:modules:sql:publishJarsPublicationToBuildRepository
> Task :mavenToLocalFolder
Local maven artifacts (poms, jars) created at: /home/jenkins/jenkins-slave/workspace/Solr/Solr-Smoketest-9.4/build/maven-local
> Task :checkWorkingCopyClean
> Task :solr:distribution:assembleSourceTgz
> Task :solr:docker:createBodySnippetDockerfile
> Task :solr:docker:createDockerfileLocal
> Task :solr:docker:assemblePackaging
> Task :solr:documentation:changesToHtml
> Task :solr:documentation:copyDocumentationAssets
> Task :solr:documentation:markdownToHtml
> Task :solr:documentation:copyChangesToHtmlForMiniSite
> Task :solr:documentation:copyMiniDocumentationAssets
> Task :solr:documentation:createMiniDocumentationIndex
> Task :solr:documentation:documentationMinimal
> Task :solr:core:assemblePostJar
> Task :solr:example:assemblePackaging
> Task :solr:prometheus-exporter:assemblePackaging
> Task :solr:webapp:compileJava NO-SOURCE
> Task :solr:webapp:processResources NO-SOURCE
> Task :solr:webapp:classes UP-TO-DATE
> Task :solr:webapp:war
> Task :solr:server:assemblePackaging
> Task :solr:modules:analysis-extras:assemblePackaging
> Task :solr:modules:analytics:assemblePackaging
> Task :solr:modules:clustering:assemblePackaging
> Task :solr:modules:extraction:assemblePackaging
> Task :solr:modules:gcs-repository:assemblePackaging
> Task :solr:modules:hadoop-auth:assemblePackaging
> Task :solr:modules:hdfs:assemblePackaging
> Task :solr:modules:jaegertracer-configurator:assemblePackaging
> Task :solr:modules:jwt-auth:assemblePackaging
> Task :solr:modules:langid:assemblePackaging
> Task :solr:modules:ltr:assemblePackaging
> Task :solr:modules:opentelemetry:assemblePackaging
> Task :solr:modules:s3-repository:assemblePackaging
> Task :solr:modules:scripting:assemblePackaging
> Task :solr:modules:sql:assemblePackaging
> Task :solr:packaging:fullDistTar
> Task :solr:packaging:slimDistTar
> Task :solr:distribution:computeChecksums
> Task :solr:distribution:prepareGitRev
> Task :solr:docker:createDockerfileOfficialFull
> Task :solr:docker:createDockerfileOfficialSlim
> Task :solr:distribution:assembleRelease
Deprecated Gradle features were used in this build, making it incompatible with Gradle 8.0.
You can use '--warning-mode all' to show the individual deprecation warnings and determine if they come from your own scripts or plugins.
See https://docs.gradle.org/7.6/userguide/command_line_interface.html#sec:command_line_warnings
BUILD SUCCESSFUL in 4m 14s
246 actionable tasks: 238 executed, 8 up-to-date
Build step 'Invoke Gradle script' changed build result to SUCCESS
Run condition [Always] enabling perform for step [Execute shell]
[Solr-Smoketest-9.4] $ /bin/bash /tmp/jenkins4342129772054870953.sh
Installing Python script requirements
Defaulting to user installation because normal site-packages is not writeable
Collecting six~=1.16.0
Using cached six-1.16.0-py2.py3-none-any.whl (11 kB)
ERROR: Could not find a version that satisfies the requirement Jinja2~=3.1.1 (from versions: 2.0rc1, 2.0, 2.1, 2.1.1, 2.2, 2.2.1, 2.3, 2.3.1, 2.4, 2.4.1, 2.5, 2.5.1, 2.5.2, 2.5.3, 2.5.4, 2.5.5, 2.6, 2.7, 2.7.1, 2.7.2, 2.7.3, 2.8, 2.8.1, 2.9, 2.9.1, 2.9.2, 2.9.3, 2.9.4, 2.9.5, 2.9.6, 2.10, 2.10.1, 2.10.2, 2.10.3, 2.11.0, 2.11.1, 2.11.2, 2.11.3, 3.0.0a1, 3.0.0rc1, 3.0.0rc2, 3.0.0, 3.0.1, 3.0.2, 3.0.3)
ERROR: No matching distribution found for Jinja2~=3.1.1
Starting Smoke tester in folder /home/jenkins/jenkins-slave/workspace/Solr/Solr-Smoketest-9.4
Java 11 JAVA_HOME=/home/jenkins/tools/java/latest11
NOTE: output encoding is UTF-8
NOTE: Not running @Nightly or @BadApple tests. Please verify that recent Jenkins runs have passed.
Load release URL "file:///home/jenkins/jenkins-slave/workspace/Solr/Solr-Smoketest-9.4/solr/distribution/build/release"...
Get KEYS...
Downloading online KEYS file https://archive.apache.org/dist/solr/KEYS
Downloading https://archive.apache.org/dist/solr/KEYS
0.3 MB in 1.11 sec (0.3 MB/sec)
Test Solr...
test basics...
check changes HTML...
download solr-9.4.2-slim.tgz...
Downloading file:///home/jenkins/jenkins-slave/workspace/Solr/Solr-Smoketest-9.4/solr/distribution/build/release/solr-9.4.2-slim.tgz
61.0 MB in 0.05 sec (1326.2 MB/sec)
verify sha512 digest
download solr-9.4.2-src.tgz...
Downloading file:///home/jenkins/jenkins-slave/workspace/Solr/Solr-Smoketest-9.4/solr/distribution/build/release/solr-9.4.2-src.tgz
86.0 MB in 0.06 sec (1412.0 MB/sec)
verify sha512 digest
download solr-9.4.2.tgz...
Downloading file:///home/jenkins/jenkins-slave/workspace/Solr/Solr-Smoketest-9.4/solr/distribution/build/release/solr-9.4.2.tgz
267.8 MB in 0.22 sec (1204.2 MB/sec)
verify sha512 digest
unpack solr-9.4.2.tgz...
solr-9.4.2.tgz
Checking LICENSE.txt
Checking NOTICE.txt
Checking README.txt
Checking CHANGES.txt
Checking bin
Checking modules
Checking docker
Checking prometheus-exporter
Checking docs
Checking example
Checking licenses
Checking server
Checking lib
verify JAR metadata/identity/no javax.* or java.* classes...
**WARNING**: skipping check of /home/jenkins/jenkins-slave/workspace/Solr/Solr-Smoketest-9.4/_tmp/smoke_1708451314/unpack/solr-9.4.2/server/solr-webapp/webapp/WEB-INF/lib/jakarta.xml.bind-api-2.3.3.jar: it has javax.* classes
**WARNING**: skipping check of /home/jenkins/jenkins-slave/workspace/Solr/Solr-Smoketest-9.4/_tmp/smoke_1708451314/unpack/solr-9.4.2/server/solr-webapp/webapp/WEB-INF/lib/jakarta.annotation-api-1.3.5.jar: it has javax.* classes
**WARNING**: skipping check of /home/jenkins/jenkins-slave/workspace/Solr/Solr-Smoketest-9.4/_tmp/smoke_1708451314/unpack/solr-9.4.2/server/solr-webapp/webapp/WEB-INF/lib/jakarta.ws.rs-api-2.1.6.jar: it has javax.* classes
**WARNING**: skipping check of /home/jenkins/jenkins-slave/workspace/Solr/Solr-Smoketest-9.4/_tmp/smoke_1708451314/unpack/solr-9.4.2/server/solr-webapp/webapp/WEB-INF/lib/jakarta.inject-2.6.1.jar: it has javax.* classes
**WARNING**: skipping check of /home/jenkins/jenkins-slave/workspace/Solr/Solr-Smoketest-9.4/_tmp/smoke_1708451314/unpack/solr-9.4.2/server/solr-webapp/webapp/WEB-INF/lib/jakarta.validation-api-2.0.2.jar: it has javax.* classes
**WARNING**: skipping check of /home/jenkins/jenkins-slave/workspace/Solr/Solr-Smoketest-9.4/_tmp/smoke_1708451314/unpack/solr-9.4.2/server/lib/ext/jetty-servlet-api-4.0.6.jar: it has javax.* classes
**WARNING**: skipping check of /home/jenkins/jenkins-slave/workspace/Solr/Solr-Smoketest-9.4/_tmp/smoke_1708451314/unpack/solr-9.4.2/modules/extraction/lib/jakarta.activation-1.2.2.jar: it has javax.* classes
**WARNING**: skipping check of /home/jenkins/jenkins-slave/workspace/Solr/Solr-Smoketest-9.4/_tmp/smoke_1708451314/unpack/solr-9.4.2/modules/extraction/lib/jakarta.activation-api-1.2.2.jar: it has javax.* classes
**WARNING**: skipping check of /home/jenkins/jenkins-slave/workspace/Solr/Solr-Smoketest-9.4/_tmp/smoke_1708451314/unpack/solr-9.4.2/modules/extraction/lib/unit-api-1.0.jar: it has javax.* classes
copying unpacked distribution for Java 11 ...
test solr example w/ Java 11...
start Solr instance (log=/home/jenkins/jenkins-slave/workspace/Solr/Solr-Smoketest-9.4/_tmp/smoke_1708451314/unpack/solr-9.4.2-java11/solr-example.log)...
No process found for Solr node running on port 8983
Running techproducts example on port 8983 from /home/jenkins/jenkins-slave/workspace/Solr/Solr-Smoketest-9.4/_tmp/smoke_1708451314/unpack/solr-9.4.2-java11
*** [WARN] *** Your open file limit is currently 60000.
It should be set to 65000 to avoid operational disruption.
If you no longer wish to see this warning, set SOLR_ULIMIT_CHECKS to false in your profile or solr.in.sh
*** [WARN] *** Your Max Processes Limit is currently 30000.
It should be set to 65000 to avoid operational disruption.
If you no longer wish to see this warning, set SOLR_ULIMIT_CHECKS to false in your profile or solr.in.sh
Creating Solr home directory /home/jenkins/jenkins-slave/workspace/Solr/Solr-Smoketest-9.4/_tmp/smoke_1708451314/unpack/solr-9.4.2-java11/example/techproducts/solr
Starting up Solr on port 8983 using command:
"bin/solr" start -p 8983 -s "example/techproducts/solr"
*** [WARN] *** Your open file limit is currently 60000.
It should be set to 65000 to avoid operational disruption.
If you no longer wish to see this warning, set SOLR_ULIMIT_CHECKS to false in your profile or solr.in.sh
*** [WARN] *** Your Max Processes Limit is currently 30000.
It should be set to 65000 to avoid operational disruption.
If you no longer wish to see this warning, set SOLR_ULIMIT_CHECKS to false in your profile or solr.in.sh
Waiting up to 180 seconds to see Solr running on port 8983 [|] [/] [-] [\] [|]
Started Solr server on port 8983 (pid=10864). Happy searching!
Created new core 'techproducts'
Indexing tech product example docs from /home/jenkins/jenkins-slave/workspace/Solr/Solr-Smoketest-9.4/_tmp/smoke_1708451314/unpack/solr-9.4.2-java11/example/exampledocs
SimplePostTool version 9.4.2
Posting files to [base] url http://localhost:8983/solr/techproducts/update using content-type application/xml...
POSTing file mp500.xml to [base]
POSTing file ipod_video.xml to [base]
POSTing file monitor2.xml to [base]
POSTing file gb18030-example.xml to [base]
POSTing file vidcard.xml to [base]
POSTing file money.xml to [base]
POSTing file hd.xml to [base]
POSTing file ipod_other.xml to [base]
POSTing file sd500.xml to [base]
POSTing file solr.xml to [base]
POSTing file utf8-example.xml to [base]
POSTing file monitor.xml to [base]
POSTing file manufacturers.xml to [base]
POSTing file mem.xml to [base]
14 files indexed.
COMMITting Solr index changes to http://localhost:8983/solr/techproducts/update...
Time spent: 0:00:00.635
test utf8...
run query...
stop server using: bin/solr stop -p 8983
Sending stop command to Solr running on port 8983 ... waiting up to 180 seconds to allow Jetty process 10864 to stop gracefully.
[|] [/] [-] [\] unpack solr-9.4.2-slim.tgz...
solr-9.4.2-slim.tgz
Checking LICENSE.txt
Checking NOTICE.txt
Checking README.txt
Checking CHANGES.txt
Checking bin
Checking docker
Checking docs
Checking example
Checking licenses
Checking server
Checking lib
verify JAR metadata/identity/no javax.* or java.* classes...
**WARNING**: skipping check of /home/jenkins/jenkins-slave/workspace/Solr/Solr-Smoketest-9.4/_tmp/smoke_1708451314/unpack/solr-9.4.2-slim/server/solr-webapp/webapp/WEB-INF/lib/jakarta.xml.bind-api-2.3.3.jar: it has javax.* classes
**WARNING**: skipping check of /home/jenkins/jenkins-slave/workspace/Solr/Solr-Smoketest-9.4/_tmp/smoke_1708451314/unpack/solr-9.4.2-slim/server/solr-webapp/webapp/WEB-INF/lib/jakarta.annotation-api-1.3.5.jar: it has javax.* classes
**WARNING**: skipping check of /home/jenkins/jenkins-slave/workspace/Solr/Solr-Smoketest-9.4/_tmp/smoke_1708451314/unpack/solr-9.4.2-slim/server/solr-webapp/webapp/WEB-INF/lib/jakarta.ws.rs-api-2.1.6.jar: it has javax.* classes
**WARNING**: skipping check of /home/jenkins/jenkins-slave/workspace/Solr/Solr-Smoketest-9.4/_tmp/smoke_1708451314/unpack/solr-9.4.2-slim/server/solr-webapp/webapp/WEB-INF/lib/jakarta.inject-2.6.1.jar: it has javax.* classes
**WARNING**: skipping check of /home/jenkins/jenkins-slave/workspace/Solr/Solr-Smoketest-9.4/_tmp/smoke_1708451314/unpack/solr-9.4.2-slim/server/solr-webapp/webapp/WEB-INF/lib/jakarta.validation-api-2.0.2.jar: it has javax.* classes
**WARNING**: skipping check of /home/jenkins/jenkins-slave/workspace/Solr/Solr-Smoketest-9.4/_tmp/smoke_1708451314/unpack/solr-9.4.2-slim/server/lib/ext/jetty-servlet-api-4.0.6.jar: it has javax.* classes
copying unpacked distribution for Java 11 ...
test solr example w/ Java 11...
start Solr instance (log=/home/jenkins/jenkins-slave/workspace/Solr/Solr-Smoketest-9.4/_tmp/smoke_1708451314/unpack/solr-9.4.2-slim-java11/solr-example.log)...
No process found for Solr node running on port 8983
Running techproducts example on port 8983 from /home/jenkins/jenkins-slave/workspace/Solr/Solr-Smoketest-9.4/_tmp/smoke_1708451314/unpack/solr-9.4.2-slim-java11
*** [WARN] *** Your open file limit is currently 60000.
It should be set to 65000 to avoid operational disruption.
If you no longer wish to see this warning, set SOLR_ULIMIT_CHECKS to false in your profile or solr.in.sh
*** [WARN] *** Your Max Processes Limit is currently 30000.
It should be set to 65000 to avoid operational disruption.
If you no longer wish to see this warning, set SOLR_ULIMIT_CHECKS to false in your profile or solr.in.sh
Creating Solr home directory /home/jenkins/jenkins-slave/workspace/Solr/Solr-Smoketest-9.4/_tmp/smoke_1708451314/unpack/solr-9.4.2-slim-java11/example/techproducts/solr
Starting up Solr on port 8983 using command:
"bin/solr" start -p 8983 -s "example/techproducts/solr"
*** [WARN] *** Your open file limit is currently 60000.
It should be set to 65000 to avoid operational disruption.
If you no longer wish to see this warning, set SOLR_ULIMIT_CHECKS to false in your profile or solr.in.sh
*** [WARN] *** Your Max Processes Limit is currently 30000.
It should be set to 65000 to avoid operational disruption.
If you no longer wish to see this warning, set SOLR_ULIMIT_CHECKS to false in your profile or solr.in.sh
Waiting up to 180 seconds to see Solr running on port 8983 [|] [/] [-] [\] [|]
Started Solr server on port 8983 (pid=11320). Happy searching!
Created new core 'techproducts'
Indexing tech product example docs from /home/jenkins/jenkins-slave/workspace/Solr/Solr-Smoketest-9.4/_tmp/smoke_1708451314/unpack/solr-9.4.2-slim-java11/example/exampledocs
SimplePostTool version 9.4.2
Posting files to [base] url http://localhost:8983/solr/techproducts/update using content-type application/xml...
POSTing file mp500.xml to [base]
POSTing file ipod_video.xml to [base]
POSTing file monitor2.xml to [base]
POSTing file gb18030-example.xml to [base]
POSTing file vidcard.xml to [base]
POSTing file money.xml to [base]
POSTing file hd.xml to [base]
POSTing file ipod_other.xml to [base]
POSTing file sd500.xml to [base]
POSTing file solr.xml to [base]
POSTing file utf8-example.xml to [base]
POSTing file monitor.xml to [base]
POSTing file manufacturers.xml to [base]
POSTing file mem.xml to [base]
14 files indexed.
COMMITting Solr index changes to http://localhost:8983/solr/techproducts/update...
Time spent: 0:00:00.638
test utf8...
run query...
stop server using: bin/solr stop -p 8983
Sending stop command to Solr running on port 8983 ... waiting up to 180 seconds to allow Jetty process 11320 to stop gracefully.
[|] [/] [-] [\] unpack solr-9.4.2-src.tgz...
solr-9.4.2-src.tgz
Checking LICENSE.txt
Checking NOTICE.txt
Checking README.md
Checking CONTRIBUTING.md
Checking CHANGES.txt
Checking README.adoc
Checking buildSrc
Checking dev-docs
Checking dev-tools
Checking gradle
Checking help
Checking solr
Checking build.gradle
Checking gradlew
Checking gradlew.bat
Checking settings.gradle
Checking versions.lock
Checking versions.props
Checking benchmark
Checking bin
Checking modules
Checking api
Checking core
Checking docker
Checking documentation
Checking example
Checking licenses
Checking packaging
Checking distribution
Checking prometheus-exporter
Checking server
Checking solr-ref-guide
Checking solrj
Checking solrj-streaming
Checking solrj-zookeeper
Checking test-framework
Checking webapp
Checking .gitignore
Checking .gitattributes
Checking build.gradle
make sure no JARs/WARs in src dist...
run "./gradlew --no-daemon check -p solr/documentation"
run tests w/ Java 11 and testArgs='-Dtests.nightly=false -Dtests.badapples=false '...
command "export JAVA_HOME="/home/jenkins/tools/java/latest11" PATH="/home/jenkins/tools/java/latest11/bin:$PATH" JAVACMD="/home/jenkins/tools/java/latest11/bin/java"; ./gradlew --no-daemon test -Dtests.nightly=false -Dtests.badapples=false " failed:
To honour the JVM settings for this build a single-use Daemon process will be forked. See https://docs.gradle.org/7.6/userguide/gradle_daemon.html#sec:disabling_the_daemon.
Daemon will be stopped at the end of the build
Gradle Enterprise plugins resolution: https://plugins.gradle.org/m2
Applying com.gradle.enterprise.gradleplugin.GradleEnterprisePlugin via init script
Connection to Gradle Enterprise: https://ge.apache.org, allowUntrustedServer: false
Enforcing Gradle Enterprise: https://ge.apache.org, allowUntrustedServer: false
Applying com.gradle.CommonCustomUserDataGradlePlugin via init script
> Task :buildSrc:compileJava UP-TO-DATE
> Task :buildSrc:compileGroovy NO-SOURCE
> Task :buildSrc:processResources NO-SOURCE
> Task :buildSrc:classes UP-TO-DATE
> Task :buildSrc:jar UP-TO-DATE
> Task :buildSrc:assemble UP-TO-DATE
> Task :buildSrc:compileTestJava NO-SOURCE
> Task :buildSrc:compileTestGroovy NO-SOURCE
> Task :buildSrc:processTestResources NO-SOURCE
> Task :buildSrc:testClasses UP-TO-DATE
> Task :buildSrc:test NO-SOURCE
> Task :buildSrc:check UP-TO-DATE
> Task :buildSrc:build UP-TO-DATE
> Task :solr:api:processResources NO-SOURCE
> Task :solr:api:processTestResources
> Task :solr:core:processResources UP-TO-DATE
> Task :solr:solrj:processResources UP-TO-DATE
> Task :solr:solrj-streaming:processResources UP-TO-DATE
> Task :solr:solrj-zookeeper:processResources NO-SOURCE
> Task :solr:test-framework:processResources
> Task :solr:benchmark:processResources
> Task :solr:benchmark:processTestResources
> Task :gitStatus
> Task :checkJdkInternalsExportedToGradle
> Task :solr:api:compileJava UP-TO-DATE
> Task :solr:api:classes UP-TO-DATE
> Task :solr:api:jar UP-TO-DATE
> Task :ensureJdkSupported
> Task :randomizationInfo
Running tests with randomization seed: tests.seed=E5D43192C472A207
> Task :solr:api:resolve UP-TO-DATE
> Task :solr:core:processTestResources
> Task :solr:modules:analysis-extras:processResources NO-SOURCE
> Task :solr:prometheus-exporter:processResources NO-SOURCE
> Task :solr:prometheus-exporter:processTestResources
> Task :solr:server:compileJava SKIPPED
> Task :solr:server:processResources NO-SOURCE
> Task :solr:server:classes UP-TO-DATE
> Task :solr:server:compileTestJava NO-SOURCE
> Task :solr:server:processTestResources NO-SOURCE
> Task :solr:server:testClasses UP-TO-DATE
> Task :solr:server:test NO-SOURCE
> Task :solr:server:wipeTaskTemp
> Task :solr:solr-ref-guide:compileJava NO-SOURCE
> Task :solr:solr-ref-guide:processResources NO-SOURCE
> Task :solr:solr-ref-guide:classes UP-TO-DATE
> Task :solr:solr-ref-guide:copySolrjTestResources
> Task :solr:solr-ref-guide:processTestResources NO-SOURCE
> Task :solr:solrj-streaming:processTestResources
> Task :solr:modules:sql:processResources
> Task :solr:solrj-zookeeper:processTestResources
> Task :solr:test-framework:processTestResources
> Task :solr:webapp:processResources NO-SOURCE
> Task :solr:webapp:processTestResources NO-SOURCE
> Task :solr:modules:analysis-extras:processTestResources
> Task :solr:modules:analytics:processResources NO-SOURCE
> Task :solr:modules:analytics:processTestResources
> Task :solr:modules:clustering:processResources NO-SOURCE
> Task :solr:modules:clustering:processTestResources
> Task :solr:modules:extraction:processResources
> Task :solr:modules:extraction:processTestResources
> Task :solr:modules:gcs-repository:processResources NO-SOURCE
> Task :solr:modules:gcs-repository:processTestResources
> Task :solr:modules:hadoop-auth:processResources NO-SOURCE
> Task :solr:modules:hadoop-auth:copySolrCoreTestResources
> Task :solr:modules:hadoop-auth:processTestResources
> Task :solr:modules:hdfs:processResources NO-SOURCE
> Task :solr:modules:hdfs:copySolrCoreTestResources
> Task :solr:modules:hdfs:processTestResources
> Task :solr:modules:jaegertracer-configurator:processResources NO-SOURCE
> Task :solr:modules:jaegertracer-configurator:processTestResources
> Task :solr:modules:jwt-auth:processResources NO-SOURCE
> Task :solr:modules:jwt-auth:processTestResources
> Task :solr:modules:langid:processResources
> Task :solr:modules:langid:processTestResources
> Task :solr:modules:ltr:processResources NO-SOURCE
> Task :solr:modules:ltr:processTestResources
> Task :solr:modules:opentelemetry:processResources NO-SOURCE
> Task :solr:modules:opentelemetry:processTestResources
> Task :solr:modules:s3-repository:processResources NO-SOURCE
> Task :solr:modules:s3-repository:processTestResources
> Task :solr:modules:scripting:processResources NO-SOURCE
> Task :solr:modules:scripting:processTestResources
> Task :solr:modules:sql:copySolrCoreTestResources
> Task :solr:modules:sql:processTestResources
> Task :solr:solrj:openApiGenerate
################################################################################
# Thanks for using OpenAPI Generator. #
# Please consider donation to help us maintain this project 🙏 #
# https://opencollective.com/openapi_generator/donate #
################################################################################
Successfully generated code to /home/jenkins/jenkins-slave/workspace/Solr/Solr-Smoketest-9.4/_tmp/smoke_1708451314/unpack/solr-9.4.2/solr/solrj/build/generated/
> Task :spotlessInternalRegisterDependencies UP-TO-DATE
> Task :solr:solrj:compileJava UP-TO-DATE
> Task :solr:solrj-streaming:compileJava UP-TO-DATE
> Task :solr:solrj-zookeeper:compileJava UP-TO-DATE
> Task :solr:core:compileJava UP-TO-DATE
> Task :solr:test-framework:compileJava UP-TO-DATE
> Task :solr:solrj:generatedSpotlessHelper
> Task :solr:solrj:generatedSpotless
> Task :solr:core:classes UP-TO-DATE
> Task :solr:core:jar UP-TO-DATE
> Task :solr:solrj:classes UP-TO-DATE
> Task :solr:solrj:jar UP-TO-DATE
> Task :solr:solrj-streaming:classes UP-TO-DATE
> Task :solr:solrj-streaming:jar UP-TO-DATE
> Task :solr:solrj-zookeeper:classes UP-TO-DATE
> Task :solr:solrj-zookeeper:jar UP-TO-DATE
> Task :solr:test-framework:classes
> Task :solr:test-framework:jar
> Task :solr:api:compileTestJava
> Task :solr:api:testClasses
> Task :solr:benchmark:compileJava
Note: /home/jenkins/jenkins-slave/workspace/Solr/Solr-Smoketest-9.4/_tmp/smoke_1708451314/unpack/solr-9.4.2/solr/benchmark/src/java/org/apache/solr/bench/search/StreamingSearch.java uses or overrides a deprecated API.
Note: Recompile with -Xlint:deprecation for details.
> Task :solr:benchmark:classes
> Task :solr:benchmark:compileTestJava
> Task :solr:benchmark:testClasses
> Task :solr:api:test
:solr:api:test (SUCCESS): 6 test(s)
> Task :solr:api:wipeTaskTemp
> Task :solr:benchmark:test
:solr:benchmark:test (SUCCESS): 11 test(s)
> Task :solr:benchmark:wipeTaskTemp
> Task :solr:modules:analysis-extras:compileJava
Note: /home/jenkins/jenkins-slave/workspace/Solr/Solr-Smoketest-9.4/_tmp/smoke_1708451314/unpack/solr-9.4.2/solr/modules/analysis-extras/src/java/org/apache/solr/schema/ICUCollationField.java uses or overrides a deprecated API.
Note: Recompile with -Xlint:deprecation for details.
> Task :solr:modules:analysis-extras:classes
> Task :solr:modules:analysis-extras:jar
> Task :solr:prometheus-exporter:compileJava
Note: Some input files use or override a deprecated API.
Note: Recompile with -Xlint:deprecation for details.
> Task :solr:prometheus-exporter:classes
> Task :solr:prometheus-exporter:compileTestJava
Note: /home/jenkins/jenkins-slave/workspace/Solr/Solr-Smoketest-9.4/_tmp/smoke_1708451314/unpack/solr-9.4.2/solr/prometheus-exporter/src/test/org/apache/solr/prometheus/exporter/MetricsQueryTemplateTest.java uses or overrides a deprecated API.
Note: Recompile with -Xlint:deprecation for details.
> Task :solr:prometheus-exporter:testClasses
> Task :solr:core:compileTestJava
> Task :solr:prometheus-exporter:test
:solr:prometheus-exporter:test (SUCCESS): 23 test(s)
> Task :solr:prometheus-exporter:wipeTaskTemp
> Task :solr:solr-ref-guide:compileTestJava
Note: Some input files use or override a deprecated API.
Note: Recompile with -Xlint:deprecation for details.
> Task :solr:solr-ref-guide:testClasses
> Task :solr:solr-ref-guide:test
:solr:solr-ref-guide:test (SUCCESS): 32 test(s)
> Task :solr:solr-ref-guide:wipeTaskTemp
> Task :solr:core:compileTestJava
Note: Some input files use or override a deprecated API.
Note: Recompile with -Xlint:deprecation for details.
> Task :solr:core:testClasses
> Task :solr:solrj:compileTestJava
Note: Some input files use or override a deprecated API.
Note: Recompile with -Xlint:deprecation for details.
> Task :solr:core:test
WARNING: Test org.apache.solr.TestRandomFaceting wrote 14,753,895 bytes of output.
org.apache.solr.cluster.events.impl.CollectionsRepairEventListenerTest > classMethod FAILED
com.carrotsearch.randomizedtesting.ThreadLeakError: 1 thread leaked from SUITE scope at org.apache.solr.cluster.events.impl.CollectionsRepairEventListenerTest:
1) Thread[id=24535, name=aliveCheckExecutor-17727-thread-1, state=TIMED_WAITING, group=TGRP-CollectionsRepairEventListenerTest]
at java.base@11.0.16.1/jdk.internal.misc.Unsafe.park(Native Method)
at java.base@11.0.16.1/java.util.concurrent.locks.LockSupport.parkNanos(LockSupport.java:234)
at java.base@11.0.16.1/java.util.concurrent.locks.AbstractQueuedSynchronizer$ConditionObject.awaitNanos(AbstractQueuedSynchronizer.java:2123)
at java.base@11.0.16.1/java.util.concurrent.ScheduledThreadPoolExecutor$DelayedWorkQueue.take(ScheduledThreadPoolExecutor.java:1182)
at java.base@11.0.16.1/java.util.concurrent.ScheduledThreadPoolExecutor$DelayedWorkQueue.take(ScheduledThreadPoolExecutor.java:899)
at java.base@11.0.16.1/java.util.concurrent.ThreadPoolExecutor.getTask(ThreadPoolExecutor.java:1054)
at java.base@11.0.16.1/java.util.concurrent.ThreadPoolExecutor.runWorker(ThreadPoolExecutor.java:1114)
at java.base@11.0.16.1/java.util.concurrent.ThreadPoolExecutor$Worker.run(ThreadPoolExecutor.java:628)
at java.base@11.0.16.1/java.lang.Thread.run(Thread.java:829)
at __randomizedtesting.SeedInfo.seed([E5D43192C472A207]:0)
org.apache.solr.cluster.events.impl.CollectionsRepairEventListenerTest > classMethod FAILED
com.carrotsearch.randomizedtesting.ThreadLeakError: There are still zombie threads that couldn't be terminated:
1) Thread[id=24535, name=aliveCheckExecutor-17727-thread-1, state=TIMED_WAITING, group=TGRP-CollectionsRepairEventListenerTest]
at java.base@11.0.16.1/jdk.internal.misc.Unsafe.park(Native Method)
at java.base@11.0.16.1/java.util.concurrent.locks.LockSupport.parkNanos(LockSupport.java:234)
at java.base@11.0.16.1/java.util.concurrent.locks.AbstractQueuedSynchronizer$ConditionObject.awaitNanos(AbstractQueuedSynchronizer.java:2123)
at java.base@11.0.16.1/java.util.concurrent.ScheduledThreadPoolExecutor$DelayedWorkQueue.take(ScheduledThreadPoolExecutor.java:1182)
at java.base@11.0.16.1/java.util.concurrent.ScheduledThreadPoolExecutor$DelayedWorkQueue.take(ScheduledThreadPoolExecutor.java:899)
at java.base@11.0.16.1/java.util.concurrent.ThreadPoolExecutor.getTask(ThreadPoolExecutor.java:1054)
at java.base@11.0.16.1/java.util.concurrent.ThreadPoolExecutor.runWorker(ThreadPoolExecutor.java:1114)
at java.base@11.0.16.1/java.util.concurrent.ThreadPoolExecutor$Worker.run(ThreadPoolExecutor.java:628)
at java.base@11.0.16.1/java.lang.Thread.run(Thread.java:829)
at __randomizedtesting.SeedInfo.seed([E5D43192C472A207]:0)
org.apache.solr.cluster.events.impl.CollectionsRepairEventListenerTest > test suite's output saved to /home/jenkins/jenkins-slave/workspace/Solr/Solr-Smoketest-9.4/_tmp/smoke_1708451314/unpack/solr-9.4.2/solr/core/build/test-results/test/outputs/OUTPUT-org.apache.solr.cluster.events.impl.CollectionsRepairEventListenerTest.txt, copied below:
2> 1132226 INFO (SUITE-CollectionsRepairEventListenerTest-seed#[E5D43192C472A207]-worker) [n: c: s: r: x: t:] o.a.s.SolrTestCase Setting 'solr.default.confdir' system property to test-framework derived value of '/home/jenkins/jenkins-slave/workspace/Solr/Solr-Smoketest-9.4/_tmp/smoke_1708451314/unpack/solr-9.4.2/solr/server/solr/configsets/_default/conf'
2> 1132227 INFO (SUITE-CollectionsRepairEventListenerTest-seed#[E5D43192C472A207]-worker) [n: c: s: r: x: t:] o.a.s.u.ErrorLogMuter Closing ErrorLogMuter-regex-310 after mutting 0 log messages
2> 1132227 INFO (SUITE-CollectionsRepairEventListenerTest-seed#[E5D43192C472A207]-worker) [n: c: s: r: x: t:] o.a.s.u.ErrorLogMuter Creating ErrorLogMuter-regex-311 for ERROR logs matching regex: ignore_exception
2> 1132228 INFO (SUITE-CollectionsRepairEventListenerTest-seed#[E5D43192C472A207]-worker) [n: c: s: r: x: t:] o.a.s.SolrTestCaseJ4 Created dataDir: /home/jenkins/jenkins-slave/workspace/Solr/Solr-Smoketest-9.4/_tmp/smoke_1708451314/unpack/solr-9.4.2/solr/core/build/tmp/tests-tmp/solr.cluster.events.impl.CollectionsRepairEventListenerTest_E5D43192C472A207-001/data-dir-103-001
2> 1132228 INFO (SUITE-CollectionsRepairEventListenerTest-seed#[E5D43192C472A207]-worker) [n: c: s: r: x: t:] o.a.s.SolrTestCaseJ4 Using PointFields (NUMERIC_POINTS_SYSPROP=true) w/NUMERIC_DOCVALUES_SYSPROP=true
2> 1132229 INFO (SUITE-CollectionsRepairEventListenerTest-seed#[E5D43192C472A207]-worker) [n: c: s: r: x: t:] o.a.s.SolrTestCaseJ4 Randomized ssl (true) and clientAuth (true) via: @org.apache.solr.util.RandomizeSSL(reason="", ssl=0.0/0.0, value=0.0/0.0, clientAuth=0.0/0.0)
2> 1132230 INFO (SUITE-CollectionsRepairEventListenerTest-seed#[E5D43192C472A207]-worker) [n: c: s: r: x: t:] o.a.s.SolrTestCaseJ4 SecureRandom sanity checks: test.solr.allowed.securerandom=null & java.security.egd=file:/dev/./urandom
2> 1132230 INFO (SUITE-CollectionsRepairEventListenerTest-seed#[E5D43192C472A207]-worker) [n: c: s: r: x: t:] o.a.s.u.t.SimplePropagator Always-on trace id generation enabled.
2> 1132230 INFO (SUITE-CollectionsRepairEventListenerTest-seed#[E5D43192C472A207]-worker) [n: c: s: r: x: t:] o.a.s.c.MiniSolrCloudCluster Starting cluster of 3 servers in /home/jenkins/jenkins-slave/workspace/Solr/Solr-Smoketest-9.4/_tmp/smoke_1708451314/unpack/solr-9.4.2/solr/core/build/tmp/tests-tmp/solr.cluster.events.impl.CollectionsRepairEventListenerTest_E5D43192C472A207-001/tempDir-001
2> 1132230 INFO (SUITE-CollectionsRepairEventListenerTest-seed#[E5D43192C472A207]-worker) [n: c: s: r: x: t:] o.a.s.c.ZkTestServer STARTING ZK TEST SERVER
2> 1132230 INFO (ZkTestServer Run Thread) [n: c: s: r: x: t:] o.a.s.c.ZkTestServer client port: 0.0.0.0/0.0.0.0:0
2> 1132230 INFO (ZkTestServer Run Thread) [n: c: s: r: x: t:] o.a.s.c.ZkTestServer Starting server
2> 1132231 WARN (ZkTestServer Run Thread) [n: c: s: r: x: t:] o.a.z.s.ServerCnxnFactory maxCnxns is not configured, using default value 0.
2> 1132330 INFO (SUITE-CollectionsRepairEventListenerTest-seed#[E5D43192C472A207]-worker) [n: c: s: r: x: t:] o.a.s.c.ZkTestServer start zk server on port: 40195
2> 1132331 WARN (SUITE-CollectionsRepairEventListenerTest-seed#[E5D43192C472A207]-worker) [n: c: s: r: x: t:] o.a.s.c.c.SolrZkClient Using default ZkCredentialsInjector. ZkCredentialsInjector is not secure, it creates an empty list of credentials which leads to 'OPEN_ACL_UNSAFE' ACLs to Zookeeper nodes
2> 1132332 INFO (SUITE-CollectionsRepairEventListenerTest-seed#[E5D43192C472A207]-worker) [n: c: s: r: x: t:] o.a.s.c.c.ConnectionManager Waiting up to 30000ms for client to connect to ZooKeeper
2> 1132337 INFO (zkConnectionManagerCallback-17612-thread-1) [n: c: s: r: x: t:] o.a.s.c.c.ConnectionManager zkClient has connected
2> 1132337 INFO (SUITE-CollectionsRepairEventListenerTest-seed#[E5D43192C472A207]-worker) [n: c: s: r: x: t:] o.a.s.c.c.ConnectionManager Client is connected to ZooKeeper
2> 1132337 WARN (SUITE-CollectionsRepairEventListenerTest-seed#[E5D43192C472A207]-worker) [n: c: s: r: x: t:] o.a.s.c.c.SolrZkClient Using default ZkACLProvider. DefaultZkACLProvider is not secure, it creates 'OPEN_ACL_UNSAFE' ACLs to Zookeeper nodes
2> 1132338 WARN (SUITE-CollectionsRepairEventListenerTest-seed#[E5D43192C472A207]-worker) [n: c: s: r: x: t:] o.a.s.c.c.SolrZkClient Using default ZkCredentialsInjector. ZkCredentialsInjector is not secure, it creates an empty list of credentials which leads to 'OPEN_ACL_UNSAFE' ACLs to Zookeeper nodes
2> 1132340 INFO (SUITE-CollectionsRepairEventListenerTest-seed#[E5D43192C472A207]-worker) [n: c: s: r: x: t:] o.a.s.c.c.ConnectionManager Waiting up to 30000ms for client to connect to ZooKeeper
2> 1132345 INFO (zkConnectionManagerCallback-17614-thread-1) [n: c: s: r: x: t:] o.a.s.c.c.ConnectionManager zkClient has connected
2> 1132345 INFO (SUITE-CollectionsRepairEventListenerTest-seed#[E5D43192C472A207]-worker) [n: c: s: r: x: t:] o.a.s.c.c.ConnectionManager Client is connected to ZooKeeper
2> 1132345 WARN (SUITE-CollectionsRepairEventListenerTest-seed#[E5D43192C472A207]-worker) [n: c: s: r: x: t:] o.a.s.c.c.SolrZkClient Using default ZkACLProvider. DefaultZkACLProvider is not secure, it creates 'OPEN_ACL_UNSAFE' ACLs to Zookeeper nodes
2> 1132345 WARN (SUITE-CollectionsRepairEventListenerTest-seed#[E5D43192C472A207]-worker) [n: c: s: r: x: t:] o.a.s.c.c.SolrZkClient Using default ZkCredentialsInjector. ZkCredentialsInjector is not secure, it creates an empty list of credentials which leads to 'OPEN_ACL_UNSAFE' ACLs to Zookeeper nodes
2> 1132345 INFO (SUITE-CollectionsRepairEventListenerTest-seed#[E5D43192C472A207]-worker) [n: c: s: r: x: t:] o.a.s.c.c.ConnectionManager Waiting up to 15000ms for client to connect to ZooKeeper
2> 1132348 INFO (zkConnectionManagerCallback-17616-thread-1) [n: c: s: r: x: t:] o.a.s.c.c.ConnectionManager zkClient has connected
2> 1132348 INFO (SUITE-CollectionsRepairEventListenerTest-seed#[E5D43192C472A207]-worker) [n: c: s: r: x: t:] o.a.s.c.c.ConnectionManager Client is connected to ZooKeeper
2> 1132349 WARN (SUITE-CollectionsRepairEventListenerTest-seed#[E5D43192C472A207]-worker) [n: c: s: r: x: t:] o.a.s.c.c.SolrZkClient Using default ZkACLProvider. DefaultZkACLProvider is not secure, it creates 'OPEN_ACL_UNSAFE' ACLs to Zookeeper nodes
2> 1132453 INFO (jetty-launcher-17617-thread-3) [n: c: s: r: x: t:] o.a.s.e.JettySolrRunner Start Jetty (configured port=0, binding port=0)
2> 1132453 INFO (jetty-launcher-17617-thread-1) [n: c: s: r: x: t:] o.a.s.e.JettySolrRunner Start Jetty (configured port=0, binding port=0)
2> 1132453 INFO (jetty-launcher-17617-thread-2) [n: c: s: r: x: t:] o.a.s.e.JettySolrRunner Start Jetty (configured port=0, binding port=0)
2> 1132454 INFO (jetty-launcher-17617-thread-2) [n: c: s: r: x: t:] o.a.s.e.JettySolrRunner Trying to start Jetty on port 0 try number 2 ...
2> 1132454 INFO (jetty-launcher-17617-thread-3) [n: c: s: r: x: t:] o.a.s.e.JettySolrRunner Trying to start Jetty on port 0 try number 2 ...
2> 1132454 INFO (jetty-launcher-17617-thread-2) [n: c: s: r: x: t:] o.e.j.s.Server jetty-10.0.19; built: 2023-12-15T20:38:32.477Z; git: 8492d1c78f122bb30cce20aecfa07e7283facd47; jvm 11.0.16.1+1
2> 1132453 INFO (jetty-launcher-17617-thread-1) [n: c: s: r: x: t:] o.a.s.e.JettySolrRunner Trying to start Jetty on port 0 try number 2 ...
2> 1132454 INFO (jetty-launcher-17617-thread-3) [n: c: s: r: x: t:] o.e.j.s.Server jetty-10.0.19; built: 2023-12-15T20:38:32.477Z; git: 8492d1c78f122bb30cce20aecfa07e7283facd47; jvm 11.0.16.1+1
2> 1132454 INFO (jetty-launcher-17617-thread-1) [n: c: s: r: x: t:] o.e.j.s.Server jetty-10.0.19; built: 2023-12-15T20:38:32.477Z; git: 8492d1c78f122bb30cce20aecfa07e7283facd47; jvm 11.0.16.1+1
2> 1132461 INFO (jetty-launcher-17617-thread-3) [n: c: s: r: x: t:] o.e.j.s.s.DefaultSessionIdManager Session workerName=node0
2> 1132465 INFO (jetty-launcher-17617-thread-3) [n: c: s: r: x: t:] o.e.j.s.h.ContextHandler Started o.e.j.s.ServletContextHandler@3215708f{/solr,file:///home/jenkins/jenkins-slave/workspace/Solr/Solr-Smoketest-9.4/_tmp/smoke_1708451314/unpack/solr-9.4.2/solr/core/build/tmp/tests-cwd/,AVAILABLE}
2> 1132466 INFO (jetty-launcher-17617-thread-3) [n: c: s: r: x: t:] o.e.j.s.AbstractConnector Started ServerConnector@5f600a8{ssl, (ssl, alpn, http/1.1, h2)}{127.0.0.1:39503}
2> 1132466 INFO (jetty-launcher-17617-thread-3) [n: c: s: r: x: t:] o.e.j.s.Server Started Server@75701215{STARTING}[10.0.19,sto=0] @1132494ms
2> 1132466 ERROR (jetty-launcher-17617-thread-3) [n: c: s: r: x: t:] o.a.s.u.StartupLoggingUtils Missing Java Option solr.log.dir. Logging may be missing or incomplete.
2> 1132466 INFO (jetty-launcher-17617-thread-3) [n: c: s: r: x: t:] o.a.s.s.CoreContainerProvider Using logger factory org.apache.logging.slf4j.Log4jLoggerFactory
2> 1132466 INFO (jetty-launcher-17617-thread-3) [n: c: s: r: x: t:] o.a.s.s.CoreContainerProvider ___ _ Welcome to Apache Solr™ version 9.4.2
2> 1132466 INFO (jetty-launcher-17617-thread-3) [n: c: s: r: x: t:] o.a.s.s.CoreContainerProvider / __| ___| |_ _ Starting in cloud mode on port null
2> 1132466 INFO (jetty-launcher-17617-thread-3) [n: c: s: r: x: t:] o.a.s.s.CoreContainerProvider \__ \/ _ \ | '_| Install dir: /home/jenkins/jenkins-slave/workspace/Solr/Solr-Smoketest-9.4/_tmp/smoke_1708451314/unpack/solr-9.4.2/solr
2> 1132466 INFO (jetty-launcher-17617-thread-3) [n: c: s: r: x: t:] o.a.s.s.CoreContainerProvider |___/\___/_|_| Start time: 2024-02-20T18:12:42.277600Z
2> 1132466 INFO (jetty-launcher-17617-thread-3) [n: c: s: r: x: t:] o.a.s.s.CoreContainerProvider Solr Home: /home/jenkins/jenkins-slave/workspace/Solr/Solr-Smoketest-9.4/_tmp/smoke_1708451314/unpack/solr-9.4.2/solr/core/build/tmp/tests-tmp/solr.cluster.events.impl.CollectionsRepairEventListenerTest_E5D43192C472A207-001/tempDir-001/node3 (source: servlet config: solr.solr.home)
2> 1132466 WARN (jetty-launcher-17617-thread-3) [n: c: s: r: x: t:] o.a.s.c.c.SolrZkClient Using default ZkCredentialsInjector. ZkCredentialsInjector is not secure, it creates an empty list of credentials which leads to 'OPEN_ACL_UNSAFE' ACLs to Zookeeper nodes
2> 1132467 INFO (jetty-launcher-17617-thread-3) [n: c: s: r: x: t:] o.a.s.c.c.ConnectionManager Waiting up to 30000ms for client to connect to ZooKeeper
2> 1132467 INFO (jetty-launcher-17617-thread-1) [n: c: s: r: x: t:] o.e.j.s.s.DefaultSessionIdManager Session workerName=node0
2> 1132468 INFO (jetty-launcher-17617-thread-2) [n: c: s: r: x: t:] o.e.j.s.s.DefaultSessionIdManager Session workerName=node0
2> 1132469 INFO (zkConnectionManagerCallback-17619-thread-1) [n: c: s: r: x: t:] o.a.s.c.c.ConnectionManager zkClient has connected
2> 1132469 INFO (jetty-launcher-17617-thread-3) [n: c: s: r: x: t:] o.a.s.c.c.ConnectionManager Client is connected to ZooKeeper
2> 1132469 WARN (jetty-launcher-17617-thread-3) [n: c: s: r: x: t:] o.a.s.c.c.SolrZkClient Using default ZkACLProvider. DefaultZkACLProvider is not secure, it creates 'OPEN_ACL_UNSAFE' ACLs to Zookeeper nodes
2> 1132469 INFO (jetty-launcher-17617-thread-3) [n: c: s: r: x: t:] o.a.s.c.NodeConfig solr.xml found in ZooKeeper. Loading...
2> 1132470 INFO (jetty-launcher-17617-thread-3) [n: c: s: r: x: t:] o.a.s.c.SolrXmlConfig Metrics collection is disabled.
2> 1132473 INFO (jetty-launcher-17617-thread-2) [n: c: s: r: x: t:] o.e.j.s.h.ContextHandler Started o.e.j.s.ServletContextHandler@34a60522{/solr,file:///home/jenkins/jenkins-slave/workspace/Solr/Solr-Smoketest-9.4/_tmp/smoke_1708451314/unpack/solr-9.4.2/solr/core/build/tmp/tests-cwd/,AVAILABLE}
2> 1132473 INFO (jetty-launcher-17617-thread-1) [n: c: s: r: x: t:] o.e.j.s.h.ContextHandler Started o.e.j.s.ServletContextHandler@693de858{/solr,file:///home/jenkins/jenkins-slave/workspace/Solr/Solr-Smoketest-9.4/_tmp/smoke_1708451314/unpack/solr-9.4.2/solr/core/build/tmp/tests-cwd/,AVAILABLE}
2> 1132473 INFO (jetty-launcher-17617-thread-2) [n: c: s: r: x: t:] o.e.j.s.AbstractConnector Started ServerConnector@4f32c4cf{ssl, (ssl, alpn, http/1.1, h2)}{127.0.0.1:38813}
2> 1132473 INFO (jetty-launcher-17617-thread-2) [n: c: s: r: x: t:] o.e.j.s.Server Started Server@6eac31f{STARTING}[10.0.19,sto=0] @1132502ms
2> 1132473 INFO (jetty-launcher-17617-thread-1) [n: c: s: r: x: t:] o.e.j.s.AbstractConnector Started ServerConnector@63867a30{ssl, (ssl, alpn, http/1.1, h2)}{127.0.0.1:33381}
2> 1132474 INFO (jetty-launcher-17617-thread-1) [n: c: s: r: x: t:] o.e.j.s.Server Started Server@e1e2ecb{STARTING}[10.0.19,sto=0] @1132502ms
2> 1132474 ERROR (jetty-launcher-17617-thread-2) [n: c: s: r: x: t:] o.a.s.u.StartupLoggingUtils Missing Java Option solr.log.dir. Logging may be missing or incomplete.
2> 1132474 INFO (jetty-launcher-17617-thread-2) [n: c: s: r: x: t:] o.a.s.s.CoreContainerProvider Using logger factory org.apache.logging.slf4j.Log4jLoggerFactory
2> 1132474 INFO (jetty-launcher-17617-thread-2) [n: c: s: r: x: t:] o.a.s.s.CoreContainerProvider ___ _ Welcome to Apache Solr™ version 9.4.2
2> 1132474 ERROR (jetty-launcher-17617-thread-1) [n: c: s: r: x: t:] o.a.s.u.StartupLoggingUtils Missing Java Option solr.log.dir. Logging may be missing or incomplete.
2> 1132474 INFO (jetty-launcher-17617-thread-1) [n: c: s: r: x: t:] o.a.s.s.CoreContainerProvider Using logger factory org.apache.logging.slf4j.Log4jLoggerFactory
2> 1132474 INFO (jetty-launcher-17617-thread-2) [n: c: s: r: x: t:] o.a.s.s.CoreContainerProvider / __| ___| |_ _ Starting in cloud mode on port null
2> 1132474 INFO (jetty-launcher-17617-thread-2) [n: c: s: r: x: t:] o.a.s.s.CoreContainerProvider \__ \/ _ \ | '_| Install dir: /home/jenkins/jenkins-slave/workspace/Solr/Solr-Smoketest-9.4/_tmp/smoke_1708451314/unpack/solr-9.4.2/solr
2> 1132474 INFO (jetty-launcher-17617-thread-2) [n: c: s: r: x: t:] o.a.s.s.CoreContainerProvider |___/\___/_|_| Start time: 2024-02-20T18:12:42.285165Z
2> 1132474 INFO (jetty-launcher-17617-thread-1) [n: c: s: r: x: t:] o.a.s.s.CoreContainerProvider ___ _ Welcome to Apache Solr™ version 9.4.2
2> 1132474 INFO (jetty-launcher-17617-thread-1) [n: c: s: r: x: t:] o.a.s.s.CoreContainerProvider / __| ___| |_ _ Starting in cloud mode on port null
2> 1132474 INFO (jetty-launcher-17617-thread-1) [n: c: s: r: x: t:] o.a.s.s.CoreContainerProvider \__ \/ _ \ | '_| Install dir: /home/jenkins/jenkins-slave/workspace/Solr/Solr-Smoketest-9.4/_tmp/smoke_1708451314/unpack/solr-9.4.2/solr
2> 1132474 INFO (jetty-launcher-17617-thread-1) [n: c: s: r: x: t:] o.a.s.s.CoreContainerProvider |___/\___/_|_| Start time: 2024-02-20T18:12:42.285219Z
2> 1132474 INFO (jetty-launcher-17617-thread-2) [n: c: s: r: x: t:] o.a.s.s.CoreContainerProvider Solr Home: /home/jenkins/jenkins-slave/workspace/Solr/Solr-Smoketest-9.4/_tmp/smoke_1708451314/unpack/solr-9.4.2/solr/core/build/tmp/tests-tmp/solr.cluster.events.impl.CollectionsRepairEventListenerTest_E5D43192C472A207-001/tempDir-001/node2 (source: servlet config: solr.solr.home)
2> 1132474 INFO (jetty-launcher-17617-thread-1) [n: c: s: r: x: t:] o.a.s.s.CoreContainerProvider Solr Home: /home/jenkins/jenkins-slave/workspace/Solr/Solr-Smoketest-9.4/_tmp/smoke_1708451314/unpack/solr-9.4.2/solr/core/build/tmp/tests-tmp/solr.cluster.events.impl.CollectionsRepairEventListenerTest_E5D43192C472A207-001/tempDir-001/node1 (source: servlet config: solr.solr.home)
2> 1132474 WARN (jetty-launcher-17617-thread-2) [n: c: s: r: x: t:] o.a.s.c.c.SolrZkClient Using default ZkCredentialsInjector. ZkCredentialsInjector is not secure, it creates an empty list of credentials which leads to 'OPEN_ACL_UNSAFE' ACLs to Zookeeper nodes
2> 1132474 WARN (jetty-launcher-17617-thread-1) [n: c: s: r: x: t:] o.a.s.c.c.SolrZkClient Using default ZkCredentialsInjector. ZkCredentialsInjector is not secure, it creates an empty list of credentials which leads to 'OPEN_ACL_UNSAFE' ACLs to Zookeeper nodes
2> 1132477 INFO (jetty-launcher-17617-thread-2) [n: c: s: r: x: t:] o.a.s.c.c.ConnectionManager Waiting up to 30000ms for client to connect to ZooKeeper
2> 1132477 INFO (jetty-launcher-17617-thread-1) [n: c: s: r: x: t:] o.a.s.c.c.ConnectionManager Waiting up to 30000ms for client to connect to ZooKeeper
2> 1132477 INFO (zkConnectionManagerCallback-17621-thread-1) [n: c: s: r: x: t:] o.a.s.c.c.ConnectionManager zkClient has connected
2> 1132478 INFO (jetty-launcher-17617-thread-2) [n: c: s: r: x: t:] o.a.s.c.c.ConnectionManager Client is connected to ZooKeeper
2> 1132478 WARN (jetty-launcher-17617-thread-2) [n: c: s: r: x: t:] o.a.s.c.c.SolrZkClient Using default ZkACLProvider. DefaultZkACLProvider is not secure, it creates 'OPEN_ACL_UNSAFE' ACLs to Zookeeper nodes
2> 1132478 INFO (zkConnectionManagerCallback-17623-thread-1) [n: c: s: r: x: t:] o.a.s.c.c.ConnectionManager zkClient has connected
2> 1132478 INFO (jetty-launcher-17617-thread-1) [n: c: s: r: x: t:] o.a.s.c.c.ConnectionManager Client is connected to ZooKeeper
2> 1132478 WARN (jetty-launcher-17617-thread-1) [n: c: s: r: x: t:] o.a.s.c.c.SolrZkClient Using default ZkACLProvider. DefaultZkACLProvider is not secure, it creates 'OPEN_ACL_UNSAFE' ACLs to Zookeeper nodes
2> 1132478 INFO (jetty-launcher-17617-thread-2) [n: c: s: r: x: t:] o.a.s.c.NodeConfig solr.xml found in ZooKeeper. Loading...
2> 1132478 INFO (jetty-launcher-17617-thread-1) [n: c: s: r: x: t:] o.a.s.c.NodeConfig solr.xml found in ZooKeeper. Loading...
2> 1132479 INFO (jetty-launcher-17617-thread-2) [n: c: s: r: x: t:] o.a.s.c.SolrXmlConfig Metrics collection is disabled.
2> 1132479 INFO (jetty-launcher-17617-thread-1) [n: c: s: r: x: t:] o.a.s.c.SolrXmlConfig Metrics collection is disabled.
2> 1132573 WARN (jetty-launcher-17617-thread-3) [n: c: s: r: x: t:] o.e.j.u.s.S.config Trusting all certificates configured for Client@690472e[provider=null,keyStore=null,trustStore=null]
2> 1132573 WARN (jetty-launcher-17617-thread-3) [n: c: s: r: x: t:] o.e.j.u.s.S.config No Client EndPointIdentificationAlgorithm configured for Client@690472e[provider=null,keyStore=null,trustStore=null]
2> 1132576 WARN (jetty-launcher-17617-thread-3) [n: c: s: r: x: t:] o.e.j.u.s.S.config Trusting all certificates configured for Client@62b8e6ff[provider=null,keyStore=null,trustStore=null]
2> 1132576 WARN (jetty-launcher-17617-thread-3) [n: c: s: r: x: t:] o.e.j.u.s.S.config No Client EndPointIdentificationAlgorithm configured for Client@62b8e6ff[provider=null,keyStore=null,trustStore=null]
2> 1132577 INFO (jetty-launcher-17617-thread-3) [n: c: s: r: x: t:] o.a.s.c.ZkContainer Zookeeper client=127.0.0.1:40195/solr
2> 1132577 INFO (jetty-launcher-17617-thread-3) [n: c: s: r: x: t:] o.a.s.c.DistributedClusterStateUpdater Creating DistributedClusterStateUpdater with useDistributedStateUpdate=false. Solr will be using Overseer based cluster state updates.
2> 1132580 INFO (jetty-launcher-17617-thread-3) [n:127.0.0.1:39503_solr c: s: r: x: t:] o.a.s.c.c.ConnectionManager Waiting up to 15000ms for client to connect to ZooKeeper
2> 1132581 INFO (zkConnectionManagerCallback-17633-thread-1) [n: c: s: r: x: t:] o.a.s.c.c.ConnectionManager zkClient has connected
2> 1132581 INFO (jetty-launcher-17617-thread-3) [n:127.0.0.1:39503_solr c: s: r: x: t:] o.a.s.c.c.ConnectionManager Client is connected to ZooKeeper
2> 1132582 WARN (jetty-launcher-17617-thread-1) [n: c: s: r: x: t:] o.e.j.u.s.S.config Trusting all certificates configured for Client@70e7710e[provider=null,keyStore=null,trustStore=null]
2> 1132582 WARN (jetty-launcher-17617-thread-1) [n: c: s: r: x: t:] o.e.j.u.s.S.config No Client EndPointIdentificationAlgorithm configured for Client@70e7710e[provider=null,keyStore=null,trustStore=null]
2> 1132582 WARN (jetty-launcher-17617-thread-2) [n: c: s: r: x: t:] o.e.j.u.s.S.config Trusting all certificates configured for Client@2a5c2df4[provider=null,keyStore=null,trustStore=null]
2> 1132583 WARN (jetty-launcher-17617-thread-2) [n: c: s: r: x: t:] o.e.j.u.s.S.config No Client EndPointIdentificationAlgorithm configured for Client@2a5c2df4[provider=null,keyStore=null,trustStore=null]
2> 1132589 WARN (jetty-launcher-17617-thread-2) [n: c: s: r: x: t:] o.e.j.u.s.S.config Trusting all certificates configured for Client@7087c3cc[provider=null,keyStore=null,trustStore=null]
2> 1132589 WARN (jetty-launcher-17617-thread-2) [n: c: s: r: x: t:] o.e.j.u.s.S.config No Client EndPointIdentificationAlgorithm configured for Client@7087c3cc[provider=null,keyStore=null,trustStore=null]
2> 1132591 WARN (jetty-launcher-17617-thread-1) [n: c: s: r: x: t:] o.e.j.u.s.S.config Trusting all certificates configured for Client@355f0c5e[provider=null,keyStore=null,trustStore=null]
2> 1132591 WARN (jetty-launcher-17617-thread-1) [n: c: s: r: x: t:] o.e.j.u.s.S.config No Client EndPointIdentificationAlgorithm configured for Client@355f0c5e[provider=null,keyStore=null,trustStore=null]
2> 1132593 INFO (jetty-launcher-17617-thread-2) [n: c: s: r: x: t:] o.a.s.c.ZkContainer Zookeeper client=127.0.0.1:40195/solr
2> 1132593 INFO (jetty-launcher-17617-thread-2) [n: c: s: r: x: t:] o.a.s.c.DistributedClusterStateUpdater Creating DistributedClusterStateUpdater with useDistributedStateUpdate=false. Solr will be using Overseer based cluster state updates.
2> 1132594 WARN (jetty-launcher-17617-thread-3) [n:127.0.0.1:39503_solr c: s: r: x: t:] o.a.s.c.ZkController Contents of zookeeper /security.json are world-readable; consider setting up ACLs as described in https://solr.apache.org/guide/solr/latest/deployment-guide/zookeeper-access-control.html
2> 1132595 INFO (jetty-launcher-17617-thread-1) [n: c: s: r: x: t:] o.a.s.c.ZkContainer Zookeeper client=127.0.0.1:40195/solr
2> 1132595 INFO (jetty-launcher-17617-thread-1) [n: c: s: r: x: t:] o.a.s.c.DistributedClusterStateUpdater Creating DistributedClusterStateUpdater with useDistributedStateUpdate=false. Solr will be using Overseer based cluster state updates.
2> 1132595 INFO (jetty-launcher-17617-thread-3) [n:127.0.0.1:39503_solr c: s: r: x: t:] o.a.s.c.DistributedClusterStateUpdater Creating DistributedClusterStateUpdater with useDistributedStateUpdate=false. Solr will be using Overseer based cluster state updates.
2> 1132596 INFO (jetty-launcher-17617-thread-2) [n:127.0.0.1:38813_solr c: s: r: x: t:] o.a.s.c.c.ConnectionManager Waiting up to 15000ms for client to connect to ZooKeeper
2> 1132597 INFO (jetty-launcher-17617-thread-3) [n:127.0.0.1:39503_solr c: s: r: x: t:] o.a.s.c.OverseerElectionContext I am going to be the leader 127.0.0.1:39503_solr
2> 1132598 INFO (jetty-launcher-17617-thread-3) [n:127.0.0.1:39503_solr c: s: r: x: t:] o.a.s.c.Overseer Overseer (id=72227701537570822-127.0.0.1:39503_solr-n_0000000000) starting
2> 1132603 INFO (jetty-launcher-17617-thread-1) [n:127.0.0.1:33381_solr c: s: r: x: t:] o.a.s.c.c.ConnectionManager Waiting up to 15000ms for client to connect to ZooKeeper
2> 1132603 INFO (zkConnectionManagerCallback-17655-thread-1) [n: c: s: r: x: t:] o.a.s.c.c.ConnectionManager zkClient has connected
2> 1132603 INFO (jetty-launcher-17617-thread-1) [n:127.0.0.1:33381_solr c: s: r: x: t:] o.a.s.c.c.ConnectionManager Client is connected to ZooKeeper
2> 1132604 INFO (jetty-launcher-17617-thread-3) [n:127.0.0.1:39503_solr c: s: r: x: t:] o.a.s.c.ZkController Register node as live in ZooKeeper:/live_nodes/127.0.0.1:39503_solr
2> 1132607 WARN (jetty-launcher-17617-thread-3) [n:127.0.0.1:39503_solr c: s: r: x: t:] o.a.s.c.CoreContainer Not all security plugins configured! authentication=disabled authorization=disabled. Solr is only as secure as you make it. Consider configuring authentication/authorization before exposing Solr to users internal or external. See https://s.apache.org/solrsecurity for more info
2> 1132608 INFO (zkConnectionManagerCallback-17652-thread-1) [n: c: s: r: x: t:] o.a.s.c.c.ConnectionManager zkClient has connected
2> 1132609 INFO (jetty-launcher-17617-thread-2) [n:127.0.0.1:38813_solr c: s: r: x: t:] o.a.s.c.c.ConnectionManager Client is connected to ZooKeeper
2> 1132612 WARN (jetty-launcher-17617-thread-1) [n:127.0.0.1:33381_solr c: s: r: x: t:] o.a.s.c.ZkController Contents of zookeeper /security.json are world-readable; consider setting up ACLs as described in https://solr.apache.org/guide/solr/latest/deployment-guide/zookeeper-access-control.html
2> 1132612 INFO (jetty-launcher-17617-thread-1) [n:127.0.0.1:33381_solr c: s: r: x: t:] o.a.s.c.c.ZkStateReader Updated live nodes from ZooKeeper... (0) -> (1)
2> 1132613 INFO (OverseerStateUpdate-72227701537570822-127.0.0.1:39503_solr-n_0000000000) [n:127.0.0.1:39503_solr c: s: r: x: t:] o.a.s.c.Overseer Starting to work on the main queue : 127.0.0.1:39503_solr
2> 1132614 INFO (OverseerStateUpdate-72227701537570822-127.0.0.1:39503_solr-n_0000000000) [n:127.0.0.1:39503_solr c: s: r: x: t:] o.a.s.c.c.ZkStateReader Updated live nodes from ZooKeeper... (0) -> (1)
2> 1132616 WARN (jetty-launcher-17617-thread-2) [n:127.0.0.1:38813_solr c: s: r: x: t:] o.a.s.c.ZkController Contents of zookeeper /security.json are world-readable; consider setting up ACLs as described in https://solr.apache.org/guide/solr/latest/deployment-guide/zookeeper-access-control.html
2> 1132617 INFO (jetty-launcher-17617-thread-2) [n:127.0.0.1:38813_solr c: s: r: x: t:] o.a.s.c.c.ZkStateReader Updated live nodes from ZooKeeper... (0) -> (1)
2> 1132620 INFO (jetty-launcher-17617-thread-2) [n:127.0.0.1:38813_solr c: s: r: x: t:] o.a.s.c.DistributedClusterStateUpdater Creating DistributedClusterStateUpdater with useDistributedStateUpdate=false. Solr will be using Overseer based cluster state updates.
2> 1132622 INFO (jetty-launcher-17617-thread-2) [n:127.0.0.1:38813_solr c: s: r: x: t:] o.a.s.c.ZkController Publish node=127.0.0.1:38813_solr as DOWN
2> 1132623 INFO (jetty-launcher-17617-thread-2) [n:127.0.0.1:38813_solr c: s: r: x: t:] o.a.s.c.ZkController Register node as live in ZooKeeper:/live_nodes/127.0.0.1:38813_solr
2> 1132625 INFO (zkCallback-17632-thread-1) [n: c: s: r: x: t:] o.a.s.c.c.ZkStateReader Updated live nodes from ZooKeeper... (1) -> (2)
2> 1132625 WARN (jetty-launcher-17617-thread-2) [n:127.0.0.1:38813_solr c: s: r: x: t:] o.a.s.c.CoreContainer Not all security plugins configured! authentication=disabled authorization=disabled. Solr is only as secure as you make it. Consider configuring authentication/authorization before exposing Solr to users internal or external. See https://s.apache.org/solrsecurity for more info
2> 1132630 INFO (jetty-launcher-17617-thread-1) [n:127.0.0.1:33381_solr c: s: r: x: t:] o.a.s.c.DistributedClusterStateUpdater Creating DistributedClusterStateUpdater with useDistributedStateUpdate=false. Solr will be using Overseer based cluster state updates.
2> 1132632 INFO (jetty-launcher-17617-thread-1) [n:127.0.0.1:33381_solr c: s: r: x: t:] o.a.s.c.ZkController Publish node=127.0.0.1:33381_solr as DOWN
2> 1132633 INFO (jetty-launcher-17617-thread-1) [n:127.0.0.1:33381_solr c: s: r: x: t:] o.a.s.c.ZkController Register node as live in ZooKeeper:/live_nodes/127.0.0.1:33381_solr
2> 1132633 INFO (zkCallback-17651-thread-1) [n: c: s: r: x: t:] o.a.s.c.c.ZkStateReader Updated live nodes from ZooKeeper... (1) -> (2)
2> 1132634 INFO (zkCallback-17651-thread-1) [n: c: s: r: x: t:] o.a.s.c.c.ZkStateReader Updated live nodes from ZooKeeper... (2) -> (3)
2> 1132634 INFO (zkCallback-17632-thread-1) [n: c: s: r: x: t:] o.a.s.c.c.ZkStateReader Updated live nodes from ZooKeeper... (2) -> (3)
2> 1132641 WARN (jetty-launcher-17617-thread-1) [n:127.0.0.1:33381_solr c: s: r: x: t:] o.a.s.c.CoreContainer Not all security plugins configured! authentication=disabled authorization=disabled. Solr is only as secure as you make it. Consider configuring authentication/authorization before exposing Solr to users internal or external. See https://s.apache.org/solrsecurity for more info
2> 1132641 INFO (zkCallback-17654-thread-1) [n: c: s: r: x: t:] o.a.s.c.c.ZkStateReader Updated live nodes from ZooKeeper... (1) -> (3)
2> 1132644 INFO (jetty-launcher-17617-thread-2) [n:127.0.0.1:38813_solr c: s: r: x: t:] o.a.s.c.CorePropertiesLocator Found 0 core definitions underneath /home/jenkins/jenkins-slave/workspace/Solr/Solr-Smoketest-9.4/_tmp/smoke_1708451314/unpack/solr-9.4.2/solr/core/build/tmp/tests-tmp/solr.cluster.events.impl.CollectionsRepairEventListenerTest_E5D43192C472A207-001/tempDir-001/node2
2> 1132670 INFO (jetty-launcher-17617-thread-3) [n:127.0.0.1:39503_solr c: s: r: x: t:] o.a.s.c.CorePropertiesLocator Found 0 core definitions underneath /home/jenkins/jenkins-slave/workspace/Solr/Solr-Smoketest-9.4/_tmp/smoke_1708451314/unpack/solr-9.4.2/solr/core/build/tmp/tests-tmp/solr.cluster.events.impl.CollectionsRepairEventListenerTest_E5D43192C472A207-001/tempDir-001/node3
2> 1132673 INFO (jetty-launcher-17617-thread-1) [n:127.0.0.1:33381_solr c: s: r: x: t:] o.a.s.c.CorePropertiesLocator Found 0 core definitions underneath /home/jenkins/jenkins-slave/workspace/Solr/Solr-Smoketest-9.4/_tmp/smoke_1708451314/unpack/solr-9.4.2/solr/core/build/tmp/tests-tmp/solr.cluster.events.impl.CollectionsRepairEventListenerTest_E5D43192C472A207-001/tempDir-001/node1
2> 1132691 INFO (jetty-launcher-17617-thread-2) [n:127.0.0.1:38813_solr c: s: r: x: t:] o.a.s.j.SolrRequestAuthorizer Creating a new SolrRequestAuthorizer
2> 1132693 INFO (jetty-launcher-17617-thread-3) [n:127.0.0.1:39503_solr c: s: r: x: t:] o.a.s.j.SolrRequestAuthorizer Creating a new SolrRequestAuthorizer
2> 1132695 INFO (jetty-launcher-17617-thread-1) [n:127.0.0.1:33381_solr c: s: r: x: t:] o.a.s.j.SolrRequestAuthorizer Creating a new SolrRequestAuthorizer
2> 1132705 INFO (jetty-launcher-17617-thread-2) [n:127.0.0.1:38813_solr c: s: r: x: t:] o.a.s.e.JettySolrRunner Jetty properties: {hostContext=/solr, hostPort=38813, zkHost=127.0.0.1:40195/solr}
2> 1132708 INFO (jetty-launcher-17617-thread-3) [n:127.0.0.1:39503_solr c: s: r: x: t:] o.a.s.e.JettySolrRunner Jetty properties: {hostContext=/solr, hostPort=39503, zkHost=127.0.0.1:40195/solr}
2> 1132710 INFO (jetty-launcher-17617-thread-1) [n:127.0.0.1:33381_solr c: s: r: x: t:] o.a.s.e.JettySolrRunner Jetty properties: {hostContext=/solr, hostPort=33381, zkHost=127.0.0.1:40195/solr}
2> 1132711 INFO (SUITE-CollectionsRepairEventListenerTest-seed#[E5D43192C472A207]-worker) [n: c: s: r: x: t:] o.a.s.c.MiniSolrCloudCluster waitForAllNodes: numServers=3
2> 1132711 INFO (SUITE-CollectionsRepairEventListenerTest-seed#[E5D43192C472A207]-worker) [n: c: s: r: x: t:] o.a.s.c.MiniSolrCloudCluster waitForNode: 127.0.0.1:38813_solr
2> 1132711 WARN (SUITE-CollectionsRepairEventListenerTest-seed#[E5D43192C472A207]-worker) [n: c: s: r: x: t:] o.a.s.c.c.SolrZkClient Using default ZkCredentialsInjector. ZkCredentialsInjector is not secure, it creates an empty list of credentials which leads to 'OPEN_ACL_UNSAFE' ACLs to Zookeeper nodes
2> 1132712 INFO (SUITE-CollectionsRepairEventListenerTest-seed#[E5D43192C472A207]-worker) [n: c: s: r: x: t:] o.a.s.c.c.ConnectionManager Waiting up to 15000ms for client to connect to ZooKeeper
2> 1132714 INFO (zkConnectionManagerCallback-17676-thread-1) [n: c: s: r: x: t:] o.a.s.c.c.ConnectionManager zkClient has connected
2> 1132714 INFO (SUITE-CollectionsRepairEventListenerTest-seed#[E5D43192C472A207]-worker) [n: c: s: r: x: t:] o.a.s.c.c.ConnectionManager Client is connected to ZooKeeper
2> 1132714 WARN (SUITE-CollectionsRepairEventListenerTest-seed#[E5D43192C472A207]-worker) [n: c: s: r: x: t:] o.a.s.c.c.SolrZkClient Using default ZkACLProvider. DefaultZkACLProvider is not secure, it creates 'OPEN_ACL_UNSAFE' ACLs to Zookeeper nodes
2> 1132714 INFO (SUITE-CollectionsRepairEventListenerTest-seed#[E5D43192C472A207]-worker) [n: c: s: r: x: t:] o.a.s.c.c.ZkStateReader Updated live nodes from ZooKeeper... (0) -> (3)
2> 1132715 INFO (SUITE-CollectionsRepairEventListenerTest-seed#[E5D43192C472A207]-worker) [n: c: s: r: x: t:] o.a.s.c.s.i.ZkClientClusterStateProvider Cluster at 127.0.0.1:40195/solr ready
2> 1132715 INFO (SUITE-CollectionsRepairEventListenerTest-seed#[E5D43192C472A207]-worker) [n: c: s: r: x: t:] o.a.s.c.MiniSolrCloudCluster waitForNode: 127.0.0.1:39503_solr
2> 1132715 INFO (SUITE-CollectionsRepairEventListenerTest-seed#[E5D43192C472A207]-worker) [n: c: s: r: x: t:] o.a.s.c.MiniSolrCloudCluster waitForNode: 127.0.0.1:33381_solr
2> 1132715 WARN (SUITE-CollectionsRepairEventListenerTest-seed#[E5D43192C472A207]-worker) [n: c: s: r: x: t:] o.a.s.c.c.SolrZkClient Using default ZkCredentialsInjector. ZkCredentialsInjector is not secure, it creates an empty list of credentials which leads to 'OPEN_ACL_UNSAFE' ACLs to Zookeeper nodes
2> 1132720 INFO (SUITE-CollectionsRepairEventListenerTest-seed#[E5D43192C472A207]-worker) [n: c: s: r: x: t:] o.a.s.c.c.ConnectionManager Waiting up to 45000ms for client to connect to ZooKeeper
2> 1132720 INFO (zkConnectionManagerCallback-17678-thread-1) [n: c: s: r: x: t:] o.a.s.c.c.ConnectionManager zkClient has connected
2> 1132721 INFO (SUITE-CollectionsRepairEventListenerTest-seed#[E5D43192C472A207]-worker) [n: c: s: r: x: t:] o.a.s.c.c.ConnectionManager Client is connected to ZooKeeper
2> 1132721 WARN (SUITE-CollectionsRepairEventListenerTest-seed#[E5D43192C472A207]-worker) [n: c: s: r: x: t:] o.a.s.c.c.SolrZkClient Using default ZkACLProvider. DefaultZkACLProvider is not secure, it creates 'OPEN_ACL_UNSAFE' ACLs to Zookeeper nodes
2> 1132883 INFO (qtp1280534718-24383) [n:127.0.0.1:33381_solr c: s: r: x: t:null-19326] o.a.s.s.HttpSolrCall [admin] webapp=null path=/cluster/plugin params={wt=javabin&version=2} status=0 QTime=5
2> 1132885 DEBUG (zkCallback-17651-thread-1) [n: c: s: r: x: t:] o.a.s.c.e.i.DelegatingClusterEventProducer --setting new delegate for CC-7a4e3240: org.apache.solr.cluster.events.impl.DefaultClusterEventProducer@5188f9bc
2> 1132885 DEBUG (zkCallback-17654-thread-1) [n: c: s: r: x: t:] o.a.s.c.e.i.DelegatingClusterEventProducer --setting new delegate for CC-df81d74: org.apache.solr.cluster.events.impl.DefaultClusterEventProducer@b9a982b
2> 1132885 DEBUG (zkCallback-17651-thread-1) [n: c: s: r: x: t:] o.a.s.c.e.i.DelegatingClusterEventProducer --- delegate org.apache.solr.cluster.events.impl.DefaultClusterEventProducer@5188f9bc already in state STOPPED
2> 1132885 DEBUG (zkCallback-17654-thread-1) [n: c: s: r: x: t:] o.a.s.c.e.i.DelegatingClusterEventProducer --- delegate org.apache.solr.cluster.events.impl.DefaultClusterEventProducer@b9a982b already in state STOPPED
2> 1132886 DEBUG (zkCallback-17632-thread-1) [n: c: s: r: x: t:] o.a.s.c.e.i.DelegatingClusterEventProducer --setting new delegate for CC-5918403c: org.apache.solr.cluster.events.impl.DefaultClusterEventProducer@4d03f3b9
2> 1132887 DEBUG (zkCallback-17632-thread-1) [n: c: s: r: x: t:] o.a.s.c.e.i.DelegatingClusterEventProducer --- delegate org.apache.solr.cluster.events.impl.DefaultClusterEventProducer@4d03f3b9 already in state RUNNING
2> 1132888 WARN (SUITE-CollectionsRepairEventListenerTest-seed#[E5D43192C472A207]-worker) [n: c: s: r: x: t:] o.a.s.c.c.SolrZkClient Using default ZkCredentialsInjector. ZkCredentialsInjector is not secure, it creates an empty list of credentials which leads to 'OPEN_ACL_UNSAFE' ACLs to Zookeeper nodes
2> 1132889 INFO (SUITE-CollectionsRepairEventListenerTest-seed#[E5D43192C472A207]-worker) [n: c: s: r: x: t:] o.a.s.c.c.ConnectionManager Waiting up to 15000ms for client to connect to ZooKeeper
2> 1132890 INFO (zkConnectionManagerCallback-17683-thread-1) [n: c: s: r: x: t:] o.a.s.c.c.ConnectionManager zkClient has connected
2> 1132890 INFO (SUITE-CollectionsRepairEventListenerTest-seed#[E5D43192C472A207]-worker) [n: c: s: r: x: t:] o.a.s.c.c.ConnectionManager Client is connected to ZooKeeper
2> 1132890 WARN (SUITE-CollectionsRepairEventListenerTest-seed#[E5D43192C472A207]-worker) [n: c: s: r: x: t:] o.a.s.c.c.SolrZkClient Using default ZkACLProvider. DefaultZkACLProvider is not secure, it creates 'OPEN_ACL_UNSAFE' ACLs to Zookeeper nodes
2> 1132890 INFO (SUITE-CollectionsRepairEventListenerTest-seed#[E5D43192C472A207]-worker) [n: c: s: r: x: t:] o.a.s.c.c.ZkStateReader Updated live nodes from ZooKeeper... (0) -> (3)
2> 1132891 INFO (SUITE-CollectionsRepairEventListenerTest-seed#[E5D43192C472A207]-worker) [n: c: s: r: x: t:] o.a.s.c.s.i.ZkClientClusterStateProvider Cluster at 127.0.0.1:40195/solr ready
2> 1132891 DEBUG (SUITE-CollectionsRepairEventListenerTest-seed#[E5D43192C472A207]-worker) [n: c: s: r: x: t:] o.a.s.c.e.i.CollectionsRepairEventListener -- setting waitFor=3
2> 1132906 INFO (TEST-CollectionsRepairEventListenerTest.testCollectionRepair-seed#[E5D43192C472A207]) [n: c: s: r: x: t:] o.a.s.SolrTestCaseJ4 ###Starting testCollectionRepair
2> 1132906 INFO (TEST-CollectionsRepairEventListenerTest.testCollectionRepair-seed#[E5D43192C472A207]) [n: c: s: r: x: t:] o.a.s.c.c.ZkStateReader Updated live nodes from ZooKeeper... (0) -> (3)
2> 1132911 INFO (OverseerThreadFactory-17658-thread-1) [n: c:testCollectionRepair_collection s: r: x: t:] o.a.s.c.a.c.CreateCollectionCmd Create collection testCollectionRepair_collection
2> 1132913 DEBUG (zkCallback-17632-thread-1) [n: c: s: r: x: t:] o.a.s.c.e.i.DefaultClusterEventProducer creating collections added event for collections: [testCollectionRepair_collection]
2> 1132913 DEBUG (zkCallback-17632-thread-1) [n: c: s: r: x: t:] o.a.s.c.e.ClusterEventProducerBase --- firing event org.apache.solr.cluster.events.impl.DefaultClusterEventProducer$4@442d5b0a to org.apache.solr.cluster.events.AllEventsListener@30c53aaa
2> 1133018 INFO (OverseerStateUpdate-72227701537570822-127.0.0.1:39503_solr-n_0000000000) [n:127.0.0.1:39503_solr c: s: r: x: t:] o.a.s.c.o.SliceMutator createReplica() {
2> "core":"testCollectionRepair_collection_shard1_replica_n1",
2> "node_name":"127.0.0.1:33381_solr",
2> "base_url":"https://127.0.0.1:33381/solr",
2> "collection":"testCollectionRepair_collection",
2> "shard":"shard1",
2> "state":"down",
2> "type":"NRT",
2> "operation":"ADDREPLICA",
2> "waitForFinalState":"false"}
2> 1133020 INFO (OverseerStateUpdate-72227701537570822-127.0.0.1:39503_solr-n_0000000000) [n:127.0.0.1:39503_solr c: s: r: x: t:] o.a.s.c.o.SliceMutator createReplica() {
2> "core":"testCollectionRepair_collection_shard1_replica_n2",
2> "node_name":"127.0.0.1:38813_solr",
2> "base_url":"https://127.0.0.1:38813/solr",
2> "collection":"testCollectionRepair_collection",
2> "shard":"shard1",
2> "state":"down",
2> "type":"NRT",
2> "operation":"ADDREPLICA",
2> "waitForFinalState":"false"}
2> 1133022 INFO (OverseerStateUpdate-72227701537570822-127.0.0.1:39503_solr-n_0000000000) [n:127.0.0.1:39503_solr c: s: r: x: t:] o.a.s.c.o.SliceMutator createReplica() {
2> "core":"testCollectionRepair_collection_shard1_replica_n4",
2> "node_name":"127.0.0.1:39503_solr",
2> "base_url":"https://127.0.0.1:39503/solr",
2> "collection":"testCollectionRepair_collection",
2> "shard":"shard1",
2> "state":"down",
2> "type":"NRT",
2> "operation":"ADDREPLICA",
2> "waitForFinalState":"false"}
2> 1133124 INFO (zkCallback-17632-thread-1) [n: c: s: r: x: t:] o.a.s.c.c.ZkStateReader A cluster state change: [WatchedEvent state:SyncConnected type:NodeDataChanged path:/collections/testCollectionRepair_collection/state.json zxid: 154] for collection [testCollectionRepair_collection] has occurred - updating... (live nodes size: [3])
2> 1133172 INFO (qtp1625805783-24376) [n:127.0.0.1:38813_solr c: s: r: x:testCollectionRepair_collection_shard1_replica_n2 t:null-19328] o.a.s.h.a.CoreAdminOperation core create command qt=/admin/cores&collection.configName=conf&newCollection=true&collection=testCollectionRepair_collection&version=2&replicaType=NRT&coreNodeName=core_node5&name=testCollectionRepair_collection_shard1_replica_n2&action=CREATE&numShards=1&shard=shard1&wt=javabin
2> 1133177 INFO (qtp1280534718-24382) [n:127.0.0.1:33381_solr c: s: r: x:testCollectionRepair_collection_shard1_replica_n1 t:null-19329] o.a.s.h.a.CoreAdminOperation core create command qt=/admin/cores&collection.configName=conf&newCollection=true&collection=testCollectionRepair_collection&version=2&replicaType=NRT&coreNodeName=core_node3&name=testCollectionRepair_collection_shard1_replica_n1&action=CREATE&numShards=1&shard=shard1&wt=javabin
2> 1133180 INFO (qtp1625805783-24376) [n:127.0.0.1:38813_solr c:testCollectionRepair_collection s:shard1 r:core_node5 x:testCollectionRepair_collection_shard1_replica_n2 t:null-19328] o.a.s.c.SolrConfig Using Lucene MatchVersion: 9.8.0
2> 1133181 INFO (qtp1625805783-24376) [n:127.0.0.1:38813_solr c:testCollectionRepair_collection s:shard1 r:core_node5 x:testCollectionRepair_collection_shard1_replica_n2 t:null-19328] o.a.s.s.IndexSchema Schema name=minimal
2> 1133182 INFO (qtp1625805783-24376) [n:127.0.0.1:38813_solr c:testCollectionRepair_collection s:shard1 r:core_node5 x:testCollectionRepair_collection_shard1_replica_n2 t:null-19328] o.a.s.s.IndexSchema Loaded schema minimal/1.1 with uniqueid field id
2> 1133182 INFO (qtp1625805783-24376) [n:127.0.0.1:38813_solr c:testCollectionRepair_collection s:shard1 r:core_node5 x:testCollectionRepair_collection_shard1_replica_n2 t:null-19328] o.a.s.c.CoreContainer Creating SolrCore 'testCollectionRepair_collection_shard1_replica_n2' using configuration from configset conf, trusted=true
2> 1133182 INFO (qtp1625805783-24376) [n:127.0.0.1:38813_solr c:testCollectionRepair_collection s:shard1 r:core_node5 x:testCollectionRepair_collection_shard1_replica_n2 t:null-19328] o.a.s.c.SolrCore Opening new SolrCore at [/home/jenkins/jenkins-slave/workspace/Solr/Solr-Smoketest-9.4/_tmp/smoke_170845
[...truncated too long message...]
mezone=Pacific/Majuro -Dtests.asserts=true -Dtests.file.encoding=UTF-8
> Task :solr:solrj:processTestResources
> Task :solr:solrj:testClasses
> Task :solr:solrj:test
> Task :solr:core:test
WARNING: Test org.apache.solr.schema.DocValuesTest wrote 12,016,002 bytes of output.
> Task :solr:solrj:test
:solr:solrj:test (SUCCESS): 1143 test(s), 40 skipped
> Task :solr:solrj:wipeTaskTemp
> Task :solr:solrj-streaming:compileTestJava
> Task :solr:solrj-streaming:testClasses
> Task :solr:modules:sql:compileJava
Note: Some input files use or override a deprecated API.
Note: Recompile with -Xlint:deprecation for details.
> Task :solr:modules:sql:classes
> Task :solr:modules:sql:jar
> Task :solr:core:test
WARNING: Test org.apache.solr.schema.TestCloudSchemaless wrote 13,205,789 bytes of output.
> Task :solr:solrj-streaming:test
:solr:solrj-streaming:test (SUCCESS): 608 test(s), 2 skipped
> Task :solr:solrj-streaming:wipeTaskTemp
> Task :solr:solrj-zookeeper:compileTestJava
Note: Some input files use or override a deprecated API.
Note: Recompile with -Xlint:deprecation for details.
> Task :solr:solrj-zookeeper:testClasses
> Task :solr:solrj-zookeeper:test
:solr:solrj-zookeeper:test (SUCCESS): 16 test(s)
> Task :solr:solrj-zookeeper:wipeTaskTemp
> Task :solr:test-framework:compileTestJava
Note: Some input files use or override a deprecated API.
Note: Recompile with -Xlint:deprecation for details.
> Task :solr:test-framework:testClasses
> Task :solr:test-framework:test
:solr:test-framework:test (SUCCESS): 18 test(s)
> Task :solr:test-framework:wipeTaskTemp
> Task :solr:webapp:compileJava NO-SOURCE
> Task :solr:webapp:classes UP-TO-DATE
> Task :solr:webapp:compileTestJava NO-SOURCE
> Task :solr:webapp:testClasses UP-TO-DATE
> Task :solr:webapp:test NO-SOURCE
> Task :solr:webapp:wipeTaskTemp
> Task :solr:modules:analysis-extras:compileTestJava
Note: /home/jenkins/jenkins-slave/workspace/Solr/Solr-Smoketest-9.4/_tmp/smoke_1708451314/unpack/solr-9.4.2/solr/modules/analysis-extras/src/test/org/apache/solr/schema/TestICUCollationFieldUDVAS.java uses or overrides a deprecated API.
Note: Recompile with -Xlint:deprecation for details.
> Task :solr:modules:analysis-extras:testClasses
> Task :solr:core:test
WARNING: Test org.apache.solr.search.facet.TestCloudJSONFacetSKG wrote 16,492,656 bytes of output.
> Task :solr:modules:analysis-extras:test
:solr:modules:analysis-extras:test (SUCCESS): 31 test(s)
> Task :solr:modules:analysis-extras:wipeTaskTemp
> Task :solr:modules:analytics:compileJava
Note: Some input files use or override a deprecated API.
Note: Recompile with -Xlint:deprecation for details.
> Task :solr:modules:analytics:classes
> Task :solr:modules:analytics:compileTestJava
Note: Some input files use or override a deprecated API.
Note: Recompile with -Xlint:deprecation for details.
> Task :solr:modules:analytics:testClasses
> Task :solr:modules:analytics:test
:solr:modules:analytics:test (SUCCESS): 472 test(s)
> Task :solr:modules:analytics:wipeTaskTemp
> Task :solr:modules:clustering:compileJava
> Task :solr:modules:clustering:classes
> Task :solr:modules:clustering:compileTestJava
> Task :solr:modules:clustering:testClasses
> Task :solr:modules:clustering:test
:solr:modules:clustering:test (SUCCESS): 15 test(s)
> Task :solr:modules:clustering:wipeTaskTemp
> Task :solr:modules:extraction:compileJava
Note: /home/jenkins/jenkins-slave/workspace/Solr/Solr-Smoketest-9.4/_tmp/smoke_1708451314/unpack/solr-9.4.2/solr/modules/extraction/src/java/org/apache/solr/handler/extraction/ExtractingDocumentLoader.java uses or overrides a deprecated API.
Note: Recompile with -Xlint:deprecation for details.
> Task :solr:modules:extraction:classes
> Task :solr:modules:extraction:compileTestJava
Note: /home/jenkins/jenkins-slave/workspace/Solr/Solr-Smoketest-9.4/_tmp/smoke_1708451314/unpack/solr-9.4.2/solr/modules/extraction/src/test/org/apache/solr/handler/extraction/ExtractingRequestHandlerTest.java uses or overrides a deprecated API.
Note: Recompile with -Xlint:deprecation for details.
> Task :solr:modules:extraction:testClasses
> Task :solr:modules:extraction:test
:solr:modules:extraction:test (SUCCESS): 20 test(s)
> Task :solr:modules:extraction:wipeTaskTemp
> Task :solr:modules:gcs-repository:compileJava
Note: /home/jenkins/jenkins-slave/workspace/Solr/Solr-Smoketest-9.4/_tmp/smoke_1708451314/unpack/solr-9.4.2/solr/modules/gcs-repository/src/java/org/apache/solr/gcs/GCSConfigParser.java uses or overrides a deprecated API.
Note: Recompile with -Xlint:deprecation for details.
> Task :solr:modules:gcs-repository:classes
> Task :solr:modules:gcs-repository:compileTestJava
Note: /home/jenkins/jenkins-slave/workspace/Solr/Solr-Smoketest-9.4/_tmp/smoke_1708451314/unpack/solr-9.4.2/solr/modules/gcs-repository/src/test/org/apache/solr/gcs/ConcurrentDelegatingStorage.java uses or overrides a deprecated API.
Note: Recompile with -Xlint:deprecation for details.
> Task :solr:modules:gcs-repository:testClasses
> Task :solr:modules:gcs-repository:test
:solr:modules:gcs-repository:test (SUCCESS): 20 test(s), 1 skipped
> Task :solr:modules:gcs-repository:wipeTaskTemp
> Task :solr:modules:hadoop-auth:compileJava
Note: Some input files use or override a deprecated API.
Note: Recompile with -Xlint:deprecation for details.
> Task :solr:modules:hadoop-auth:classes
> Task :solr:modules:hadoop-auth:compileTestJava
Note: Some input files use or override a deprecated API.
Note: Recompile with -Xlint:deprecation for details.
> Task :solr:modules:hadoop-auth:testClasses
> Task :solr:modules:hadoop-auth:test
:solr:modules:hadoop-auth:test (SUCCESS): 55 test(s), 2 skipped
> Task :solr:modules:hadoop-auth:wipeTaskTemp
> Task :solr:modules:hdfs:compileJava
Note: Some input files use or override a deprecated API.
Note: Recompile with -Xlint:deprecation for details.
> Task :solr:modules:hdfs:classes
> Task :solr:modules:hdfs:compileTestJava
Note: Some input files use or override a deprecated API.
Note: Recompile with -Xlint:deprecation for details.
> Task :solr:modules:hdfs:testClasses
> Task :solr:modules:hdfs:test
> Task :solr:core:test
:solr:core:test (FAILURE): 4904 test(s), 2 failure(s), 2001 skipped
4904 tests completed, 2 failed, 2001 skipped
> Task :solr:core:test FAILED
> Task :solr:core:wipeTaskTemp
> Task :solr:modules:hdfs:test
:solr:modules:hdfs:test (SUCCESS): 103 test(s), 47 skipped
> Task :solr:modules:hdfs:wipeTaskTemp
ERROR: The following test(s) have failed:
- org.apache.solr.cluster.events.impl.CollectionsRepairEventListenerTest.classMethod (:solr:core)
Test output: /home/jenkins/jenkins-slave/workspace/Solr/Solr-Smoketest-9.4/_tmp/smoke_1708451314/unpack/solr-9.4.2/solr/core/build/test-results/test/outputs/OUTPUT-org.apache.solr.cluster.events.impl.CollectionsRepairEventListenerTest.txt
Reproduce with: gradlew :solr:core:test --tests "org.apache.solr.cluster.events.impl.CollectionsRepairEventListenerTest.classMethod" -Ptests.jvms=2 "-Ptests.jvmargs=-XX:TieredStopAtLevel=1 -XX:+UseParallelGC -XX:ActiveProcessorCount=1 -XX:ReservedCodeCacheSize=120m" -Ptests.seed=E5D43192C472A207 -Ptests.badapples=false -Ptests.file.encoding=ISO-8859-1
- org.apache.solr.cluster.events.impl.CollectionsRepairEventListenerTest.classMethod (:solr:core)
Test output: /home/jenkins/jenkins-slave/workspace/Solr/Solr-Smoketest-9.4/_tmp/smoke_1708451314/unpack/solr-9.4.2/solr/core/build/test-results/test/outputs/OUTPUT-org.apache.solr.cluster.events.impl.CollectionsRepairEventListenerTest.txt
Reproduce with: gradlew :solr:core:test --tests "org.apache.solr.cluster.events.impl.CollectionsRepairEventListenerTest.classMethod" -Ptests.jvms=2 "-Ptests.jvmargs=-XX:TieredStopAtLevel=1 -XX:+UseParallelGC -XX:ActiveProcessorCount=1 -XX:ReservedCodeCacheSize=120m" -Ptests.seed=E5D43192C472A207 -Ptests.badapples=false -Ptests.file.encoding=ISO-8859-1
FAILURE: Build failed with an exception.
* What went wrong:
Execution failed for task ':solr:core:test'.
> There were failing tests. See the results at: file:///home/jenkins/jenkins-slave/workspace/Solr/Solr-Smoketest-9.4/_tmp/smoke_1708451314/unpack/solr-9.4.2/solr/core/build/test-results/test/
* Try:
> Run with --stacktrace option to get the stack trace.
> Run with --info or --debug option to get more log output.
* Get more help at https://help.gradle.org
BUILD FAILED in 39m 24s
120 actionable tasks: 102 executed, 18 up-to-date
Publishing build scan...
https://ge.apache.org/s/dso43pdpglw6g
Traceback (most recent call last):
File "dev-tools/scripts/smokeTestRelease.py", line 1174, in <module>
main()
File "dev-tools/scripts/smokeTestRelease.py", line 1101, in main
downloadOnly=c.download_only)
File "dev-tools/scripts/smokeTestRelease.py", line 1162, in smokeTest
unpackAndVerify(java, tmpDir, 'solr-%s-src.tgz' % version, gitRevision, version, testArgs)
File "dev-tools/scripts/smokeTestRelease.py", line 553, in unpackAndVerify
verifyUnpacked(java, artifact, unpackPath, gitRevision, version, testArgs)
File "dev-tools/scripts/smokeTestRelease.py", line 644, in verifyUnpacked
java.run_java11('./gradlew --no-daemon test %s' % testArgs, '%s/test.log' % unpackPath)
File "dev-tools/scripts/smokeTestRelease.py", line 1010, in run_java
run('%s; %s' % (cmd_prefix, cmd), logfile)
File "dev-tools/scripts/smokeTestRelease.py", line 483, in run
raise RuntimeError('command "%s" failed; see log file %s' % (command, logPath))
RuntimeError: command "export JAVA_HOME="/home/jenkins/tools/java/latest11" PATH="/home/jenkins/tools/java/latest11/bin:$PATH" JAVACMD="/home/jenkins/tools/java/latest11/bin/java"; ./gradlew --no-daemon test -Dtests.nightly=false -Dtests.badapples=false " failed; see log file /home/jenkins/jenkins-slave/workspace/Solr/Solr-Smoketest-9.4/_tmp/smoke_1708451314/unpack/solr-9.4.2/test.log
Build step 'Run with timeout' marked build as failure
Email was triggered for: Failure - Any
Sending email for trigger: Failure - Any