You are viewing a plain text version of this content. The canonical link for it is here.
Posted to notifications@directory.apache.org by Apache Jenkins Server <je...@builds.apache.org> on 2018/08/27 17:35:35 UTC

Build failed in Jenkins: dir-fortress-core-docker-openldap-test #535

See <https://builds.apache.org/job/dir-fortress-core-docker-openldap-test/535/display/redirect?page=changes>

Changes:

[smckinney] + slapd audit logger params

------------------------------------------
[...truncated 227.36 KB...]
	at junit.framework.TestResult$1.protect(TestResult.java:122)
	at junit.framework.TestResult.runProtected(TestResult.java:142)
	at junit.framework.TestResult.run(TestResult.java:125)
	at junit.framework.TestCase.run(TestCase.java:129)
	at junit.framework.TestSuite.runTest(TestSuite.java:252)
	at junit.framework.TestSuite.run(TestSuite.java:247)
	at org.junit.internal.runners.JUnit38ClassRunner.run(JUnit38ClassRunner.java:86)
	at org.apache.maven.surefire.junit4.JUnit4Provider.execute(JUnit4Provider.java:283)
	at org.apache.maven.surefire.junit4.JUnit4Provider.executeWithRerun(JUnit4Provider.java:173)
	at org.apache.maven.surefire.junit4.JUnit4Provider.executeTestSet(JUnit4Provider.java:153)
	at org.apache.maven.surefire.junit4.JUnit4Provider.invoke(JUnit4Provider.java:128)
	at org.apache.maven.surefire.booter.ForkedBooter.invokeProviderInSameClassLoader(ForkedBooter.java:203)
	at org.apache.maven.surefire.booter.ForkedBooter.runSuitesInProcess(ForkedBooter.java:155)
	at org.apache.maven.surefire.booter.ForkedBooter.main(ForkedBooter.java:103)
Caused by: org.apache.directory.api.ldap.model.exception.LdapException: org.apache.directory.api.ldap.model.exception.LdapInvalidDnException: ERR_04202 A value is missing on some RDN
	at org.apache.directory.fortress.core.ldap.LdapConnectionProvider.getLogConnection(LdapConnectionProvider.java:343)
	at org.apache.directory.fortress.core.ldap.LdapDataProvider.getLogConnection(LdapDataProvider.java:1261)
	at org.apache.directory.fortress.core.impl.AuditDAO.getAllAuthZs(AuditDAO.java:436)
	... 24 more
Caused by: org.apache.directory.api.ldap.model.exception.LdapInvalidDnException: ERR_04202 A value is missing on some RDN
	at org.apache.directory.api.ldap.model.name.Dn.<init>(Dn.java:285)
	at org.apache.directory.ldap.client.api.AbstractLdapConnection.bind(AbstractLdapConnection.java:114)
	at org.apache.directory.ldap.client.api.DefaultLdapConnectionFactory.bindConnection(DefaultLdapConnectionFactory.java:64)
	at org.apache.directory.ldap.client.api.DefaultLdapConnectionFactory.newLdapConnection(DefaultLdapConnectionFactory.java:107)
	at org.apache.directory.ldap.client.api.ValidatingPoolableLdapConnectionFactory.makeObject(ValidatingPoolableLdapConnectionFactory.java:134)
	at org.apache.directory.ldap.client.api.ValidatingPoolableLdapConnectionFactory.makeObject(ValidatingPoolableLdapConnectionFactory.java:59)
	at org.apache.commons.pool.impl.GenericObjectPool.borrowObject(GenericObjectPool.java:1188)
	at org.apache.directory.ldap.client.api.LdapConnectionPool.getConnection(LdapConnectionPool.java:123)
	at org.apache.directory.fortress.core.ldap.LdapConnectionProvider.getLogConnection(LdapConnectionProvider.java:339)
	... 26 more
2018-08-27 17:35:030 INFO  LogUtil:64 - GET-AUTHZ TU1_UPD
2018-08-27 17:35:030 ERROR DefaultLdapConnectionFactory:68 - unable to bind connection: ERR_04202 A value is missing on some RDN
2018-08-27 17:35:030 ERROR AuditMgrImplTest:298 - searchAuthZs: failed with SecurityException rc=7002, msg=LdapException in AuditDAO.searchAuthZs id=org.apache.directory.api.ldap.model.exception.LdapException: org.apache.directory.api.ldap.model.exception.LdapInvalidDnException: ERR_04202 A value is missing on some RDN
org.apache.directory.fortress.core.FinderException: LdapException in AuditDAO.searchAuthZs id=org.apache.directory.api.ldap.model.exception.LdapException: org.apache.directory.api.ldap.model.exception.LdapInvalidDnException: ERR_04202 A value is missing on some RDN
	at org.apache.directory.fortress.core.impl.AuditDAO.searchAuthZs(AuditDAO.java:359)
	at org.apache.directory.fortress.core.impl.AuditP.searchAuthZs(AuditP.java:82)
	at org.apache.directory.fortress.core.impl.AuditMgrImpl.searchAuthZs(AuditMgrImpl.java:141)
	at org.apache.directory.fortress.core.impl.AuditMgrImplTest.searchAuthZs(AuditMgrImplTest.java:286)
	at org.apache.directory.fortress.core.impl.AuditMgrImplTest.testSearchAuthZs(AuditMgrImplTest.java:248)
	at sun.reflect.NativeMethodAccessorImpl.invoke0(Native Method)
	at sun.reflect.NativeMethodAccessorImpl.invoke(NativeMethodAccessorImpl.java:62)
	at sun.reflect.DelegatingMethodAccessorImpl.invoke(DelegatingMethodAccessorImpl.java:43)
	at java.lang.reflect.Method.invoke(Method.java:498)
	at junit.framework.TestCase.runTest(TestCase.java:176)
	at junit.framework.TestCase.runBare(TestCase.java:141)
	at junit.framework.TestResult$1.protect(TestResult.java:122)
	at junit.framework.TestResult.runProtected(TestResult.java:142)
	at junit.framework.TestResult.run(TestResult.java:125)
	at junit.framework.TestCase.run(TestCase.java:129)
	at junit.framework.TestSuite.runTest(TestSuite.java:252)
	at junit.framework.TestSuite.run(TestSuite.java:247)
	at org.junit.internal.runners.JUnit38ClassRunner.run(JUnit38ClassRunner.java:86)
	at org.apache.maven.surefire.junit4.JUnit4Provider.execute(JUnit4Provider.java:283)
	at org.apache.maven.surefire.junit4.JUnit4Provider.executeWithRerun(JUnit4Provider.java:173)
	at org.apache.maven.surefire.junit4.JUnit4Provider.executeTestSet(JUnit4Provider.java:153)
	at org.apache.maven.surefire.junit4.JUnit4Provider.invoke(JUnit4Provider.java:128)
	at org.apache.maven.surefire.booter.ForkedBooter.invokeProviderInSameClassLoader(ForkedBooter.java:203)
	at org.apache.maven.surefire.booter.ForkedBooter.runSuitesInProcess(ForkedBooter.java:155)
	at org.apache.maven.surefire.booter.ForkedBooter.main(ForkedBooter.java:103)
Caused by: org.apache.directory.api.ldap.model.exception.LdapException: org.apache.directory.api.ldap.model.exception.LdapInvalidDnException: ERR_04202 A value is missing on some RDN
	at org.apache.directory.fortress.core.ldap.LdapConnectionProvider.getLogConnection(LdapConnectionProvider.java:343)
	at org.apache.directory.fortress.core.ldap.LdapDataProvider.getLogConnection(LdapDataProvider.java:1261)
	at org.apache.directory.fortress.core.impl.AuditDAO.searchAuthZs(AuditDAO.java:346)
	... 24 more
Caused by: org.apache.directory.api.ldap.model.exception.LdapInvalidDnException: ERR_04202 A value is missing on some RDN
	at org.apache.directory.api.ldap.model.name.Dn.<init>(Dn.java:285)
	at org.apache.directory.ldap.client.api.AbstractLdapConnection.bind(AbstractLdapConnection.java:114)
	at org.apache.directory.ldap.client.api.DefaultLdapConnectionFactory.bindConnection(DefaultLdapConnectionFactory.java:64)
	at org.apache.directory.ldap.client.api.DefaultLdapConnectionFactory.newLdapConnection(DefaultLdapConnectionFactory.java:107)
	at org.apache.directory.ldap.client.api.ValidatingPoolableLdapConnectionFactory.makeObject(ValidatingPoolableLdapConnectionFactory.java:134)
	at org.apache.directory.ldap.client.api.ValidatingPoolableLdapConnectionFactory.makeObject(ValidatingPoolableLdapConnectionFactory.java:59)
	at org.apache.commons.pool.impl.GenericObjectPool.borrowObject(GenericObjectPool.java:1188)
	at org.apache.directory.ldap.client.api.LdapConnectionPool.getConnection(LdapConnectionPool.java:123)
	at org.apache.directory.fortress.core.ldap.LdapConnectionProvider.getLogConnection(LdapConnectionProvider.java:339)
	... 26 more
2018-08-27 17:35:030 INFO  LogUtil:64 - SESS-USRS TU1_UPD
2018-08-27 17:35:030 ERROR DefaultLdapConnectionFactory:68 - unable to bind connection: ERR_04202 A value is missing on some RDN
2018-08-27 17:35:030 ERROR AuditMgrImplTest:239 - searchUserSessions: failed with SecurityException rc=7003, msg=searchUserMods caught LdapException id=org.apache.directory.api.ldap.model.exception.LdapException: org.apache.directory.api.ldap.model.exception.LdapInvalidDnException: ERR_04202 A value is missing on some RDN
org.apache.directory.fortress.core.FinderException: searchUserMods caught LdapException id=org.apache.directory.api.ldap.model.exception.LdapException: org.apache.directory.api.ldap.model.exception.LdapInvalidDnException: ERR_04202 A value is missing on some RDN
	at org.apache.directory.fortress.core.impl.AuditDAO.searchUserMods(AuditDAO.java:588)
	at org.apache.directory.fortress.core.impl.AuditP.searchUserMods(AuditP.java:110)
	at org.apache.directory.fortress.core.impl.AuditMgrImpl.searchUserSessions(AuditMgrImpl.java:170)
	at org.apache.directory.fortress.core.impl.AuditMgrImplTest.searchMods(AuditMgrImplTest.java:229)
	at org.apache.directory.fortress.core.impl.AuditMgrImplTest.testSearchMods(AuditMgrImplTest.java:205)
	at sun.reflect.NativeMethodAccessorImpl.invoke0(Native Method)
	at sun.reflect.NativeMethodAccessorImpl.invoke(NativeMethodAccessorImpl.java:62)
	at sun.reflect.DelegatingMethodAccessorImpl.invoke(DelegatingMethodAccessorImpl.java:43)
	at java.lang.reflect.Method.invoke(Method.java:498)
	at junit.framework.TestCase.runTest(TestCase.java:176)
	at junit.framework.TestCase.runBare(TestCase.java:141)
	at junit.framework.TestResult$1.protect(TestResult.java:122)
	at junit.framework.TestResult.runProtected(TestResult.java:142)
	at junit.framework.TestResult.run(TestResult.java:125)
	at junit.framework.TestCase.run(TestCase.java:129)
	at junit.framework.TestSuite.runTest(TestSuite.java:252)
	at junit.framework.TestSuite.run(TestSuite.java:247)
	at org.junit.internal.runners.JUnit38ClassRunner.run(JUnit38ClassRunner.java:86)
	at org.apache.maven.surefire.junit4.JUnit4Provider.execute(JUnit4Provider.java:283)
	at org.apache.maven.surefire.junit4.JUnit4Provider.executeWithRerun(JUnit4Provider.java:173)
	at org.apache.maven.surefire.junit4.JUnit4Provider.executeTestSet(JUnit4Provider.java:153)
	at org.apache.maven.surefire.junit4.JUnit4Provider.invoke(JUnit4Provider.java:128)
	at org.apache.maven.surefire.booter.ForkedBooter.invokeProviderInSameClassLoader(ForkedBooter.java:203)
	at org.apache.maven.surefire.booter.ForkedBooter.runSuitesInProcess(ForkedBooter.java:155)
	at org.apache.maven.surefire.booter.ForkedBooter.main(ForkedBooter.java:103)
Caused by: org.apache.directory.api.ldap.model.exception.LdapException: org.apache.directory.api.ldap.model.exception.LdapInvalidDnException: ERR_04202 A value is missing on some RDN
	at org.apache.directory.fortress.core.ldap.LdapConnectionProvider.getLogConnection(LdapConnectionProvider.java:343)
	at org.apache.directory.fortress.core.ldap.LdapDataProvider.getLogConnection(LdapDataProvider.java:1261)
	at org.apache.directory.fortress.core.impl.AuditDAO.searchUserMods(AuditDAO.java:575)
	... 24 more
Caused by: org.apache.directory.api.ldap.model.exception.LdapInvalidDnException: ERR_04202 A value is missing on some RDN
	at org.apache.directory.api.ldap.model.name.Dn.<init>(Dn.java:285)
	at org.apache.directory.ldap.client.api.AbstractLdapConnection.bind(AbstractLdapConnection.java:114)
	at org.apache.directory.ldap.client.api.DefaultLdapConnectionFactory.bindConnection(DefaultLdapConnectionFactory.java:64)
	at org.apache.directory.ldap.client.api.DefaultLdapConnectionFactory.newLdapConnection(DefaultLdapConnectionFactory.java:107)
	at org.apache.directory.ldap.client.api.ValidatingPoolableLdapConnectionFactory.makeObject(ValidatingPoolableLdapConnectionFactory.java:134)
	at org.apache.directory.ldap.client.api.ValidatingPoolableLdapConnectionFactory.makeObject(ValidatingPoolableLdapConnectionFactory.java:59)
	at org.apache.commons.pool.impl.GenericObjectPool.borrowObject(GenericObjectPool.java:1188)
	at org.apache.directory.ldap.client.api.LdapConnectionPool.getConnection(LdapConnectionPool.java:123)
	at org.apache.directory.fortress.core.ldap.LdapConnectionProvider.getLogConnection(LdapConnectionProvider.java:339)
	... 26 more
2018-08-27 17:35:030 INFO  LogUtil:64 - SESS-USRS RBAC TU0
2018-08-27 17:35:030 ERROR DefaultLdapConnectionFactory:68 - unable to bind connection: ERR_04202 A value is missing on some RDN
2018-08-27 17:35:030 ERROR AuditMgrImplTest:192 - searchAdminMods: failed with SecurityException rc=7004, msg=searchAdminMods caught LdapException id=org.apache.directory.api.ldap.model.exception.LdapException: org.apache.directory.api.ldap.model.exception.LdapInvalidDnException: ERR_04202 A value is missing on some RDN
org.apache.directory.fortress.core.FinderException: searchAdminMods caught LdapException id=org.apache.directory.api.ldap.model.exception.LdapException: org.apache.directory.api.ldap.model.exception.LdapInvalidDnException: ERR_04202 A value is missing on some RDN
	at org.apache.directory.fortress.core.impl.AuditDAO.searchAdminMods(AuditDAO.java:678)
	at org.apache.directory.fortress.core.impl.AuditP.searchAdminMods(AuditP.java:125)
	at org.apache.directory.fortress.core.impl.AuditMgrImpl.searchAdminMods(AuditMgrImpl.java:190)
	at org.apache.directory.fortress.core.impl.AuditMgrImplTest.searchAdminMods(AuditMgrImplTest.java:173)
	at org.apache.directory.fortress.core.impl.AuditMgrImplTest.testSearchAdminMods(AuditMgrImplTest.java:94)
	at sun.reflect.NativeMethodAccessorImpl.invoke0(Native Method)
	at sun.reflect.NativeMethodAccessorImpl.invoke(NativeMethodAccessorImpl.java:62)
	at sun.reflect.DelegatingMethodAccessorImpl.invoke(DelegatingMethodAccessorImpl.java:43)
	at java.lang.reflect.Method.invoke(Method.java:498)
	at junit.framework.TestCase.runTest(TestCase.java:176)
	at junit.framework.TestCase.runBare(TestCase.java:141)
	at junit.framework.TestResult$1.protect(TestResult.java:122)
	at junit.framework.TestResult.runProtected(TestResult.java:142)
	at junit.framework.TestResult.run(TestResult.java:125)
	at junit.framework.TestCase.run(TestCase.java:129)
	at junit.framework.TestSuite.runTest(TestSuite.java:252)
	at junit.framework.TestSuite.run(TestSuite.java:247)
	at org.junit.internal.runners.JUnit38ClassRunner.run(JUnit38ClassRunner.java:86)
	at org.apache.maven.surefire.junit4.JUnit4Provider.execute(JUnit4Provider.java:283)
	at org.apache.maven.surefire.junit4.JUnit4Provider.executeWithRerun(JUnit4Provider.java:173)
	at org.apache.maven.surefire.junit4.JUnit4Provider.executeTestSet(JUnit4Provider.java:153)
	at org.apache.maven.surefire.junit4.JUnit4Provider.invoke(JUnit4Provider.java:128)
	at org.apache.maven.surefire.booter.ForkedBooter.invokeProviderInSameClassLoader(ForkedBooter.java:203)
	at org.apache.maven.surefire.booter.ForkedBooter.runSuitesInProcess(ForkedBooter.java:155)
	at org.apache.maven.surefire.booter.ForkedBooter.main(ForkedBooter.java:103)
Caused by: org.apache.directory.api.ldap.model.exception.LdapException: org.apache.directory.api.ldap.model.exception.LdapInvalidDnException: ERR_04202 A value is missing on some RDN
	at org.apache.directory.fortress.core.ldap.LdapConnectionProvider.getLogConnection(LdapConnectionProvider.java:343)
	at org.apache.directory.fortress.core.ldap.LdapDataProvider.getLogConnection(LdapDataProvider.java:1261)
	at org.apache.directory.fortress.core.impl.AuditDAO.searchAdminMods(AuditDAO.java:665)
	... 24 more
Caused by: org.apache.directory.api.ldap.model.exception.LdapInvalidDnException: ERR_04202 A value is missing on some RDN
	at org.apache.directory.api.ldap.model.name.Dn.<init>(Dn.java:285)
	at org.apache.directory.ldap.client.api.AbstractLdapConnection.bind(AbstractLdapConnection.java:114)
	at org.apache.directory.ldap.client.api.DefaultLdapConnectionFactory.bindConnection(DefaultLdapConnectionFactory.java:64)
	at org.apache.directory.ldap.client.api.DefaultLdapConnectionFactory.newLdapConnection(DefaultLdapConnectionFactory.java:107)
	at org.apache.directory.ldap.client.api.ValidatingPoolableLdapConnectionFactory.makeObject(ValidatingPoolableLdapConnectionFactory.java:134)
	at org.apache.directory.ldap.client.api.ValidatingPoolableLdapConnectionFactory.makeObject(ValidatingPoolableLdapConnectionFactory.java:59)
	at org.apache.commons.pool.impl.GenericObjectPool.borrowObject(GenericObjectPool.java:1188)
	at org.apache.directory.ldap.client.api.LdapConnectionPool.getConnection(LdapConnectionPool.java:123)
	at org.apache.directory.fortress.core.ldap.LdapConnectionProvider.getLogConnection(LdapConnectionProvider.java:339)
	... 26 more
NUMBER OF ADDS: 1006
NUMBER OF BINDS: 1131
NUMBER OF DELETES: 0
NUMBER OF MODS: 4112
NUMBER OF READS: 19587
NUMBER OF SEARCHES: 7014
Tests run: 132, Failures: 6, Errors: 0, Skipped: 0, Time elapsed: 214.493 sec <<< FAILURE! - in org.apache.directory.fortress.core.impl.FortressJUnitTest
testAbacConstraintsRole(org.apache.directory.fortress.core.impl.AccessMgrImplTest)  Time elapsed: 0.031 sec  <<< FAILURE!
junit.framework.AssertionFailedError: org.apache.directory.fortress.core.impl.AccessMgrImplTest.createSessionsConstraints washers cannot contain tellers, user: curly, constraint value: north
	at junit.framework.Assert.fail(Assert.java:57)
	at junit.framework.TestCase.fail(TestCase.java:227)
	at org.apache.directory.fortress.core.impl.AccessMgrImplTest.createSessionsConstraints(AccessMgrImplTest.java:1384)
	at org.apache.directory.fortress.core.impl.AccessMgrImplTest.testAbacConstraintsRole(AccessMgrImplTest.java:1297)

testSearchBinds(org.apache.directory.fortress.core.impl.AuditMgrImplTest)  Time elapsed: 0.066 sec  <<< FAILURE!
junit.framework.AssertionFailedError: LdapException in AuditDAO.searchBinds id=org.apache.directory.api.ldap.model.exception.LdapException: org.apache.directory.api.ldap.model.exception.LdapInvalidDnException: ERR_04202 A value is missing on some RDN
	at junit.framework.Assert.fail(Assert.java:57)
	at junit.framework.TestCase.fail(TestCase.java:227)
	at org.apache.directory.fortress.core.impl.AuditMgrImplTest.searchBinds(AuditMgrImplTest.java:444)
	at org.apache.directory.fortress.core.impl.AuditMgrImplTest.testSearchBinds(AuditMgrImplTest.java:399)

testGetAuthZs(org.apache.directory.fortress.core.impl.AuditMgrImplTest)  Time elapsed: 0.006 sec  <<< FAILURE!
junit.framework.AssertionFailedError: LdapException in AuditDAO.getAllAuthZs id=org.apache.directory.api.ldap.model.exception.LdapException: org.apache.directory.api.ldap.model.exception.LdapInvalidDnException: ERR_04202 A value is missing on some RDN
	at junit.framework.Assert.fail(Assert.java:57)
	at junit.framework.TestCase.fail(TestCase.java:227)
	at org.apache.directory.fortress.core.impl.AuditMgrImplTest.getAuthZs(AuditMgrImplTest.java:355)
	at org.apache.directory.fortress.core.impl.AuditMgrImplTest.testGetAuthZs(AuditMgrImplTest.java:311)

testSearchAuthZs(org.apache.directory.fortress.core.impl.AuditMgrImplTest)  Time elapsed: 0.004 sec  <<< FAILURE!
junit.framework.AssertionFailedError: LdapException in AuditDAO.searchAuthZs id=org.apache.directory.api.ldap.model.exception.LdapException: org.apache.directory.api.ldap.model.exception.LdapInvalidDnException: ERR_04202 A value is missing on some RDN
	at junit.framework.Assert.fail(Assert.java:57)
	at junit.framework.TestCase.fail(TestCase.java:227)
	at org.apache.directory.fortress.core.impl.AuditMgrImplTest.searchAuthZs(AuditMgrImplTest.java:301)
	at org.apache.directory.fortress.core.impl.AuditMgrImplTest.testSearchAuthZs(AuditMgrImplTest.java:248)

testSearchMods(org.apache.directory.fortress.core.impl.AuditMgrImplTest)  Time elapsed: 0.004 sec  <<< FAILURE!
junit.framework.AssertionFailedError: searchUserMods caught LdapException id=org.apache.directory.api.ldap.model.exception.LdapException: org.apache.directory.api.ldap.model.exception.LdapInvalidDnException: ERR_04202 A value is missing on some RDN
	at junit.framework.Assert.fail(Assert.java:57)
	at junit.framework.TestCase.fail(TestCase.java:227)
	at org.apache.directory.fortress.core.impl.AuditMgrImplTest.searchMods(AuditMgrImplTest.java:241)
	at org.apache.directory.fortress.core.impl.AuditMgrImplTest.testSearchMods(AuditMgrImplTest.java:205)

testSearchAdminMods(org.apache.directory.fortress.core.impl.AuditMgrImplTest)  Time elapsed: 0.006 sec  <<< FAILURE!
junit.framework.AssertionFailedError: searchAdminMods caught LdapException id=org.apache.directory.api.ldap.model.exception.LdapException: org.apache.directory.api.ldap.model.exception.LdapInvalidDnException: ERR_04202 A value is missing on some RDN
	at junit.framework.Assert.fail(Assert.java:57)
	at junit.framework.TestCase.fail(TestCase.java:227)
	at org.apache.directory.fortress.core.impl.AuditMgrImplTest.searchAdminMods(AuditMgrImplTest.java:195)
	at org.apache.directory.fortress.core.impl.AuditMgrImplTest.testSearchAdminMods(AuditMgrImplTest.java:94)


Results :

Failed tests: 
  AccessMgrImplTest.testAbacConstraintsRole:1297->createSessionsConstraints:1384 org.apache.directory.fortress.core.impl.AccessMgrImplTest.createSessionsConstraints washers cannot contain tellers, user: curly, constraint value: north
  AuditMgrImplTest.testGetAuthZs:311->getAuthZs:355 LdapException in AuditDAO.getAllAuthZs id=org.apache.directory.api.ldap.model.exception.LdapException: org.apache.directory.api.ldap.model.exception.LdapInvalidDnException: ERR_04202 A value is missing on some RDN
  AuditMgrImplTest.testSearchAdminMods:94->searchAdminMods:195 searchAdminMods caught LdapException id=org.apache.directory.api.ldap.model.exception.LdapException: org.apache.directory.api.ldap.model.exception.LdapInvalidDnException: ERR_04202 A value is missing on some RDN
  AuditMgrImplTest.testSearchAuthZs:248->searchAuthZs:301 LdapException in AuditDAO.searchAuthZs id=org.apache.directory.api.ldap.model.exception.LdapException: org.apache.directory.api.ldap.model.exception.LdapInvalidDnException: ERR_04202 A value is missing on some RDN
  AuditMgrImplTest.testSearchBinds:399->searchBinds:444 LdapException in AuditDAO.searchBinds id=org.apache.directory.api.ldap.model.exception.LdapException: org.apache.directory.api.ldap.model.exception.LdapInvalidDnException: ERR_04202 A value is missing on some RDN
  AuditMgrImplTest.testSearchMods:205->searchMods:241 searchUserMods caught LdapException id=org.apache.directory.api.ldap.model.exception.LdapException: org.apache.directory.api.ldap.model.exception.LdapInvalidDnException: ERR_04202 A value is missing on some RDN

Tests run: 132, Failures: 6, Errors: 0, Skipped: 0

[INFO] ------------------------------------------------------------------------
[INFO] BUILD FAILURE
[INFO] ------------------------------------------------------------------------
[INFO] Total time: 03:44 min
[INFO] Finished at: 2018-08-27T17:35:30+00:00
[INFO] Final Memory: 21M/317M
[INFO] ------------------------------------------------------------------------
[ERROR] Failed to execute goal org.apache.maven.plugins:maven-surefire-plugin:2.18.1:test (default-test) on project fortress-core: There are test failures.
[ERROR] 
[ERROR] Please refer to <https://builds.apache.org/job/dir-fortress-core-docker-openldap-test/ws/target/surefire-reports> for the individual test results.
[ERROR] -> [Help 1]
[ERROR] 
[ERROR] To see the full stack trace of the errors, re-run Maven with the -e switch.
[ERROR] Re-run Maven using the -X switch to enable full debug logging.
[ERROR] 
[ERROR] For more information about the errors and possible solutions, please read the following articles:
[ERROR] [Help 1] http://cwiki.apache.org/confluence/display/MAVEN/MojoFailureException
Build step 'Invoke top-level Maven targets' marked build as failure
[dir-fortress-core-docker-openldap-test] $ /bin/bash /tmp/jenkins2870223713741450858.sh
dir-fortress-core-docker-openldap-test
dir-fortress-core-docker-openldap-test
CONTAINER ID        IMAGE               COMMAND             CREATED             STATUS              PORTS               NAMES

Jenkins build is back to normal : dir-fortress-core-docker-openldap-test #543

Posted by Apache Jenkins Server <je...@builds.apache.org>.
See <https://builds.apache.org/job/dir-fortress-core-docker-openldap-test/543/display/redirect?page=changes>


Build failed in Jenkins: dir-fortress-core-docker-openldap-test #542

Posted by Apache Jenkins Server <je...@builds.apache.org>.
See <https://builds.apache.org/job/dir-fortress-core-docker-openldap-test/542/display/redirect?page=changes>

Changes:

[smckinney] fix broken build

------------------------------------------
[...truncated 227.72 KB...]
	at org.apache.directory.fortress.core.impl.AuditMgrImplTest.getAuthZs(AuditMgrImplTest.java:335)
	at org.apache.directory.fortress.core.impl.AuditMgrImplTest.testGetAuthZs(AuditMgrImplTest.java:311)
	at sun.reflect.NativeMethodAccessorImpl.invoke0(Native Method)
	at sun.reflect.NativeMethodAccessorImpl.invoke(NativeMethodAccessorImpl.java:62)
	at sun.reflect.DelegatingMethodAccessorImpl.invoke(DelegatingMethodAccessorImpl.java:43)
	at java.lang.reflect.Method.invoke(Method.java:498)
	at junit.framework.TestCase.runTest(TestCase.java:176)
	at junit.framework.TestCase.runBare(TestCase.java:141)
	at junit.framework.TestResult$1.protect(TestResult.java:122)
	at junit.framework.TestResult.runProtected(TestResult.java:142)
	at junit.framework.TestResult.run(TestResult.java:125)
	at junit.framework.TestCase.run(TestCase.java:129)
	at junit.framework.TestSuite.runTest(TestSuite.java:252)
	at junit.framework.TestSuite.run(TestSuite.java:247)
	at org.junit.internal.runners.JUnit38ClassRunner.run(JUnit38ClassRunner.java:86)
	at org.apache.maven.surefire.junit4.JUnit4Provider.execute(JUnit4Provider.java:283)
	at org.apache.maven.surefire.junit4.JUnit4Provider.executeWithRerun(JUnit4Provider.java:173)
	at org.apache.maven.surefire.junit4.JUnit4Provider.executeTestSet(JUnit4Provider.java:153)
	at org.apache.maven.surefire.junit4.JUnit4Provider.invoke(JUnit4Provider.java:128)
	at org.apache.maven.surefire.booter.ForkedBooter.invokeProviderInSameClassLoader(ForkedBooter.java:203)
	at org.apache.maven.surefire.booter.ForkedBooter.runSuitesInProcess(ForkedBooter.java:155)
	at org.apache.maven.surefire.booter.ForkedBooter.main(ForkedBooter.java:103)
Caused by: org.apache.directory.api.ldap.model.exception.LdapException: org.apache.directory.api.ldap.model.exception.LdapInvalidDnException: ERR_04202 A value is missing on some RDN
	at org.apache.directory.fortress.core.ldap.LdapConnectionProvider.getLogConnection(LdapConnectionProvider.java:343)
	at org.apache.directory.fortress.core.ldap.LdapDataProvider.getLogConnection(LdapDataProvider.java:1261)
	at org.apache.directory.fortress.core.impl.AuditDAO.getAllAuthZs(AuditDAO.java:436)
	... 24 more
Caused by: org.apache.directory.api.ldap.model.exception.LdapInvalidDnException: ERR_04202 A value is missing on some RDN
	at org.apache.directory.api.ldap.model.name.Dn.<init>(Dn.java:285)
	at org.apache.directory.ldap.client.api.AbstractLdapConnection.bind(AbstractLdapConnection.java:114)
	at org.apache.directory.ldap.client.api.DefaultLdapConnectionFactory.bindConnection(DefaultLdapConnectionFactory.java:64)
	at org.apache.directory.ldap.client.api.DefaultLdapConnectionFactory.newLdapConnection(DefaultLdapConnectionFactory.java:107)
	at org.apache.directory.ldap.client.api.ValidatingPoolableLdapConnectionFactory.makeObject(ValidatingPoolableLdapConnectionFactory.java:134)
	at org.apache.directory.ldap.client.api.ValidatingPoolableLdapConnectionFactory.makeObject(ValidatingPoolableLdapConnectionFactory.java:59)
	at org.apache.commons.pool.impl.GenericObjectPool.borrowObject(GenericObjectPool.java:1188)
	at org.apache.directory.ldap.client.api.LdapConnectionPool.getConnection(LdapConnectionPool.java:123)
	at org.apache.directory.fortress.core.ldap.LdapConnectionProvider.getLogConnection(LdapConnectionProvider.java:339)
	... 26 more
2018-08-27 20:54:017 INFO  LogUtil:64 - GET-AUTHZ TU1_UPD
2018-08-27 20:54:017 ERROR DefaultLdapConnectionFactory:68 - unable to bind connection: ERR_04202 A value is missing on some RDN
2018-08-27 20:54:017 ERROR AuditMgrImplTest:298 - searchAuthZs: failed with SecurityException rc=7002, msg=LdapException in AuditDAO.searchAuthZs id=org.apache.directory.api.ldap.model.exception.LdapException: org.apache.directory.api.ldap.model.exception.LdapInvalidDnException: ERR_04202 A value is missing on some RDN
org.apache.directory.fortress.core.FinderException: LdapException in AuditDAO.searchAuthZs id=org.apache.directory.api.ldap.model.exception.LdapException: org.apache.directory.api.ldap.model.exception.LdapInvalidDnException: ERR_04202 A value is missing on some RDN
	at org.apache.directory.fortress.core.impl.AuditDAO.searchAuthZs(AuditDAO.java:359)
	at org.apache.directory.fortress.core.impl.AuditP.searchAuthZs(AuditP.java:82)
	at org.apache.directory.fortress.core.impl.AuditMgrImpl.searchAuthZs(AuditMgrImpl.java:141)
	at org.apache.directory.fortress.core.impl.AuditMgrImplTest.searchAuthZs(AuditMgrImplTest.java:286)
	at org.apache.directory.fortress.core.impl.AuditMgrImplTest.testSearchAuthZs(AuditMgrImplTest.java:248)
	at sun.reflect.NativeMethodAccessorImpl.invoke0(Native Method)
	at sun.reflect.NativeMethodAccessorImpl.invoke(NativeMethodAccessorImpl.java:62)
	at sun.reflect.DelegatingMethodAccessorImpl.invoke(DelegatingMethodAccessorImpl.java:43)
	at java.lang.reflect.Method.invoke(Method.java:498)
	at junit.framework.TestCase.runTest(TestCase.java:176)
	at junit.framework.TestCase.runBare(TestCase.java:141)
	at junit.framework.TestResult$1.protect(TestResult.java:122)
	at junit.framework.TestResult.runProtected(TestResult.java:142)
	at junit.framework.TestResult.run(TestResult.java:125)
	at junit.framework.TestCase.run(TestCase.java:129)
	at junit.framework.TestSuite.runTest(TestSuite.java:252)
	at junit.framework.TestSuite.run(TestSuite.java:247)
	at org.junit.internal.runners.JUnit38ClassRunner.run(JUnit38ClassRunner.java:86)
	at org.apache.maven.surefire.junit4.JUnit4Provider.execute(JUnit4Provider.java:283)
	at org.apache.maven.surefire.junit4.JUnit4Provider.executeWithRerun(JUnit4Provider.java:173)
	at org.apache.maven.surefire.junit4.JUnit4Provider.executeTestSet(JUnit4Provider.java:153)
	at org.apache.maven.surefire.junit4.JUnit4Provider.invoke(JUnit4Provider.java:128)
	at org.apache.maven.surefire.booter.ForkedBooter.invokeProviderInSameClassLoader(ForkedBooter.java:203)
	at org.apache.maven.surefire.booter.ForkedBooter.runSuitesInProcess(ForkedBooter.java:155)
	at org.apache.maven.surefire.booter.ForkedBooter.main(ForkedBooter.java:103)
Caused by: org.apache.directory.api.ldap.model.exception.LdapException: org.apache.directory.api.ldap.model.exception.LdapInvalidDnException: ERR_04202 A value is missing on some RDN
	at org.apache.directory.fortress.core.ldap.LdapConnectionProvider.getLogConnection(LdapConnectionProvider.java:343)
	at org.apache.directory.fortress.core.ldap.LdapDataProvider.getLogConnection(LdapDataProvider.java:1261)
	at org.apache.directory.fortress.core.impl.AuditDAO.searchAuthZs(AuditDAO.java:346)
	... 24 more
Caused by: org.apache.directory.api.ldap.model.exception.LdapInvalidDnException: ERR_04202 A value is missing on some RDN
	at org.apache.directory.api.ldap.model.name.Dn.<init>(Dn.java:285)
	at org.apache.directory.ldap.client.api.AbstractLdapConnection.bind(AbstractLdapConnection.java:114)
	at org.apache.directory.ldap.client.api.DefaultLdapConnectionFactory.bindConnection(DefaultLdapConnectionFactory.java:64)
	at org.apache.directory.ldap.client.api.DefaultLdapConnectionFactory.newLdapConnection(DefaultLdapConnectionFactory.java:107)
	at org.apache.directory.ldap.client.api.ValidatingPoolableLdapConnectionFactory.makeObject(ValidatingPoolableLdapConnectionFactory.java:134)
	at org.apache.directory.ldap.client.api.ValidatingPoolableLdapConnectionFactory.makeObject(ValidatingPoolableLdapConnectionFactory.java:59)
	at org.apache.commons.pool.impl.GenericObjectPool.borrowObject(GenericObjectPool.java:1188)
	at org.apache.directory.ldap.client.api.LdapConnectionPool.getConnection(LdapConnectionPool.java:123)
	at org.apache.directory.fortress.core.ldap.LdapConnectionProvider.getLogConnection(LdapConnectionProvider.java:339)
	... 26 more
2018-08-27 20:54:017 INFO  LogUtil:64 - SESS-USRS TU1_UPD
2018-08-27 20:54:017 ERROR DefaultLdapConnectionFactory:68 - unable to bind connection: ERR_04202 A value is missing on some RDN
2018-08-27 20:54:017 ERROR AuditMgrImplTest:239 - searchUserSessions: failed with SecurityException rc=7003, msg=searchUserMods caught LdapException id=org.apache.directory.api.ldap.model.exception.LdapException: org.apache.directory.api.ldap.model.exception.LdapInvalidDnException: ERR_04202 A value is missing on some RDN
org.apache.directory.fortress.core.FinderException: searchUserMods caught LdapException id=org.apache.directory.api.ldap.model.exception.LdapException: org.apache.directory.api.ldap.model.exception.LdapInvalidDnException: ERR_04202 A value is missing on some RDN
	at org.apache.directory.fortress.core.impl.AuditDAO.searchUserMods(AuditDAO.java:588)
	at org.apache.directory.fortress.core.impl.AuditP.searchUserMods(AuditP.java:110)
	at org.apache.directory.fortress.core.impl.AuditMgrImpl.searchUserSessions(AuditMgrImpl.java:170)
	at org.apache.directory.fortress.core.impl.AuditMgrImplTest.searchMods(AuditMgrImplTest.java:229)
	at org.apache.directory.fortress.core.impl.AuditMgrImplTest.testSearchMods(AuditMgrImplTest.java:205)
	at sun.reflect.NativeMethodAccessorImpl.invoke0(Native Method)
	at sun.reflect.NativeMethodAccessorImpl.invoke(NativeMethodAccessorImpl.java:62)
	at sun.reflect.DelegatingMethodAccessorImpl.invoke(DelegatingMethodAccessorImpl.java:43)
	at java.lang.reflect.Method.invoke(Method.java:498)
	at junit.framework.TestCase.runTest(TestCase.java:176)
	at junit.framework.TestCase.runBare(TestCase.java:141)
	at junit.framework.TestResult$1.protect(TestResult.java:122)
	at junit.framework.TestResult.runProtected(TestResult.java:142)
	at junit.framework.TestResult.run(TestResult.java:125)
	at junit.framework.TestCase.run(TestCase.java:129)
	at junit.framework.TestSuite.runTest(TestSuite.java:252)
	at junit.framework.TestSuite.run(TestSuite.java:247)
	at org.junit.internal.runners.JUnit38ClassRunner.run(JUnit38ClassRunner.java:86)
	at org.apache.maven.surefire.junit4.JUnit4Provider.execute(JUnit4Provider.java:283)
	at org.apache.maven.surefire.junit4.JUnit4Provider.executeWithRerun(JUnit4Provider.java:173)
	at org.apache.maven.surefire.junit4.JUnit4Provider.executeTestSet(JUnit4Provider.java:153)
	at org.apache.maven.surefire.junit4.JUnit4Provider.invoke(JUnit4Provider.java:128)
	at org.apache.maven.surefire.booter.ForkedBooter.invokeProviderInSameClassLoader(ForkedBooter.java:203)
	at org.apache.maven.surefire.booter.ForkedBooter.runSuitesInProcess(ForkedBooter.java:155)
	at org.apache.maven.surefire.booter.ForkedBooter.main(ForkedBooter.java:103)
Caused by: org.apache.directory.api.ldap.model.exception.LdapException: org.apache.directory.api.ldap.model.exception.LdapInvalidDnException: ERR_04202 A value is missing on some RDN
	at org.apache.directory.fortress.core.ldap.LdapConnectionProvider.getLogConnection(LdapConnectionProvider.java:343)
	at org.apache.directory.fortress.core.ldap.LdapDataProvider.getLogConnection(LdapDataProvider.java:1261)
	at org.apache.directory.fortress.core.impl.AuditDAO.searchUserMods(AuditDAO.java:575)
	... 24 more
Caused by: org.apache.directory.api.ldap.model.exception.LdapInvalidDnException: ERR_04202 A value is missing on some RDN
	at org.apache.directory.api.ldap.model.name.Dn.<init>(Dn.java:285)
	at org.apache.directory.ldap.client.api.AbstractLdapConnection.bind(AbstractLdapConnection.java:114)
	at org.apache.directory.ldap.client.api.DefaultLdapConnectionFactory.bindConnection(DefaultLdapConnectionFactory.java:64)
	at org.apache.directory.ldap.client.api.DefaultLdapConnectionFactory.newLdapConnection(DefaultLdapConnectionFactory.java:107)
	at org.apache.directory.ldap.client.api.ValidatingPoolableLdapConnectionFactory.makeObject(ValidatingPoolableLdapConnectionFactory.java:134)
	at org.apache.directory.ldap.client.api.ValidatingPoolableLdapConnectionFactory.makeObject(ValidatingPoolableLdapConnectionFactory.java:59)
	at org.apache.commons.pool.impl.GenericObjectPool.borrowObject(GenericObjectPool.java:1188)
	at org.apache.directory.ldap.client.api.LdapConnectionPool.getConnection(LdapConnectionPool.java:123)
	at org.apache.directory.fortress.core.ldap.LdapConnectionProvider.getLogConnection(LdapConnectionProvider.java:339)
	... 26 more
2018-08-27 20:54:017 INFO  LogUtil:64 - SESS-USRS RBAC TU0
2018-08-27 20:54:017 ERROR DefaultLdapConnectionFactory:68 - unable to bind connection: ERR_04202 A value is missing on some RDN
2018-08-27 20:54:017 ERROR AuditMgrImplTest:192 - searchAdminMods: failed with SecurityException rc=7004, msg=searchAdminMods caught LdapException id=org.apache.directory.api.ldap.model.exception.LdapException: org.apache.directory.api.ldap.model.exception.LdapInvalidDnException: ERR_04202 A value is missing on some RDN
org.apache.directory.fortress.core.FinderException: searchAdminMods caught LdapException id=org.apache.directory.api.ldap.model.exception.LdapException: org.apache.directory.api.ldap.model.exception.LdapInvalidDnException: ERR_04202 A value is missing on some RDN
	at org.apache.directory.fortress.core.impl.AuditDAO.searchAdminMods(AuditDAO.java:678)
	at org.apache.directory.fortress.core.impl.AuditP.searchAdminMods(AuditP.java:125)
	at org.apache.directory.fortress.core.impl.AuditMgrImpl.searchAdminMods(AuditMgrImpl.java:190)
	at org.apache.directory.fortress.core.impl.AuditMgrImplTest.searchAdminMods(AuditMgrImplTest.java:173)
	at org.apache.directory.fortress.core.impl.AuditMgrImplTest.testSearchAdminMods(AuditMgrImplTest.java:94)
	at sun.reflect.NativeMethodAccessorImpl.invoke0(Native Method)
	at sun.reflect.NativeMethodAccessorImpl.invoke(NativeMethodAccessorImpl.java:62)
	at sun.reflect.DelegatingMethodAccessorImpl.invoke(DelegatingMethodAccessorImpl.java:43)
	at java.lang.reflect.Method.invoke(Method.java:498)
	at junit.framework.TestCase.runTest(TestCase.java:176)
	at junit.framework.TestCase.runBare(TestCase.java:141)
	at junit.framework.TestResult$1.protect(TestResult.java:122)
	at junit.framework.TestResult.runProtected(TestResult.java:142)
	at junit.framework.TestResult.run(TestResult.java:125)
	at junit.framework.TestCase.run(TestCase.java:129)
	at junit.framework.TestSuite.runTest(TestSuite.java:252)
	at junit.framework.TestSuite.run(TestSuite.java:247)
	at org.junit.internal.runners.JUnit38ClassRunner.run(JUnit38ClassRunner.java:86)
	at org.apache.maven.surefire.junit4.JUnit4Provider.execute(JUnit4Provider.java:283)
	at org.apache.maven.surefire.junit4.JUnit4Provider.executeWithRerun(JUnit4Provider.java:173)
	at org.apache.maven.surefire.junit4.JUnit4Provider.executeTestSet(JUnit4Provider.java:153)
	at org.apache.maven.surefire.junit4.JUnit4Provider.invoke(JUnit4Provider.java:128)
	at org.apache.maven.surefire.booter.ForkedBooter.invokeProviderInSameClassLoader(ForkedBooter.java:203)
	at org.apache.maven.surefire.booter.ForkedBooter.runSuitesInProcess(ForkedBooter.java:155)
	at org.apache.maven.surefire.booter.ForkedBooter.main(ForkedBooter.java:103)
Caused by: org.apache.directory.api.ldap.model.exception.LdapException: org.apache.directory.api.ldap.model.exception.LdapInvalidDnException: ERR_04202 A value is missing on some RDN
	at org.apache.directory.fortress.core.ldap.LdapConnectionProvider.getLogConnection(LdapConnectionProvider.java:343)
	at org.apache.directory.fortress.core.ldap.LdapDataProvider.getLogConnection(LdapDataProvider.java:1261)
	at org.apache.directory.fortress.core.impl.AuditDAO.searchAdminMods(AuditDAO.java:665)
	... 24 more
Caused by: org.apache.directory.api.ldap.model.exception.LdapInvalidDnException: ERR_04202 A value is missing on some RDN
	at org.apache.directory.api.ldap.model.name.Dn.<init>(Dn.java:285)
	at org.apache.directory.ldap.client.api.AbstractLdapConnection.bind(AbstractLdapConnection.java:114)
	at org.apache.directory.ldap.client.api.DefaultLdapConnectionFactory.bindConnection(DefaultLdapConnectionFactory.java:64)
	at org.apache.directory.ldap.client.api.DefaultLdapConnectionFactory.newLdapConnection(DefaultLdapConnectionFactory.java:107)
	at org.apache.directory.ldap.client.api.ValidatingPoolableLdapConnectionFactory.makeObject(ValidatingPoolableLdapConnectionFactory.java:134)
	at org.apache.directory.ldap.client.api.ValidatingPoolableLdapConnectionFactory.makeObject(ValidatingPoolableLdapConnectionFactory.java:59)
	at org.apache.commons.pool.impl.GenericObjectPool.borrowObject(GenericObjectPool.java:1188)
	at org.apache.directory.ldap.client.api.LdapConnectionPool.getConnection(LdapConnectionPool.java:123)
	at org.apache.directory.fortress.core.ldap.LdapConnectionProvider.getLogConnection(LdapConnectionProvider.java:339)
	... 26 more
NUMBER OF ADDS: 1006
NUMBER OF BINDS: 1131
NUMBER OF DELETES: 0
NUMBER OF MODS: 4112
NUMBER OF READS: 19618
NUMBER OF SEARCHES: 7026
Tests run: 132, Failures: 5, Errors: 0, Skipped: 0, Time elapsed: 214.885 sec <<< FAILURE! - in org.apache.directory.fortress.core.impl.FortressJUnitTest
testSearchBinds(org.apache.directory.fortress.core.impl.AuditMgrImplTest)  Time elapsed: 0.081 sec  <<< FAILURE!
junit.framework.AssertionFailedError: LdapException in AuditDAO.searchBinds id=org.apache.directory.api.ldap.model.exception.LdapException: org.apache.directory.api.ldap.model.exception.LdapInvalidDnException: ERR_04202 A value is missing on some RDN
	at junit.framework.Assert.fail(Assert.java:57)
	at junit.framework.TestCase.fail(TestCase.java:227)
	at org.apache.directory.fortress.core.impl.AuditMgrImplTest.searchBinds(AuditMgrImplTest.java:444)
	at org.apache.directory.fortress.core.impl.AuditMgrImplTest.testSearchBinds(AuditMgrImplTest.java:399)

testGetAuthZs(org.apache.directory.fortress.core.impl.AuditMgrImplTest)  Time elapsed: 0.004 sec  <<< FAILURE!
junit.framework.AssertionFailedError: LdapException in AuditDAO.getAllAuthZs id=org.apache.directory.api.ldap.model.exception.LdapException: org.apache.directory.api.ldap.model.exception.LdapInvalidDnException: ERR_04202 A value is missing on some RDN
	at junit.framework.Assert.fail(Assert.java:57)
	at junit.framework.TestCase.fail(TestCase.java:227)
	at org.apache.directory.fortress.core.impl.AuditMgrImplTest.getAuthZs(AuditMgrImplTest.java:355)
	at org.apache.directory.fortress.core.impl.AuditMgrImplTest.testGetAuthZs(AuditMgrImplTest.java:311)

testSearchAuthZs(org.apache.directory.fortress.core.impl.AuditMgrImplTest)  Time elapsed: 0.004 sec  <<< FAILURE!
junit.framework.AssertionFailedError: LdapException in AuditDAO.searchAuthZs id=org.apache.directory.api.ldap.model.exception.LdapException: org.apache.directory.api.ldap.model.exception.LdapInvalidDnException: ERR_04202 A value is missing on some RDN
	at junit.framework.Assert.fail(Assert.java:57)
	at junit.framework.TestCase.fail(TestCase.java:227)
	at org.apache.directory.fortress.core.impl.AuditMgrImplTest.searchAuthZs(AuditMgrImplTest.java:301)
	at org.apache.directory.fortress.core.impl.AuditMgrImplTest.testSearchAuthZs(AuditMgrImplTest.java:248)

testSearchMods(org.apache.directory.fortress.core.impl.AuditMgrImplTest)  Time elapsed: 0.005 sec  <<< FAILURE!
junit.framework.AssertionFailedError: searchUserMods caught LdapException id=org.apache.directory.api.ldap.model.exception.LdapException: org.apache.directory.api.ldap.model.exception.LdapInvalidDnException: ERR_04202 A value is missing on some RDN
	at junit.framework.Assert.fail(Assert.java:57)
	at junit.framework.TestCase.fail(TestCase.java:227)
	at org.apache.directory.fortress.core.impl.AuditMgrImplTest.searchMods(AuditMgrImplTest.java:241)
	at org.apache.directory.fortress.core.impl.AuditMgrImplTest.testSearchMods(AuditMgrImplTest.java:205)

testSearchAdminMods(org.apache.directory.fortress.core.impl.AuditMgrImplTest)  Time elapsed: 0.005 sec  <<< FAILURE!
junit.framework.AssertionFailedError: searchAdminMods caught LdapException id=org.apache.directory.api.ldap.model.exception.LdapException: org.apache.directory.api.ldap.model.exception.LdapInvalidDnException: ERR_04202 A value is missing on some RDN
	at junit.framework.Assert.fail(Assert.java:57)
	at junit.framework.TestCase.fail(TestCase.java:227)
	at org.apache.directory.fortress.core.impl.AuditMgrImplTest.searchAdminMods(AuditMgrImplTest.java:195)
	at org.apache.directory.fortress.core.impl.AuditMgrImplTest.testSearchAdminMods(AuditMgrImplTest.java:94)


Results :

Failed tests: 
  AuditMgrImplTest.testGetAuthZs:311->getAuthZs:355 LdapException in AuditDAO.getAllAuthZs id=org.apache.directory.api.ldap.model.exception.LdapException: org.apache.directory.api.ldap.model.exception.LdapInvalidDnException: ERR_04202 A value is missing on some RDN
  AuditMgrImplTest.testSearchAdminMods:94->searchAdminMods:195 searchAdminMods caught LdapException id=org.apache.directory.api.ldap.model.exception.LdapException: org.apache.directory.api.ldap.model.exception.LdapInvalidDnException: ERR_04202 A value is missing on some RDN
  AuditMgrImplTest.testSearchAuthZs:248->searchAuthZs:301 LdapException in AuditDAO.searchAuthZs id=org.apache.directory.api.ldap.model.exception.LdapException: org.apache.directory.api.ldap.model.exception.LdapInvalidDnException: ERR_04202 A value is missing on some RDN
  AuditMgrImplTest.testSearchBinds:399->searchBinds:444 LdapException in AuditDAO.searchBinds id=org.apache.directory.api.ldap.model.exception.LdapException: org.apache.directory.api.ldap.model.exception.LdapInvalidDnException: ERR_04202 A value is missing on some RDN
  AuditMgrImplTest.testSearchMods:205->searchMods:241 searchUserMods caught LdapException id=org.apache.directory.api.ldap.model.exception.LdapException: org.apache.directory.api.ldap.model.exception.LdapInvalidDnException: ERR_04202 A value is missing on some RDN

Tests run: 132, Failures: 5, Errors: 0, Skipped: 0

[INFO] ------------------------------------------------------------------------
[INFO] BUILD FAILURE
[INFO] ------------------------------------------------------------------------
[INFO] Total time: 03:44 min
[INFO] Finished at: 2018-08-27T20:54:17+00:00
[INFO] Final Memory: 21M/326M
[INFO] ------------------------------------------------------------------------
[ERROR] Failed to execute goal org.apache.maven.plugins:maven-surefire-plugin:2.18.1:test (default-test) on project fortress-core: There are test failures.
[ERROR] 
[ERROR] Please refer to <https://builds.apache.org/job/dir-fortress-core-docker-openldap-test/ws/target/surefire-reports> for the individual test results.
[ERROR] -> [Help 1]
[ERROR] 
[ERROR] To see the full stack trace of the errors, re-run Maven with the -e switch.
[ERROR] Re-run Maven using the -X switch to enable full debug logging.
[ERROR] 
[ERROR] For more information about the errors and possible solutions, please read the following articles:
[ERROR] [Help 1] http://cwiki.apache.org/confluence/display/MAVEN/MojoFailureException
Build step 'Invoke top-level Maven targets' marked build as failure
[dir-fortress-core-docker-openldap-test] $ /bin/bash /tmp/jenkins860306379769773409.sh
dir-fortress-core-docker-openldap-test
dir-fortress-core-docker-openldap-test
CONTAINER ID        IMAGE               COMMAND             CREATED             STATUS              PORTS               NAMES

Build failed in Jenkins: dir-fortress-core-docker-openldap-test #541

Posted by Apache Jenkins Server <je...@builds.apache.org>.
See <https://builds.apache.org/job/dir-fortress-core-docker-openldap-test/541/display/redirect?page=changes>

Changes:

[smckinney] fix broken abac test

------------------------------------------
[...truncated 226.83 KB...]
	at sun.reflect.NativeMethodAccessorImpl.invoke0(Native Method)
	at sun.reflect.NativeMethodAccessorImpl.invoke(NativeMethodAccessorImpl.java:62)
	at sun.reflect.DelegatingMethodAccessorImpl.invoke(DelegatingMethodAccessorImpl.java:43)
	at java.lang.reflect.Method.invoke(Method.java:498)
	at junit.framework.TestCase.runTest(TestCase.java:176)
	at junit.framework.TestCase.runBare(TestCase.java:141)
	at junit.framework.TestResult$1.protect(TestResult.java:122)
	at junit.framework.TestResult.runProtected(TestResult.java:142)
	at junit.framework.TestResult.run(TestResult.java:125)
	at junit.framework.TestCase.run(TestCase.java:129)
	at junit.framework.TestSuite.runTest(TestSuite.java:252)
	at junit.framework.TestSuite.run(TestSuite.java:247)
	at org.junit.internal.runners.JUnit38ClassRunner.run(JUnit38ClassRunner.java:86)
	at org.apache.maven.surefire.junit4.JUnit4Provider.execute(JUnit4Provider.java:283)
	at org.apache.maven.surefire.junit4.JUnit4Provider.executeWithRerun(JUnit4Provider.java:173)
	at org.apache.maven.surefire.junit4.JUnit4Provider.executeTestSet(JUnit4Provider.java:153)
	at org.apache.maven.surefire.junit4.JUnit4Provider.invoke(JUnit4Provider.java:128)
	at org.apache.maven.surefire.booter.ForkedBooter.invokeProviderInSameClassLoader(ForkedBooter.java:203)
	at org.apache.maven.surefire.booter.ForkedBooter.runSuitesInProcess(ForkedBooter.java:155)
	at org.apache.maven.surefire.booter.ForkedBooter.main(ForkedBooter.java:103)
Caused by: org.apache.directory.api.ldap.model.exception.LdapException: org.apache.directory.api.ldap.model.exception.LdapInvalidDnException: ERR_04202 A value is missing on some RDN
	at org.apache.directory.fortress.core.ldap.LdapConnectionProvider.getLogConnection(LdapConnectionProvider.java:343)
	at org.apache.directory.fortress.core.ldap.LdapDataProvider.getLogConnection(LdapDataProvider.java:1261)
	at org.apache.directory.fortress.core.impl.AuditDAO.getAllAuthZs(AuditDAO.java:436)
	... 24 more
Caused by: org.apache.directory.api.ldap.model.exception.LdapInvalidDnException: ERR_04202 A value is missing on some RDN
	at org.apache.directory.api.ldap.model.name.Dn.<init>(Dn.java:285)
	at org.apache.directory.ldap.client.api.AbstractLdapConnection.bind(AbstractLdapConnection.java:114)
	at org.apache.directory.ldap.client.api.DefaultLdapConnectionFactory.bindConnection(DefaultLdapConnectionFactory.java:64)
	at org.apache.directory.ldap.client.api.DefaultLdapConnectionFactory.newLdapConnection(DefaultLdapConnectionFactory.java:107)
	at org.apache.directory.ldap.client.api.ValidatingPoolableLdapConnectionFactory.makeObject(ValidatingPoolableLdapConnectionFactory.java:134)
	at org.apache.directory.ldap.client.api.ValidatingPoolableLdapConnectionFactory.makeObject(ValidatingPoolableLdapConnectionFactory.java:59)
	at org.apache.commons.pool.impl.GenericObjectPool.borrowObject(GenericObjectPool.java:1188)
	at org.apache.directory.ldap.client.api.LdapConnectionPool.getConnection(LdapConnectionPool.java:123)
	at org.apache.directory.fortress.core.ldap.LdapConnectionProvider.getLogConnection(LdapConnectionProvider.java:339)
	... 26 more
2018-08-27 20:44:017 INFO  LogUtil:64 - GET-AUTHZ TU1_UPD
2018-08-27 20:44:017 ERROR DefaultLdapConnectionFactory:68 - unable to bind connection: ERR_04202 A value is missing on some RDN
2018-08-27 20:44:017 ERROR AuditMgrImplTest:298 - searchAuthZs: failed with SecurityException rc=7002, msg=LdapException in AuditDAO.searchAuthZs id=org.apache.directory.api.ldap.model.exception.LdapException: org.apache.directory.api.ldap.model.exception.LdapInvalidDnException: ERR_04202 A value is missing on some RDN
org.apache.directory.fortress.core.FinderException: LdapException in AuditDAO.searchAuthZs id=org.apache.directory.api.ldap.model.exception.LdapException: org.apache.directory.api.ldap.model.exception.LdapInvalidDnException: ERR_04202 A value is missing on some RDN
	at org.apache.directory.fortress.core.impl.AuditDAO.searchAuthZs(AuditDAO.java:359)
	at org.apache.directory.fortress.core.impl.AuditP.searchAuthZs(AuditP.java:82)
	at org.apache.directory.fortress.core.impl.AuditMgrImpl.searchAuthZs(AuditMgrImpl.java:141)
	at org.apache.directory.fortress.core.impl.AuditMgrImplTest.searchAuthZs(AuditMgrImplTest.java:286)
	at org.apache.directory.fortress.core.impl.AuditMgrImplTest.testSearchAuthZs(AuditMgrImplTest.java:248)
	at sun.reflect.NativeMethodAccessorImpl.invoke0(Native Method)
	at sun.reflect.NativeMethodAccessorImpl.invoke(NativeMethodAccessorImpl.java:62)
	at sun.reflect.DelegatingMethodAccessorImpl.invoke(DelegatingMethodAccessorImpl.java:43)
	at java.lang.reflect.Method.invoke(Method.java:498)
	at junit.framework.TestCase.runTest(TestCase.java:176)
	at junit.framework.TestCase.runBare(TestCase.java:141)
	at junit.framework.TestResult$1.protect(TestResult.java:122)
	at junit.framework.TestResult.runProtected(TestResult.java:142)
	at junit.framework.TestResult.run(TestResult.java:125)
	at junit.framework.TestCase.run(TestCase.java:129)
	at junit.framework.TestSuite.runTest(TestSuite.java:252)
	at junit.framework.TestSuite.run(TestSuite.java:247)
	at org.junit.internal.runners.JUnit38ClassRunner.run(JUnit38ClassRunner.java:86)
	at org.apache.maven.surefire.junit4.JUnit4Provider.execute(JUnit4Provider.java:283)
	at org.apache.maven.surefire.junit4.JUnit4Provider.executeWithRerun(JUnit4Provider.java:173)
	at org.apache.maven.surefire.junit4.JUnit4Provider.executeTestSet(JUnit4Provider.java:153)
	at org.apache.maven.surefire.junit4.JUnit4Provider.invoke(JUnit4Provider.java:128)
	at org.apache.maven.surefire.booter.ForkedBooter.invokeProviderInSameClassLoader(ForkedBooter.java:203)
	at org.apache.maven.surefire.booter.ForkedBooter.runSuitesInProcess(ForkedBooter.java:155)
	at org.apache.maven.surefire.booter.ForkedBooter.main(ForkedBooter.java:103)
Caused by: org.apache.directory.api.ldap.model.exception.LdapException: org.apache.directory.api.ldap.model.exception.LdapInvalidDnException: ERR_04202 A value is missing on some RDN
	at org.apache.directory.fortress.core.ldap.LdapConnectionProvider.getLogConnection(LdapConnectionProvider.java:343)
	at org.apache.directory.fortress.core.ldap.LdapDataProvider.getLogConnection(LdapDataProvider.java:1261)
	at org.apache.directory.fortress.core.impl.AuditDAO.searchAuthZs(AuditDAO.java:346)
	... 24 more
Caused by: org.apache.directory.api.ldap.model.exception.LdapInvalidDnException: ERR_04202 A value is missing on some RDN
	at org.apache.directory.api.ldap.model.name.Dn.<init>(Dn.java:285)
	at org.apache.directory.ldap.client.api.AbstractLdapConnection.bind(AbstractLdapConnection.java:114)
	at org.apache.directory.ldap.client.api.DefaultLdapConnectionFactory.bindConnection(DefaultLdapConnectionFactory.java:64)
	at org.apache.directory.ldap.client.api.DefaultLdapConnectionFactory.newLdapConnection(DefaultLdapConnectionFactory.java:107)
	at org.apache.directory.ldap.client.api.ValidatingPoolableLdapConnectionFactory.makeObject(ValidatingPoolableLdapConnectionFactory.java:134)
	at org.apache.directory.ldap.client.api.ValidatingPoolableLdapConnectionFactory.makeObject(ValidatingPoolableLdapConnectionFactory.java:59)
	at org.apache.commons.pool.impl.GenericObjectPool.borrowObject(GenericObjectPool.java:1188)
	at org.apache.directory.ldap.client.api.LdapConnectionPool.getConnection(LdapConnectionPool.java:123)
	at org.apache.directory.fortress.core.ldap.LdapConnectionProvider.getLogConnection(LdapConnectionProvider.java:339)
	... 26 more
2018-08-27 20:44:017 INFO  LogUtil:64 - SESS-USRS TU1_UPD
2018-08-27 20:44:017 ERROR DefaultLdapConnectionFactory:68 - unable to bind connection: ERR_04202 A value is missing on some RDN
2018-08-27 20:44:017 ERROR AuditMgrImplTest:239 - searchUserSessions: failed with SecurityException rc=7003, msg=searchUserMods caught LdapException id=org.apache.directory.api.ldap.model.exception.LdapException: org.apache.directory.api.ldap.model.exception.LdapInvalidDnException: ERR_04202 A value is missing on some RDN
org.apache.directory.fortress.core.FinderException: searchUserMods caught LdapException id=org.apache.directory.api.ldap.model.exception.LdapException: org.apache.directory.api.ldap.model.exception.LdapInvalidDnException: ERR_04202 A value is missing on some RDN
	at org.apache.directory.fortress.core.impl.AuditDAO.searchUserMods(AuditDAO.java:588)
	at org.apache.directory.fortress.core.impl.AuditP.searchUserMods(AuditP.java:110)
	at org.apache.directory.fortress.core.impl.AuditMgrImpl.searchUserSessions(AuditMgrImpl.java:170)
	at org.apache.directory.fortress.core.impl.AuditMgrImplTest.searchMods(AuditMgrImplTest.java:229)
	at org.apache.directory.fortress.core.impl.AuditMgrImplTest.testSearchMods(AuditMgrImplTest.java:205)
	at sun.reflect.NativeMethodAccessorImpl.invoke0(Native Method)
	at sun.reflect.NativeMethodAccessorImpl.invoke(NativeMethodAccessorImpl.java:62)
	at sun.reflect.DelegatingMethodAccessorImpl.invoke(DelegatingMethodAccessorImpl.java:43)
	at java.lang.reflect.Method.invoke(Method.java:498)
	at junit.framework.TestCase.runTest(TestCase.java:176)
	at junit.framework.TestCase.runBare(TestCase.java:141)
	at junit.framework.TestResult$1.protect(TestResult.java:122)
	at junit.framework.TestResult.runProtected(TestResult.java:142)
	at junit.framework.TestResult.run(TestResult.java:125)
	at junit.framework.TestCase.run(TestCase.java:129)
	at junit.framework.TestSuite.runTest(TestSuite.java:252)
	at junit.framework.TestSuite.run(TestSuite.java:247)
	at org.junit.internal.runners.JUnit38ClassRunner.run(JUnit38ClassRunner.java:86)
	at org.apache.maven.surefire.junit4.JUnit4Provider.execute(JUnit4Provider.java:283)
	at org.apache.maven.surefire.junit4.JUnit4Provider.executeWithRerun(JUnit4Provider.java:173)
	at org.apache.maven.surefire.junit4.JUnit4Provider.executeTestSet(JUnit4Provider.java:153)
	at org.apache.maven.surefire.junit4.JUnit4Provider.invoke(JUnit4Provider.java:128)
	at org.apache.maven.surefire.booter.ForkedBooter.invokeProviderInSameClassLoader(ForkedBooter.java:203)
	at org.apache.maven.surefire.booter.ForkedBooter.runSuitesInProcess(ForkedBooter.java:155)
	at org.apache.maven.surefire.booter.ForkedBooter.main(ForkedBooter.java:103)
Caused by: org.apache.directory.api.ldap.model.exception.LdapException: org.apache.directory.api.ldap.model.exception.LdapInvalidDnException: ERR_04202 A value is missing on some RDN
	at org.apache.directory.fortress.core.ldap.LdapConnectionProvider.getLogConnection(LdapConnectionProvider.java:343)
	at org.apache.directory.fortress.core.ldap.LdapDataProvider.getLogConnection(LdapDataProvider.java:1261)
	at org.apache.directory.fortress.core.impl.AuditDAO.searchUserMods(AuditDAO.java:575)
	... 24 more
Caused by: org.apache.directory.api.ldap.model.exception.LdapInvalidDnException: ERR_04202 A value is missing on some RDN
	at org.apache.directory.api.ldap.model.name.Dn.<init>(Dn.java:285)
	at org.apache.directory.ldap.client.api.AbstractLdapConnection.bind(AbstractLdapConnection.java:114)
	at org.apache.directory.ldap.client.api.DefaultLdapConnectionFactory.bindConnection(DefaultLdapConnectionFactory.java:64)
	at org.apache.directory.ldap.client.api.DefaultLdapConnectionFactory.newLdapConnection(DefaultLdapConnectionFactory.java:107)
	at org.apache.directory.ldap.client.api.ValidatingPoolableLdapConnectionFactory.makeObject(ValidatingPoolableLdapConnectionFactory.java:134)
	at org.apache.directory.ldap.client.api.ValidatingPoolableLdapConnectionFactory.makeObject(ValidatingPoolableLdapConnectionFactory.java:59)
	at org.apache.commons.pool.impl.GenericObjectPool.borrowObject(GenericObjectPool.java:1188)
	at org.apache.directory.ldap.client.api.LdapConnectionPool.getConnection(LdapConnectionPool.java:123)
	at org.apache.directory.fortress.core.ldap.LdapConnectionProvider.getLogConnection(LdapConnectionProvider.java:339)
	... 26 more
2018-08-27 20:44:017 INFO  LogUtil:64 - SESS-USRS RBAC TU0
2018-08-27 20:44:017 ERROR DefaultLdapConnectionFactory:68 - unable to bind connection: ERR_04202 A value is missing on some RDN
2018-08-27 20:44:017 ERROR AuditMgrImplTest:192 - searchAdminMods: failed with SecurityException rc=7004, msg=searchAdminMods caught LdapException id=org.apache.directory.api.ldap.model.exception.LdapException: org.apache.directory.api.ldap.model.exception.LdapInvalidDnException: ERR_04202 A value is missing on some RDN
org.apache.directory.fortress.core.FinderException: searchAdminMods caught LdapException id=org.apache.directory.api.ldap.model.exception.LdapException: org.apache.directory.api.ldap.model.exception.LdapInvalidDnException: ERR_04202 A value is missing on some RDN
	at org.apache.directory.fortress.core.impl.AuditDAO.searchAdminMods(AuditDAO.java:678)
	at org.apache.directory.fortress.core.impl.AuditP.searchAdminMods(AuditP.java:125)
	at org.apache.directory.fortress.core.impl.AuditMgrImpl.searchAdminMods(AuditMgrImpl.java:190)
	at org.apache.directory.fortress.core.impl.AuditMgrImplTest.searchAdminMods(AuditMgrImplTest.java:173)
	at org.apache.directory.fortress.core.impl.AuditMgrImplTest.testSearchAdminMods(AuditMgrImplTest.java:94)
	at sun.reflect.NativeMethodAccessorImpl.invoke0(Native Method)
	at sun.reflect.NativeMethodAccessorImpl.invoke(NativeMethodAccessorImpl.java:62)
	at sun.reflect.DelegatingMethodAccessorImpl.invoke(DelegatingMethodAccessorImpl.java:43)
	at java.lang.reflect.Method.invoke(Method.java:498)
	at junit.framework.TestCase.runTest(TestCase.java:176)
	at junit.framework.TestCase.runBare(TestCase.java:141)
	at junit.framework.TestResult$1.protect(TestResult.java:122)
	at junit.framework.TestResult.runProtected(TestResult.java:142)
	at junit.framework.TestResult.run(TestResult.java:125)
	at junit.framework.TestCase.run(TestCase.java:129)
	at junit.framework.TestSuite.runTest(TestSuite.java:252)
	at junit.framework.TestSuite.run(TestSuite.java:247)
	at org.junit.internal.runners.JUnit38ClassRunner.run(JUnit38ClassRunner.java:86)
	at org.apache.maven.surefire.junit4.JUnit4Provider.execute(JUnit4Provider.java:283)
	at org.apache.maven.surefire.junit4.JUnit4Provider.executeWithRerun(JUnit4Provider.java:173)
	at org.apache.maven.surefire.junit4.JUnit4Provider.executeTestSet(JUnit4Provider.java:153)
	at org.apache.maven.surefire.junit4.JUnit4Provider.invoke(JUnit4Provider.java:128)
	at org.apache.maven.surefire.booter.ForkedBooter.invokeProviderInSameClassLoader(ForkedBooter.java:203)
	at org.apache.maven.surefire.booter.ForkedBooter.runSuitesInProcess(ForkedBooter.java:155)
	at org.apache.maven.surefire.booter.ForkedBooter.main(ForkedBooter.java:103)
Caused by: org.apache.directory.api.ldap.model.exception.LdapException: org.apache.directory.api.ldap.model.exception.LdapInvalidDnException: ERR_04202 A value is missing on some RDN
	at org.apache.directory.fortress.core.ldap.LdapConnectionProvider.getLogConnection(LdapConnectionProvider.java:343)
	at org.apache.directory.fortress.core.ldap.LdapDataProvider.getLogConnection(LdapDataProvider.java:1261)
	at org.apache.directory.fortress.core.impl.AuditDAO.searchAdminMods(AuditDAO.java:665)
	... 24 more
Caused by: org.apache.directory.api.ldap.model.exception.LdapInvalidDnException: ERR_04202 A value is missing on some RDN
	at org.apache.directory.api.ldap.model.name.Dn.<init>(Dn.java:285)
	at org.apache.directory.ldap.client.api.AbstractLdapConnection.bind(AbstractLdapConnection.java:114)
	at org.apache.directory.ldap.client.api.DefaultLdapConnectionFactory.bindConnection(DefaultLdapConnectionFactory.java:64)
	at org.apache.directory.ldap.client.api.DefaultLdapConnectionFactory.newLdapConnection(DefaultLdapConnectionFactory.java:107)
	at org.apache.directory.ldap.client.api.ValidatingPoolableLdapConnectionFactory.makeObject(ValidatingPoolableLdapConnectionFactory.java:134)
	at org.apache.directory.ldap.client.api.ValidatingPoolableLdapConnectionFactory.makeObject(ValidatingPoolableLdapConnectionFactory.java:59)
	at org.apache.commons.pool.impl.GenericObjectPool.borrowObject(GenericObjectPool.java:1188)
	at org.apache.directory.ldap.client.api.LdapConnectionPool.getConnection(LdapConnectionPool.java:123)
	at org.apache.directory.fortress.core.ldap.LdapConnectionProvider.getLogConnection(LdapConnectionProvider.java:339)
	... 26 more
NUMBER OF ADDS: 1006
NUMBER OF BINDS: 1131
NUMBER OF DELETES: 0
NUMBER OF MODS: 4112
NUMBER OF READS: 19618
NUMBER OF SEARCHES: 7026
Tests run: 132, Failures: 5, Errors: 0, Skipped: 0, Time elapsed: 216.009 sec <<< FAILURE! - in org.apache.directory.fortress.core.impl.FortressJUnitTest
testSearchBinds(org.apache.directory.fortress.core.impl.AuditMgrImplTest)  Time elapsed: 0.079 sec  <<< FAILURE!
junit.framework.AssertionFailedError: LdapException in AuditDAO.searchBinds id=org.apache.directory.api.ldap.model.exception.LdapException: org.apache.directory.api.ldap.model.exception.LdapInvalidDnException: ERR_04202 A value is missing on some RDN
	at junit.framework.Assert.fail(Assert.java:57)
	at junit.framework.TestCase.fail(TestCase.java:227)
	at org.apache.directory.fortress.core.impl.AuditMgrImplTest.searchBinds(AuditMgrImplTest.java:444)
	at org.apache.directory.fortress.core.impl.AuditMgrImplTest.testSearchBinds(AuditMgrImplTest.java:399)

testGetAuthZs(org.apache.directory.fortress.core.impl.AuditMgrImplTest)  Time elapsed: 0.006 sec  <<< FAILURE!
junit.framework.AssertionFailedError: LdapException in AuditDAO.getAllAuthZs id=org.apache.directory.api.ldap.model.exception.LdapException: org.apache.directory.api.ldap.model.exception.LdapInvalidDnException: ERR_04202 A value is missing on some RDN
	at junit.framework.Assert.fail(Assert.java:57)
	at junit.framework.TestCase.fail(TestCase.java:227)
	at org.apache.directory.fortress.core.impl.AuditMgrImplTest.getAuthZs(AuditMgrImplTest.java:355)
	at org.apache.directory.fortress.core.impl.AuditMgrImplTest.testGetAuthZs(AuditMgrImplTest.java:311)

testSearchAuthZs(org.apache.directory.fortress.core.impl.AuditMgrImplTest)  Time elapsed: 0.007 sec  <<< FAILURE!
junit.framework.AssertionFailedError: LdapException in AuditDAO.searchAuthZs id=org.apache.directory.api.ldap.model.exception.LdapException: org.apache.directory.api.ldap.model.exception.LdapInvalidDnException: ERR_04202 A value is missing on some RDN
	at junit.framework.Assert.fail(Assert.java:57)
	at junit.framework.TestCase.fail(TestCase.java:227)
	at org.apache.directory.fortress.core.impl.AuditMgrImplTest.searchAuthZs(AuditMgrImplTest.java:301)
	at org.apache.directory.fortress.core.impl.AuditMgrImplTest.testSearchAuthZs(AuditMgrImplTest.java:248)

testSearchMods(org.apache.directory.fortress.core.impl.AuditMgrImplTest)  Time elapsed: 0.006 sec  <<< FAILURE!
junit.framework.AssertionFailedError: searchUserMods caught LdapException id=org.apache.directory.api.ldap.model.exception.LdapException: org.apache.directory.api.ldap.model.exception.LdapInvalidDnException: ERR_04202 A value is missing on some RDN
	at junit.framework.Assert.fail(Assert.java:57)
	at junit.framework.TestCase.fail(TestCase.java:227)
	at org.apache.directory.fortress.core.impl.AuditMgrImplTest.searchMods(AuditMgrImplTest.java:241)
	at org.apache.directory.fortress.core.impl.AuditMgrImplTest.testSearchMods(AuditMgrImplTest.java:205)

testSearchAdminMods(org.apache.directory.fortress.core.impl.AuditMgrImplTest)  Time elapsed: 0.007 sec  <<< FAILURE!
junit.framework.AssertionFailedError: searchAdminMods caught LdapException id=org.apache.directory.api.ldap.model.exception.LdapException: org.apache.directory.api.ldap.model.exception.LdapInvalidDnException: ERR_04202 A value is missing on some RDN
	at junit.framework.Assert.fail(Assert.java:57)
	at junit.framework.TestCase.fail(TestCase.java:227)
	at org.apache.directory.fortress.core.impl.AuditMgrImplTest.searchAdminMods(AuditMgrImplTest.java:195)
	at org.apache.directory.fortress.core.impl.AuditMgrImplTest.testSearchAdminMods(AuditMgrImplTest.java:94)


Results :

Failed tests: 
  AuditMgrImplTest.testGetAuthZs:311->getAuthZs:355 LdapException in AuditDAO.getAllAuthZs id=org.apache.directory.api.ldap.model.exception.LdapException: org.apache.directory.api.ldap.model.exception.LdapInvalidDnException: ERR_04202 A value is missing on some RDN
  AuditMgrImplTest.testSearchAdminMods:94->searchAdminMods:195 searchAdminMods caught LdapException id=org.apache.directory.api.ldap.model.exception.LdapException: org.apache.directory.api.ldap.model.exception.LdapInvalidDnException: ERR_04202 A value is missing on some RDN
  AuditMgrImplTest.testSearchAuthZs:248->searchAuthZs:301 LdapException in AuditDAO.searchAuthZs id=org.apache.directory.api.ldap.model.exception.LdapException: org.apache.directory.api.ldap.model.exception.LdapInvalidDnException: ERR_04202 A value is missing on some RDN
  AuditMgrImplTest.testSearchBinds:399->searchBinds:444 LdapException in AuditDAO.searchBinds id=org.apache.directory.api.ldap.model.exception.LdapException: org.apache.directory.api.ldap.model.exception.LdapInvalidDnException: ERR_04202 A value is missing on some RDN
  AuditMgrImplTest.testSearchMods:205->searchMods:241 searchUserMods caught LdapException id=org.apache.directory.api.ldap.model.exception.LdapException: org.apache.directory.api.ldap.model.exception.LdapInvalidDnException: ERR_04202 A value is missing on some RDN

Tests run: 132, Failures: 5, Errors: 0, Skipped: 0

[INFO] ------------------------------------------------------------------------
[INFO] BUILD FAILURE
[INFO] ------------------------------------------------------------------------
[INFO] Total time: 03:45 min
[INFO] Finished at: 2018-08-27T20:44:17+00:00
[INFO] Final Memory: 21M/329M
[INFO] ------------------------------------------------------------------------
[ERROR] Failed to execute goal org.apache.maven.plugins:maven-surefire-plugin:2.18.1:test (default-test) on project fortress-core: There are test failures.
[ERROR] 
[ERROR] Please refer to <https://builds.apache.org/job/dir-fortress-core-docker-openldap-test/ws/target/surefire-reports> for the individual test results.
[ERROR] -> [Help 1]
[ERROR] 
[ERROR] To see the full stack trace of the errors, re-run Maven with the -e switch.
[ERROR] Re-run Maven using the -X switch to enable full debug logging.
[ERROR] 
[ERROR] For more information about the errors and possible solutions, please read the following articles:
[ERROR] [Help 1] http://cwiki.apache.org/confluence/display/MAVEN/MojoFailureException
Build step 'Invoke top-level Maven targets' marked build as failure
[dir-fortress-core-docker-openldap-test] $ /bin/bash /tmp/jenkins797923708280171744.sh
dir-fortress-core-docker-openldap-test
dir-fortress-core-docker-openldap-test
CONTAINER ID        IMAGE                            COMMAND                  CREATED             STATUS              PORTS               NAMES
0f6e1121da6d        madlib/postgres_9.6:jenkins      "docker-entrypoint..."   2 hours ago         Up 2 hours          5432/tcp            madlib
5d275a02af17        mesos/mesos-build:ubuntu-16.04   "./entrypoint.sh"        3 hours ago         Up 3 hours                              jolly_engelbart

Build failed in Jenkins: dir-fortress-core-docker-openldap-test #540

Posted by Apache Jenkins Server <je...@builds.apache.org>.
See <https://builds.apache.org/job/dir-fortress-core-docker-openldap-test/540/display/redirect?page=changes>

Changes:

[smckinney] fix openldap config for docker

------------------------------------------
[...truncated 1.88 MB...]
	at junit.framework.TestResult$1.protect(TestResult.java:122)
	at junit.framework.TestResult.runProtected(TestResult.java:142)
	at junit.framework.TestResult.run(TestResult.java:125)
	at junit.framework.TestCase.run(TestCase.java:129)
	at junit.framework.TestSuite.runTest(TestSuite.java:252)
	at junit.framework.TestSuite.run(TestSuite.java:247)
	at org.junit.internal.runners.JUnit38ClassRunner.run(JUnit38ClassRunner.java:86)
	at org.apache.maven.surefire.junit4.JUnit4Provider.execute(JUnit4Provider.java:283)
	at org.apache.maven.surefire.junit4.JUnit4Provider.executeWithRerun(JUnit4Provider.java:173)
	at org.apache.maven.surefire.junit4.JUnit4Provider.executeTestSet(JUnit4Provider.java:153)
	at org.apache.maven.surefire.junit4.JUnit4Provider.invoke(JUnit4Provider.java:128)
	at org.apache.maven.surefire.booter.ForkedBooter.invokeProviderInSameClassLoader(ForkedBooter.java:203)
	at org.apache.maven.surefire.booter.ForkedBooter.runSuitesInProcess(ForkedBooter.java:155)
	at org.apache.maven.surefire.booter.ForkedBooter.main(ForkedBooter.java:103)
Caused by: org.apache.directory.api.ldap.model.exception.LdapException: org.apache.directory.api.ldap.model.exception.LdapInvalidDnException: ERR_04202 A value is missing on some RDN
	at org.apache.directory.fortress.core.ldap.LdapConnectionProvider.getLogConnection(LdapConnectionProvider.java:343)
	at org.apache.directory.fortress.core.ldap.LdapDataProvider.getLogConnection(LdapDataProvider.java:1261)
	at org.apache.directory.fortress.core.impl.AuditDAO.getAllAuthZs(AuditDAO.java:436)
	... 24 more
Caused by: org.apache.directory.api.ldap.model.exception.LdapInvalidDnException: ERR_04202 A value is missing on some RDN
	at org.apache.directory.api.ldap.model.name.Dn.<init>(Dn.java:285)
	at org.apache.directory.ldap.client.api.AbstractLdapConnection.bind(AbstractLdapConnection.java:114)
	at org.apache.directory.ldap.client.api.DefaultLdapConnectionFactory.bindConnection(DefaultLdapConnectionFactory.java:64)
	at org.apache.directory.ldap.client.api.DefaultLdapConnectionFactory.newLdapConnection(DefaultLdapConnectionFactory.java:107)
	at org.apache.directory.ldap.client.api.ValidatingPoolableLdapConnectionFactory.makeObject(ValidatingPoolableLdapConnectionFactory.java:134)
	at org.apache.directory.ldap.client.api.ValidatingPoolableLdapConnectionFactory.makeObject(ValidatingPoolableLdapConnectionFactory.java:59)
	at org.apache.commons.pool.impl.GenericObjectPool.borrowObject(GenericObjectPool.java:1188)
	at org.apache.directory.ldap.client.api.LdapConnectionPool.getConnection(LdapConnectionPool.java:123)
	at org.apache.directory.fortress.core.ldap.LdapConnectionProvider.getLogConnection(LdapConnectionProvider.java:339)
	... 26 more
2018-08-27 20:03:049 INFO  LogUtil:64 - GET-AUTHZ TU1_UPD
2018-08-27 20:03:049 ERROR DefaultLdapConnectionFactory:68 - unable to bind connection: ERR_04202 A value is missing on some RDN
2018-08-27 20:03:049 ERROR AuditMgrImplTest:298 - searchAuthZs: failed with SecurityException rc=7002, msg=LdapException in AuditDAO.searchAuthZs id=org.apache.directory.api.ldap.model.exception.LdapException: org.apache.directory.api.ldap.model.exception.LdapInvalidDnException: ERR_04202 A value is missing on some RDN
org.apache.directory.fortress.core.FinderException: LdapException in AuditDAO.searchAuthZs id=org.apache.directory.api.ldap.model.exception.LdapException: org.apache.directory.api.ldap.model.exception.LdapInvalidDnException: ERR_04202 A value is missing on some RDN
	at org.apache.directory.fortress.core.impl.AuditDAO.searchAuthZs(AuditDAO.java:359)
	at org.apache.directory.fortress.core.impl.AuditP.searchAuthZs(AuditP.java:82)
	at org.apache.directory.fortress.core.impl.AuditMgrImpl.searchAuthZs(AuditMgrImpl.java:141)
	at org.apache.directory.fortress.core.impl.AuditMgrImplTest.searchAuthZs(AuditMgrImplTest.java:286)
	at org.apache.directory.fortress.core.impl.AuditMgrImplTest.testSearchAuthZs(AuditMgrImplTest.java:248)
	at sun.reflect.NativeMethodAccessorImpl.invoke0(Native Method)
	at sun.reflect.NativeMethodAccessorImpl.invoke(NativeMethodAccessorImpl.java:62)
	at sun.reflect.DelegatingMethodAccessorImpl.invoke(DelegatingMethodAccessorImpl.java:43)
	at java.lang.reflect.Method.invoke(Method.java:498)
	at junit.framework.TestCase.runTest(TestCase.java:176)
	at junit.framework.TestCase.runBare(TestCase.java:141)
	at junit.framework.TestResult$1.protect(TestResult.java:122)
	at junit.framework.TestResult.runProtected(TestResult.java:142)
	at junit.framework.TestResult.run(TestResult.java:125)
	at junit.framework.TestCase.run(TestCase.java:129)
	at junit.framework.TestSuite.runTest(TestSuite.java:252)
	at junit.framework.TestSuite.run(TestSuite.java:247)
	at org.junit.internal.runners.JUnit38ClassRunner.run(JUnit38ClassRunner.java:86)
	at org.apache.maven.surefire.junit4.JUnit4Provider.execute(JUnit4Provider.java:283)
	at org.apache.maven.surefire.junit4.JUnit4Provider.executeWithRerun(JUnit4Provider.java:173)
	at org.apache.maven.surefire.junit4.JUnit4Provider.executeTestSet(JUnit4Provider.java:153)
	at org.apache.maven.surefire.junit4.JUnit4Provider.invoke(JUnit4Provider.java:128)
	at org.apache.maven.surefire.booter.ForkedBooter.invokeProviderInSameClassLoader(ForkedBooter.java:203)
	at org.apache.maven.surefire.booter.ForkedBooter.runSuitesInProcess(ForkedBooter.java:155)
	at org.apache.maven.surefire.booter.ForkedBooter.main(ForkedBooter.java:103)
Caused by: org.apache.directory.api.ldap.model.exception.LdapException: org.apache.directory.api.ldap.model.exception.LdapInvalidDnException: ERR_04202 A value is missing on some RDN
	at org.apache.directory.fortress.core.ldap.LdapConnectionProvider.getLogConnection(LdapConnectionProvider.java:343)
	at org.apache.directory.fortress.core.ldap.LdapDataProvider.getLogConnection(LdapDataProvider.java:1261)
	at org.apache.directory.fortress.core.impl.AuditDAO.searchAuthZs(AuditDAO.java:346)
	... 24 more
Caused by: org.apache.directory.api.ldap.model.exception.LdapInvalidDnException: ERR_04202 A value is missing on some RDN
	at org.apache.directory.api.ldap.model.name.Dn.<init>(Dn.java:285)
	at org.apache.directory.ldap.client.api.AbstractLdapConnection.bind(AbstractLdapConnection.java:114)
	at org.apache.directory.ldap.client.api.DefaultLdapConnectionFactory.bindConnection(DefaultLdapConnectionFactory.java:64)
	at org.apache.directory.ldap.client.api.DefaultLdapConnectionFactory.newLdapConnection(DefaultLdapConnectionFactory.java:107)
	at org.apache.directory.ldap.client.api.ValidatingPoolableLdapConnectionFactory.makeObject(ValidatingPoolableLdapConnectionFactory.java:134)
	at org.apache.directory.ldap.client.api.ValidatingPoolableLdapConnectionFactory.makeObject(ValidatingPoolableLdapConnectionFactory.java:59)
	at org.apache.commons.pool.impl.GenericObjectPool.borrowObject(GenericObjectPool.java:1188)
	at org.apache.directory.ldap.client.api.LdapConnectionPool.getConnection(LdapConnectionPool.java:123)
	at org.apache.directory.fortress.core.ldap.LdapConnectionProvider.getLogConnection(LdapConnectionProvider.java:339)
	... 26 more
2018-08-27 20:03:049 INFO  LogUtil:64 - SESS-USRS TU1_UPD
2018-08-27 20:03:049 ERROR DefaultLdapConnectionFactory:68 - unable to bind connection: ERR_04202 A value is missing on some RDN
2018-08-27 20:03:049 ERROR AuditMgrImplTest:239 - searchUserSessions: failed with SecurityException rc=7003, msg=searchUserMods caught LdapException id=org.apache.directory.api.ldap.model.exception.LdapException: org.apache.directory.api.ldap.model.exception.LdapInvalidDnException: ERR_04202 A value is missing on some RDN
org.apache.directory.fortress.core.FinderException: searchUserMods caught LdapException id=org.apache.directory.api.ldap.model.exception.LdapException: org.apache.directory.api.ldap.model.exception.LdapInvalidDnException: ERR_04202 A value is missing on some RDN
	at org.apache.directory.fortress.core.impl.AuditDAO.searchUserMods(AuditDAO.java:588)
	at org.apache.directory.fortress.core.impl.AuditP.searchUserMods(AuditP.java:110)
	at org.apache.directory.fortress.core.impl.AuditMgrImpl.searchUserSessions(AuditMgrImpl.java:170)
	at org.apache.directory.fortress.core.impl.AuditMgrImplTest.searchMods(AuditMgrImplTest.java:229)
	at org.apache.directory.fortress.core.impl.AuditMgrImplTest.testSearchMods(AuditMgrImplTest.java:205)
	at sun.reflect.NativeMethodAccessorImpl.invoke0(Native Method)
	at sun.reflect.NativeMethodAccessorImpl.invoke(NativeMethodAccessorImpl.java:62)
	at sun.reflect.DelegatingMethodAccessorImpl.invoke(DelegatingMethodAccessorImpl.java:43)
	at java.lang.reflect.Method.invoke(Method.java:498)
	at junit.framework.TestCase.runTest(TestCase.java:176)
	at junit.framework.TestCase.runBare(TestCase.java:141)
	at junit.framework.TestResult$1.protect(TestResult.java:122)
	at junit.framework.TestResult.runProtected(TestResult.java:142)
	at junit.framework.TestResult.run(TestResult.java:125)
	at junit.framework.TestCase.run(TestCase.java:129)
	at junit.framework.TestSuite.runTest(TestSuite.java:252)
	at junit.framework.TestSuite.run(TestSuite.java:247)
	at org.junit.internal.runners.JUnit38ClassRunner.run(JUnit38ClassRunner.java:86)
	at org.apache.maven.surefire.junit4.JUnit4Provider.execute(JUnit4Provider.java:283)
	at org.apache.maven.surefire.junit4.JUnit4Provider.executeWithRerun(JUnit4Provider.java:173)
	at org.apache.maven.surefire.junit4.JUnit4Provider.executeTestSet(JUnit4Provider.java:153)
	at org.apache.maven.surefire.junit4.JUnit4Provider.invoke(JUnit4Provider.java:128)
	at org.apache.maven.surefire.booter.ForkedBooter.invokeProviderInSameClassLoader(ForkedBooter.java:203)
	at org.apache.maven.surefire.booter.ForkedBooter.runSuitesInProcess(ForkedBooter.java:155)
	at org.apache.maven.surefire.booter.ForkedBooter.main(ForkedBooter.java:103)
Caused by: org.apache.directory.api.ldap.model.exception.LdapException: org.apache.directory.api.ldap.model.exception.LdapInvalidDnException: ERR_04202 A value is missing on some RDN
	at org.apache.directory.fortress.core.ldap.LdapConnectionProvider.getLogConnection(LdapConnectionProvider.java:343)
	at org.apache.directory.fortress.core.ldap.LdapDataProvider.getLogConnection(LdapDataProvider.java:1261)
	at org.apache.directory.fortress.core.impl.AuditDAO.searchUserMods(AuditDAO.java:575)
	... 24 more
Caused by: org.apache.directory.api.ldap.model.exception.LdapInvalidDnException: ERR_04202 A value is missing on some RDN
	at org.apache.directory.api.ldap.model.name.Dn.<init>(Dn.java:285)
	at org.apache.directory.ldap.client.api.AbstractLdapConnection.bind(AbstractLdapConnection.java:114)
	at org.apache.directory.ldap.client.api.DefaultLdapConnectionFactory.bindConnection(DefaultLdapConnectionFactory.java:64)
	at org.apache.directory.ldap.client.api.DefaultLdapConnectionFactory.newLdapConnection(DefaultLdapConnectionFactory.java:107)
	at org.apache.directory.ldap.client.api.ValidatingPoolableLdapConnectionFactory.makeObject(ValidatingPoolableLdapConnectionFactory.java:134)
	at org.apache.directory.ldap.client.api.ValidatingPoolableLdapConnectionFactory.makeObject(ValidatingPoolableLdapConnectionFactory.java:59)
	at org.apache.commons.pool.impl.GenericObjectPool.borrowObject(GenericObjectPool.java:1188)
	at org.apache.directory.ldap.client.api.LdapConnectionPool.getConnection(LdapConnectionPool.java:123)
	at org.apache.directory.fortress.core.ldap.LdapConnectionProvider.getLogConnection(LdapConnectionProvider.java:339)
	... 26 more
2018-08-27 20:03:049 INFO  LogUtil:64 - SESS-USRS RBAC TU0
2018-08-27 20:03:049 ERROR DefaultLdapConnectionFactory:68 - unable to bind connection: ERR_04202 A value is missing on some RDN
2018-08-27 20:03:049 ERROR AuditMgrImplTest:192 - searchAdminMods: failed with SecurityException rc=7004, msg=searchAdminMods caught LdapException id=org.apache.directory.api.ldap.model.exception.LdapException: org.apache.directory.api.ldap.model.exception.LdapInvalidDnException: ERR_04202 A value is missing on some RDN
org.apache.directory.fortress.core.FinderException: searchAdminMods caught LdapException id=org.apache.directory.api.ldap.model.exception.LdapException: org.apache.directory.api.ldap.model.exception.LdapInvalidDnException: ERR_04202 A value is missing on some RDN
	at org.apache.directory.fortress.core.impl.AuditDAO.searchAdminMods(AuditDAO.java:678)
	at org.apache.directory.fortress.core.impl.AuditP.searchAdminMods(AuditP.java:125)
	at org.apache.directory.fortress.core.impl.AuditMgrImpl.searchAdminMods(AuditMgrImpl.java:190)
	at org.apache.directory.fortress.core.impl.AuditMgrImplTest.searchAdminMods(AuditMgrImplTest.java:173)
	at org.apache.directory.fortress.core.impl.AuditMgrImplTest.testSearchAdminMods(AuditMgrImplTest.java:94)
	at sun.reflect.NativeMethodAccessorImpl.invoke0(Native Method)
	at sun.reflect.NativeMethodAccessorImpl.invoke(NativeMethodAccessorImpl.java:62)
	at sun.reflect.DelegatingMethodAccessorImpl.invoke(DelegatingMethodAccessorImpl.java:43)
	at java.lang.reflect.Method.invoke(Method.java:498)
	at junit.framework.TestCase.runTest(TestCase.java:176)
	at junit.framework.TestCase.runBare(TestCase.java:141)
	at junit.framework.TestResult$1.protect(TestResult.java:122)
	at junit.framework.TestResult.runProtected(TestResult.java:142)
	at junit.framework.TestResult.run(TestResult.java:125)
	at junit.framework.TestCase.run(TestCase.java:129)
	at junit.framework.TestSuite.runTest(TestSuite.java:252)
	at junit.framework.TestSuite.run(TestSuite.java:247)
	at org.junit.internal.runners.JUnit38ClassRunner.run(JUnit38ClassRunner.java:86)
	at org.apache.maven.surefire.junit4.JUnit4Provider.execute(JUnit4Provider.java:283)
	at org.apache.maven.surefire.junit4.JUnit4Provider.executeWithRerun(JUnit4Provider.java:173)
	at org.apache.maven.surefire.junit4.JUnit4Provider.executeTestSet(JUnit4Provider.java:153)
	at org.apache.maven.surefire.junit4.JUnit4Provider.invoke(JUnit4Provider.java:128)
	at org.apache.maven.surefire.booter.ForkedBooter.invokeProviderInSameClassLoader(ForkedBooter.java:203)
	at org.apache.maven.surefire.booter.ForkedBooter.runSuitesInProcess(ForkedBooter.java:155)
	at org.apache.maven.surefire.booter.ForkedBooter.main(ForkedBooter.java:103)
Caused by: org.apache.directory.api.ldap.model.exception.LdapException: org.apache.directory.api.ldap.model.exception.LdapInvalidDnException: ERR_04202 A value is missing on some RDN
	at org.apache.directory.fortress.core.ldap.LdapConnectionProvider.getLogConnection(LdapConnectionProvider.java:343)
	at org.apache.directory.fortress.core.ldap.LdapDataProvider.getLogConnection(LdapDataProvider.java:1261)
	at org.apache.directory.fortress.core.impl.AuditDAO.searchAdminMods(AuditDAO.java:665)
	... 24 more
Caused by: org.apache.directory.api.ldap.model.exception.LdapInvalidDnException: ERR_04202 A value is missing on some RDN
	at org.apache.directory.api.ldap.model.name.Dn.<init>(Dn.java:285)
	at org.apache.directory.ldap.client.api.AbstractLdapConnection.bind(AbstractLdapConnection.java:114)
	at org.apache.directory.ldap.client.api.DefaultLdapConnectionFactory.bindConnection(DefaultLdapConnectionFactory.java:64)
	at org.apache.directory.ldap.client.api.DefaultLdapConnectionFactory.newLdapConnection(DefaultLdapConnectionFactory.java:107)
	at org.apache.directory.ldap.client.api.ValidatingPoolableLdapConnectionFactory.makeObject(ValidatingPoolableLdapConnectionFactory.java:134)
	at org.apache.directory.ldap.client.api.ValidatingPoolableLdapConnectionFactory.makeObject(ValidatingPoolableLdapConnectionFactory.java:59)
	at org.apache.commons.pool.impl.GenericObjectPool.borrowObject(GenericObjectPool.java:1188)
	at org.apache.directory.ldap.client.api.LdapConnectionPool.getConnection(LdapConnectionPool.java:123)
	at org.apache.directory.fortress.core.ldap.LdapConnectionProvider.getLogConnection(LdapConnectionProvider.java:339)
	... 26 more
NUMBER OF ADDS: 1006
NUMBER OF BINDS: 1131
NUMBER OF DELETES: 0
NUMBER OF MODS: 4112
NUMBER OF READS: 19587
NUMBER OF SEARCHES: 7014
Tests run: 132, Failures: 6, Errors: 0, Skipped: 0, Time elapsed: 213.923 sec <<< FAILURE! - in org.apache.directory.fortress.core.impl.FortressJUnitTest
testAbacConstraintsRole(org.apache.directory.fortress.core.impl.AccessMgrImplTest)  Time elapsed: 0.034 sec  <<< FAILURE!
junit.framework.AssertionFailedError: org.apache.directory.fortress.core.impl.AccessMgrImplTest.createSessionsConstraints washers cannot contain tellers, user: curly, constraint value: north
	at junit.framework.Assert.fail(Assert.java:57)
	at junit.framework.TestCase.fail(TestCase.java:227)
	at org.apache.directory.fortress.core.impl.AccessMgrImplTest.createSessionsConstraints(AccessMgrImplTest.java:1384)
	at org.apache.directory.fortress.core.impl.AccessMgrImplTest.testAbacConstraintsRole(AccessMgrImplTest.java:1297)

testSearchBinds(org.apache.directory.fortress.core.impl.AuditMgrImplTest)  Time elapsed: 0.061 sec  <<< FAILURE!
junit.framework.AssertionFailedError: LdapException in AuditDAO.searchBinds id=org.apache.directory.api.ldap.model.exception.LdapException: org.apache.directory.api.ldap.model.exception.LdapInvalidDnException: ERR_04202 A value is missing on some RDN
	at junit.framework.Assert.fail(Assert.java:57)
	at junit.framework.TestCase.fail(TestCase.java:227)
	at org.apache.directory.fortress.core.impl.AuditMgrImplTest.searchBinds(AuditMgrImplTest.java:444)
	at org.apache.directory.fortress.core.impl.AuditMgrImplTest.testSearchBinds(AuditMgrImplTest.java:399)

testGetAuthZs(org.apache.directory.fortress.core.impl.AuditMgrImplTest)  Time elapsed: 0.005 sec  <<< FAILURE!
junit.framework.AssertionFailedError: LdapException in AuditDAO.getAllAuthZs id=org.apache.directory.api.ldap.model.exception.LdapException: org.apache.directory.api.ldap.model.exception.LdapInvalidDnException: ERR_04202 A value is missing on some RDN
	at junit.framework.Assert.fail(Assert.java:57)
	at junit.framework.TestCase.fail(TestCase.java:227)
	at org.apache.directory.fortress.core.impl.AuditMgrImplTest.getAuthZs(AuditMgrImplTest.java:355)
	at org.apache.directory.fortress.core.impl.AuditMgrImplTest.testGetAuthZs(AuditMgrImplTest.java:311)

testSearchAuthZs(org.apache.directory.fortress.core.impl.AuditMgrImplTest)  Time elapsed: 0.005 sec  <<< FAILURE!
junit.framework.AssertionFailedError: LdapException in AuditDAO.searchAuthZs id=org.apache.directory.api.ldap.model.exception.LdapException: org.apache.directory.api.ldap.model.exception.LdapInvalidDnException: ERR_04202 A value is missing on some RDN
	at junit.framework.Assert.fail(Assert.java:57)
	at junit.framework.TestCase.fail(TestCase.java:227)
	at org.apache.directory.fortress.core.impl.AuditMgrImplTest.searchAuthZs(AuditMgrImplTest.java:301)
	at org.apache.directory.fortress.core.impl.AuditMgrImplTest.testSearchAuthZs(AuditMgrImplTest.java:248)

testSearchMods(org.apache.directory.fortress.core.impl.AuditMgrImplTest)  Time elapsed: 0.006 sec  <<< FAILURE!
junit.framework.AssertionFailedError: searchUserMods caught LdapException id=org.apache.directory.api.ldap.model.exception.LdapException: org.apache.directory.api.ldap.model.exception.LdapInvalidDnException: ERR_04202 A value is missing on some RDN
	at junit.framework.Assert.fail(Assert.java:57)
	at junit.framework.TestCase.fail(TestCase.java:227)
	at org.apache.directory.fortress.core.impl.AuditMgrImplTest.searchMods(AuditMgrImplTest.java:241)
	at org.apache.directory.fortress.core.impl.AuditMgrImplTest.testSearchMods(AuditMgrImplTest.java:205)

testSearchAdminMods(org.apache.directory.fortress.core.impl.AuditMgrImplTest)  Time elapsed: 0.008 sec  <<< FAILURE!
junit.framework.AssertionFailedError: searchAdminMods caught LdapException id=org.apache.directory.api.ldap.model.exception.LdapException: org.apache.directory.api.ldap.model.exception.LdapInvalidDnException: ERR_04202 A value is missing on some RDN
	at junit.framework.Assert.fail(Assert.java:57)
	at junit.framework.TestCase.fail(TestCase.java:227)
	at org.apache.directory.fortress.core.impl.AuditMgrImplTest.searchAdminMods(AuditMgrImplTest.java:195)
	at org.apache.directory.fortress.core.impl.AuditMgrImplTest.testSearchAdminMods(AuditMgrImplTest.java:94)


Results :

Failed tests: 
  AccessMgrImplTest.testAbacConstraintsRole:1297->createSessionsConstraints:1384 org.apache.directory.fortress.core.impl.AccessMgrImplTest.createSessionsConstraints washers cannot contain tellers, user: curly, constraint value: north
  AuditMgrImplTest.testGetAuthZs:311->getAuthZs:355 LdapException in AuditDAO.getAllAuthZs id=org.apache.directory.api.ldap.model.exception.LdapException: org.apache.directory.api.ldap.model.exception.LdapInvalidDnException: ERR_04202 A value is missing on some RDN
  AuditMgrImplTest.testSearchAdminMods:94->searchAdminMods:195 searchAdminMods caught LdapException id=org.apache.directory.api.ldap.model.exception.LdapException: org.apache.directory.api.ldap.model.exception.LdapInvalidDnException: ERR_04202 A value is missing on some RDN
  AuditMgrImplTest.testSearchAuthZs:248->searchAuthZs:301 LdapException in AuditDAO.searchAuthZs id=org.apache.directory.api.ldap.model.exception.LdapException: org.apache.directory.api.ldap.model.exception.LdapInvalidDnException: ERR_04202 A value is missing on some RDN
  AuditMgrImplTest.testSearchBinds:399->searchBinds:444 LdapException in AuditDAO.searchBinds id=org.apache.directory.api.ldap.model.exception.LdapException: org.apache.directory.api.ldap.model.exception.LdapInvalidDnException: ERR_04202 A value is missing on some RDN
  AuditMgrImplTest.testSearchMods:205->searchMods:241 searchUserMods caught LdapException id=org.apache.directory.api.ldap.model.exception.LdapException: org.apache.directory.api.ldap.model.exception.LdapInvalidDnException: ERR_04202 A value is missing on some RDN

Tests run: 132, Failures: 6, Errors: 0, Skipped: 0

[INFO] ------------------------------------------------------------------------
[INFO] BUILD FAILURE
[INFO] ------------------------------------------------------------------------
[INFO] Total time: 03:44 min
[INFO] Finished at: 2018-08-27T20:03:50+00:00
[INFO] Final Memory: 23M/332M
[INFO] ------------------------------------------------------------------------
[ERROR] Failed to execute goal org.apache.maven.plugins:maven-surefire-plugin:2.18.1:test (default-test) on project fortress-core: There are test failures.
[ERROR] 
[ERROR] Please refer to <https://builds.apache.org/job/dir-fortress-core-docker-openldap-test/ws/target/surefire-reports> for the individual test results.
[ERROR] -> [Help 1]
[ERROR] 
[ERROR] To see the full stack trace of the errors, re-run Maven with the -e switch.
[ERROR] Re-run Maven using the -X switch to enable full debug logging.
[ERROR] 
[ERROR] For more information about the errors and possible solutions, please read the following articles:
[ERROR] [Help 1] http://cwiki.apache.org/confluence/display/MAVEN/MojoFailureException
Build step 'Invoke top-level Maven targets' marked build as failure
[dir-fortress-core-docker-openldap-test] $ /bin/bash /tmp/jenkins8571659439721937972.sh
dir-fortress-core-docker-openldap-test
dir-fortress-core-docker-openldap-test
CONTAINER ID        IMAGE               COMMAND             CREATED             STATUS              PORTS               NAMES

Build failed in Jenkins: dir-fortress-core-docker-openldap-test #539

Posted by Apache Jenkins Server <je...@builds.apache.org>.
See <https://builds.apache.org/job/dir-fortress-core-docker-openldap-test/539/display/redirect?page=changes>

Changes:

[smckinney] remove echo

------------------------------------------
[...truncated 221.26 KB...]
	at org.apache.directory.fortress.core.impl.AuditMgrImpl.searchBinds(AuditMgrImpl.java:156)
	at org.apache.directory.fortress.core.impl.AuditMgrImplTest.searchBinds(AuditMgrImplTest.java:424)
	at org.apache.directory.fortress.core.impl.AuditMgrImplTest.testSearchBinds(AuditMgrImplTest.java:399)
	at sun.reflect.NativeMethodAccessorImpl.invoke0(Native Method)
	at sun.reflect.NativeMethodAccessorImpl.invoke(NativeMethodAccessorImpl.java:62)
	at sun.reflect.DelegatingMethodAccessorImpl.invoke(DelegatingMethodAccessorImpl.java:43)
	at java.lang.reflect.Method.invoke(Method.java:498)
	at junit.framework.TestCase.runTest(TestCase.java:176)
	at junit.framework.TestCase.runBare(TestCase.java:141)
	at junit.framework.TestResult$1.protect(TestResult.java:122)
	at junit.framework.TestResult.runProtected(TestResult.java:142)
	at junit.framework.TestResult.run(TestResult.java:125)
	at junit.framework.TestCase.run(TestCase.java:129)
	at junit.framework.TestSuite.runTest(TestSuite.java:252)
	at junit.framework.TestSuite.run(TestSuite.java:247)
	at org.junit.internal.runners.JUnit38ClassRunner.run(JUnit38ClassRunner.java:86)
	at org.apache.maven.surefire.junit4.JUnit4Provider.execute(JUnit4Provider.java:283)
	at org.apache.maven.surefire.junit4.JUnit4Provider.executeWithRerun(JUnit4Provider.java:173)
	at org.apache.maven.surefire.junit4.JUnit4Provider.executeTestSet(JUnit4Provider.java:153)
	at org.apache.maven.surefire.junit4.JUnit4Provider.invoke(JUnit4Provider.java:128)
	at org.apache.maven.surefire.booter.ForkedBooter.invokeProviderInSameClassLoader(ForkedBooter.java:203)
	at org.apache.maven.surefire.booter.ForkedBooter.runSuitesInProcess(ForkedBooter.java:155)
	at org.apache.maven.surefire.booter.ForkedBooter.main(ForkedBooter.java:103)
Caused by: org.apache.directory.api.ldap.model.exception.LdapInvalidDnException: ERR_04202 A value is missing on some RDN
	at org.apache.directory.api.ldap.model.name.Dn.<init>(Dn.java:285)
	at org.apache.directory.api.ldap.model.name.Dn.<init>(Dn.java:217)
	at org.apache.directory.fortress.core.ldap.LdapDataProvider.search(LdapDataProvider.java:571)
	at org.apache.directory.fortress.core.impl.AuditDAO.searchBinds(AuditDAO.java:520)
	... 24 more
2018-08-27 18:21:035 INFO  LogUtil:64 - GET-AUTHZ TU1_UPD
2018-08-27 18:21:035 ERROR AuditMgrImplTest:352 - getUserAuthZs: failed with SecurityException rc=7002, msg=LdapException in AuditDAO.getAllAuthZs id=org.apache.directory.api.ldap.model.exception.LdapInvalidDnException: ERR_04202 A value is missing on some RDN
org.apache.directory.fortress.core.FinderException: LdapException in AuditDAO.getAllAuthZs id=org.apache.directory.api.ldap.model.exception.LdapInvalidDnException: ERR_04202 A value is missing on some RDN
	at org.apache.directory.fortress.core.impl.AuditDAO.getAllAuthZs(AuditDAO.java:449)
	at org.apache.directory.fortress.core.impl.AuditP.getAuthZs(AuditP.java:67)
	at org.apache.directory.fortress.core.impl.AuditMgrImpl.getUserAuthZs(AuditMgrImpl.java:126)
	at org.apache.directory.fortress.core.impl.AuditMgrImplTest.getAuthZs(AuditMgrImplTest.java:335)
	at org.apache.directory.fortress.core.impl.AuditMgrImplTest.testGetAuthZs(AuditMgrImplTest.java:311)
	at sun.reflect.NativeMethodAccessorImpl.invoke0(Native Method)
	at sun.reflect.NativeMethodAccessorImpl.invoke(NativeMethodAccessorImpl.java:62)
	at sun.reflect.DelegatingMethodAccessorImpl.invoke(DelegatingMethodAccessorImpl.java:43)
	at java.lang.reflect.Method.invoke(Method.java:498)
	at junit.framework.TestCase.runTest(TestCase.java:176)
	at junit.framework.TestCase.runBare(TestCase.java:141)
	at junit.framework.TestResult$1.protect(TestResult.java:122)
	at junit.framework.TestResult.runProtected(TestResult.java:142)
	at junit.framework.TestResult.run(TestResult.java:125)
	at junit.framework.TestCase.run(TestCase.java:129)
	at junit.framework.TestSuite.runTest(TestSuite.java:252)
	at junit.framework.TestSuite.run(TestSuite.java:247)
	at org.junit.internal.runners.JUnit38ClassRunner.run(JUnit38ClassRunner.java:86)
	at org.apache.maven.surefire.junit4.JUnit4Provider.execute(JUnit4Provider.java:283)
	at org.apache.maven.surefire.junit4.JUnit4Provider.executeWithRerun(JUnit4Provider.java:173)
	at org.apache.maven.surefire.junit4.JUnit4Provider.executeTestSet(JUnit4Provider.java:153)
	at org.apache.maven.surefire.junit4.JUnit4Provider.invoke(JUnit4Provider.java:128)
	at org.apache.maven.surefire.booter.ForkedBooter.invokeProviderInSameClassLoader(ForkedBooter.java:203)
	at org.apache.maven.surefire.booter.ForkedBooter.runSuitesInProcess(ForkedBooter.java:155)
	at org.apache.maven.surefire.booter.ForkedBooter.main(ForkedBooter.java:103)
Caused by: org.apache.directory.api.ldap.model.exception.LdapInvalidDnException: ERR_04202 A value is missing on some RDN
	at org.apache.directory.api.ldap.model.name.Dn.<init>(Dn.java:285)
	at org.apache.directory.api.ldap.model.name.Dn.<init>(Dn.java:217)
	at org.apache.directory.fortress.core.ldap.LdapDataProvider.search(LdapDataProvider.java:571)
	at org.apache.directory.fortress.core.impl.AuditDAO.getAllAuthZs(AuditDAO.java:437)
	... 24 more
2018-08-27 18:21:035 INFO  LogUtil:64 - GET-AUTHZ TU1_UPD
2018-08-27 18:21:035 ERROR AuditMgrImplTest:298 - searchAuthZs: failed with SecurityException rc=7002, msg=LdapException in AuditDAO.searchAuthZs id=org.apache.directory.api.ldap.model.exception.LdapInvalidDnException: ERR_04202 A value is missing on some RDN
org.apache.directory.fortress.core.FinderException: LdapException in AuditDAO.searchAuthZs id=org.apache.directory.api.ldap.model.exception.LdapInvalidDnException: ERR_04202 A value is missing on some RDN
	at org.apache.directory.fortress.core.impl.AuditDAO.searchAuthZs(AuditDAO.java:359)
	at org.apache.directory.fortress.core.impl.AuditP.searchAuthZs(AuditP.java:82)
	at org.apache.directory.fortress.core.impl.AuditMgrImpl.searchAuthZs(AuditMgrImpl.java:141)
	at org.apache.directory.fortress.core.impl.AuditMgrImplTest.searchAuthZs(AuditMgrImplTest.java:286)
	at org.apache.directory.fortress.core.impl.AuditMgrImplTest.testSearchAuthZs(AuditMgrImplTest.java:248)
	at sun.reflect.NativeMethodAccessorImpl.invoke0(Native Method)
	at sun.reflect.NativeMethodAccessorImpl.invoke(NativeMethodAccessorImpl.java:62)
	at sun.reflect.DelegatingMethodAccessorImpl.invoke(DelegatingMethodAccessorImpl.java:43)
	at java.lang.reflect.Method.invoke(Method.java:498)
	at junit.framework.TestCase.runTest(TestCase.java:176)
	at junit.framework.TestCase.runBare(TestCase.java:141)
	at junit.framework.TestResult$1.protect(TestResult.java:122)
	at junit.framework.TestResult.runProtected(TestResult.java:142)
	at junit.framework.TestResult.run(TestResult.java:125)
	at junit.framework.TestCase.run(TestCase.java:129)
	at junit.framework.TestSuite.runTest(TestSuite.java:252)
	at junit.framework.TestSuite.run(TestSuite.java:247)
	at org.junit.internal.runners.JUnit38ClassRunner.run(JUnit38ClassRunner.java:86)
	at org.apache.maven.surefire.junit4.JUnit4Provider.execute(JUnit4Provider.java:283)
	at org.apache.maven.surefire.junit4.JUnit4Provider.executeWithRerun(JUnit4Provider.java:173)
	at org.apache.maven.surefire.junit4.JUnit4Provider.executeTestSet(JUnit4Provider.java:153)
	at org.apache.maven.surefire.junit4.JUnit4Provider.invoke(JUnit4Provider.java:128)
	at org.apache.maven.surefire.booter.ForkedBooter.invokeProviderInSameClassLoader(ForkedBooter.java:203)
	at org.apache.maven.surefire.booter.ForkedBooter.runSuitesInProcess(ForkedBooter.java:155)
	at org.apache.maven.surefire.booter.ForkedBooter.main(ForkedBooter.java:103)
Caused by: org.apache.directory.api.ldap.model.exception.LdapInvalidDnException: ERR_04202 A value is missing on some RDN
	at org.apache.directory.api.ldap.model.name.Dn.<init>(Dn.java:285)
	at org.apache.directory.api.ldap.model.name.Dn.<init>(Dn.java:217)
	at org.apache.directory.fortress.core.ldap.LdapDataProvider.search(LdapDataProvider.java:571)
	at org.apache.directory.fortress.core.impl.AuditDAO.searchAuthZs(AuditDAO.java:347)
	... 24 more
2018-08-27 18:21:035 INFO  LogUtil:64 - SESS-USRS TU1_UPD
2018-08-27 18:21:035 ERROR AuditMgrImplTest:239 - searchUserSessions: failed with SecurityException rc=7003, msg=searchUserMods caught LdapException id=org.apache.directory.api.ldap.model.exception.LdapInvalidDnException: ERR_04202 A value is missing on some RDN
org.apache.directory.fortress.core.FinderException: searchUserMods caught LdapException id=org.apache.directory.api.ldap.model.exception.LdapInvalidDnException: ERR_04202 A value is missing on some RDN
	at org.apache.directory.fortress.core.impl.AuditDAO.searchUserMods(AuditDAO.java:588)
	at org.apache.directory.fortress.core.impl.AuditP.searchUserMods(AuditP.java:110)
	at org.apache.directory.fortress.core.impl.AuditMgrImpl.searchUserSessions(AuditMgrImpl.java:170)
	at org.apache.directory.fortress.core.impl.AuditMgrImplTest.searchMods(AuditMgrImplTest.java:229)
	at org.apache.directory.fortress.core.impl.AuditMgrImplTest.testSearchMods(AuditMgrImplTest.java:205)
	at sun.reflect.NativeMethodAccessorImpl.invoke0(Native Method)
	at sun.reflect.NativeMethodAccessorImpl.invoke(NativeMethodAccessorImpl.java:62)
	at sun.reflect.DelegatingMethodAccessorImpl.invoke(DelegatingMethodAccessorImpl.java:43)
	at java.lang.reflect.Method.invoke(Method.java:498)
	at junit.framework.TestCase.runTest(TestCase.java:176)
	at junit.framework.TestCase.runBare(TestCase.java:141)
	at junit.framework.TestResult$1.protect(TestResult.java:122)
	at junit.framework.TestResult.runProtected(TestResult.java:142)
	at junit.framework.TestResult.run(TestResult.java:125)
	at junit.framework.TestCase.run(TestCase.java:129)
	at junit.framework.TestSuite.runTest(TestSuite.java:252)
	at junit.framework.TestSuite.run(TestSuite.java:247)
	at org.junit.internal.runners.JUnit38ClassRunner.run(JUnit38ClassRunner.java:86)
	at org.apache.maven.surefire.junit4.JUnit4Provider.execute(JUnit4Provider.java:283)
	at org.apache.maven.surefire.junit4.JUnit4Provider.executeWithRerun(JUnit4Provider.java:173)
	at org.apache.maven.surefire.junit4.JUnit4Provider.executeTestSet(JUnit4Provider.java:153)
	at org.apache.maven.surefire.junit4.JUnit4Provider.invoke(JUnit4Provider.java:128)
	at org.apache.maven.surefire.booter.ForkedBooter.invokeProviderInSameClassLoader(ForkedBooter.java:203)
	at org.apache.maven.surefire.booter.ForkedBooter.runSuitesInProcess(ForkedBooter.java:155)
	at org.apache.maven.surefire.booter.ForkedBooter.main(ForkedBooter.java:103)
Caused by: org.apache.directory.api.ldap.model.exception.LdapInvalidDnException: ERR_04202 A value is missing on some RDN
	at org.apache.directory.api.ldap.model.name.Dn.<init>(Dn.java:285)
	at org.apache.directory.api.ldap.model.name.Dn.<init>(Dn.java:217)
	at org.apache.directory.fortress.core.ldap.LdapDataProvider.search(LdapDataProvider.java:571)
	at org.apache.directory.fortress.core.impl.AuditDAO.searchUserMods(AuditDAO.java:576)
	... 24 more
2018-08-27 18:21:035 INFO  LogUtil:64 - SESS-USRS RBAC TU0
2018-08-27 18:21:035 ERROR AuditMgrImplTest:192 - searchAdminMods: failed with SecurityException rc=7004, msg=searchAdminMods caught LdapException id=org.apache.directory.api.ldap.model.exception.LdapInvalidDnException: ERR_04202 A value is missing on some RDN
org.apache.directory.fortress.core.FinderException: searchAdminMods caught LdapException id=org.apache.directory.api.ldap.model.exception.LdapInvalidDnException: ERR_04202 A value is missing on some RDN
	at org.apache.directory.fortress.core.impl.AuditDAO.searchAdminMods(AuditDAO.java:678)
	at org.apache.directory.fortress.core.impl.AuditP.searchAdminMods(AuditP.java:125)
	at org.apache.directory.fortress.core.impl.AuditMgrImpl.searchAdminMods(AuditMgrImpl.java:190)
	at org.apache.directory.fortress.core.impl.AuditMgrImplTest.searchAdminMods(AuditMgrImplTest.java:173)
	at org.apache.directory.fortress.core.impl.AuditMgrImplTest.testSearchAdminMods(AuditMgrImplTest.java:94)
	at sun.reflect.NativeMethodAccessorImpl.invoke0(Native Method)
	at sun.reflect.NativeMethodAccessorImpl.invoke(NativeMethodAccessorImpl.java:62)
	at sun.reflect.DelegatingMethodAccessorImpl.invoke(DelegatingMethodAccessorImpl.java:43)
	at java.lang.reflect.Method.invoke(Method.java:498)
	at junit.framework.TestCase.runTest(TestCase.java:176)
	at junit.framework.TestCase.runBare(TestCase.java:141)
	at junit.framework.TestResult$1.protect(TestResult.java:122)
	at junit.framework.TestResult.runProtected(TestResult.java:142)
	at junit.framework.TestResult.run(TestResult.java:125)
	at junit.framework.TestCase.run(TestCase.java:129)
	at junit.framework.TestSuite.runTest(TestSuite.java:252)
	at junit.framework.TestSuite.run(TestSuite.java:247)
	at org.junit.internal.runners.JUnit38ClassRunner.run(JUnit38ClassRunner.java:86)
	at org.apache.maven.surefire.junit4.JUnit4Provider.execute(JUnit4Provider.java:283)
	at org.apache.maven.surefire.junit4.JUnit4Provider.executeWithRerun(JUnit4Provider.java:173)
	at org.apache.maven.surefire.junit4.JUnit4Provider.executeTestSet(JUnit4Provider.java:153)
	at org.apache.maven.surefire.junit4.JUnit4Provider.invoke(JUnit4Provider.java:128)
	at org.apache.maven.surefire.booter.ForkedBooter.invokeProviderInSameClassLoader(ForkedBooter.java:203)
	at org.apache.maven.surefire.booter.ForkedBooter.runSuitesInProcess(ForkedBooter.java:155)
	at org.apache.maven.surefire.booter.ForkedBooter.main(ForkedBooter.java:103)
Caused by: org.apache.directory.api.ldap.model.exception.LdapInvalidDnException: ERR_04202 A value is missing on some RDN
	at org.apache.directory.api.ldap.model.name.Dn.<init>(Dn.java:285)
	at org.apache.directory.api.ldap.model.name.Dn.<init>(Dn.java:217)
	at org.apache.directory.fortress.core.ldap.LdapDataProvider.search(LdapDataProvider.java:571)
	at org.apache.directory.fortress.core.impl.AuditDAO.searchAdminMods(AuditDAO.java:666)
	... 24 more
NUMBER OF ADDS: 1006
NUMBER OF BINDS: 1131
NUMBER OF DELETES: 0
NUMBER OF MODS: 4112
NUMBER OF READS: 19587
NUMBER OF SEARCHES: 7019
Tests run: 132, Failures: 6, Errors: 0, Skipped: 0, Time elapsed: 207.365 sec <<< FAILURE! - in org.apache.directory.fortress.core.impl.FortressJUnitTest
testAbacConstraintsRole(org.apache.directory.fortress.core.impl.AccessMgrImplTest)  Time elapsed: 0.033 sec  <<< FAILURE!
junit.framework.AssertionFailedError: org.apache.directory.fortress.core.impl.AccessMgrImplTest.createSessionsConstraints washers cannot contain tellers, user: curly, constraint value: north
	at junit.framework.Assert.fail(Assert.java:57)
	at junit.framework.TestCase.fail(TestCase.java:227)
	at org.apache.directory.fortress.core.impl.AccessMgrImplTest.createSessionsConstraints(AccessMgrImplTest.java:1384)
	at org.apache.directory.fortress.core.impl.AccessMgrImplTest.testAbacConstraintsRole(AccessMgrImplTest.java:1297)

testSearchBinds(org.apache.directory.fortress.core.impl.AuditMgrImplTest)  Time elapsed: 0.084 sec  <<< FAILURE!
junit.framework.AssertionFailedError: LdapException in AuditDAO.searchBinds id=org.apache.directory.api.ldap.model.exception.LdapInvalidDnException: ERR_04202 A value is missing on some RDN
	at junit.framework.Assert.fail(Assert.java:57)
	at junit.framework.TestCase.fail(TestCase.java:227)
	at org.apache.directory.fortress.core.impl.AuditMgrImplTest.searchBinds(AuditMgrImplTest.java:444)
	at org.apache.directory.fortress.core.impl.AuditMgrImplTest.testSearchBinds(AuditMgrImplTest.java:399)

testGetAuthZs(org.apache.directory.fortress.core.impl.AuditMgrImplTest)  Time elapsed: 0.005 sec  <<< FAILURE!
junit.framework.AssertionFailedError: LdapException in AuditDAO.getAllAuthZs id=org.apache.directory.api.ldap.model.exception.LdapInvalidDnException: ERR_04202 A value is missing on some RDN
	at junit.framework.Assert.fail(Assert.java:57)
	at junit.framework.TestCase.fail(TestCase.java:227)
	at org.apache.directory.fortress.core.impl.AuditMgrImplTest.getAuthZs(AuditMgrImplTest.java:355)
	at org.apache.directory.fortress.core.impl.AuditMgrImplTest.testGetAuthZs(AuditMgrImplTest.java:311)

testSearchAuthZs(org.apache.directory.fortress.core.impl.AuditMgrImplTest)  Time elapsed: 0.004 sec  <<< FAILURE!
junit.framework.AssertionFailedError: LdapException in AuditDAO.searchAuthZs id=org.apache.directory.api.ldap.model.exception.LdapInvalidDnException: ERR_04202 A value is missing on some RDN
	at junit.framework.Assert.fail(Assert.java:57)
	at junit.framework.TestCase.fail(TestCase.java:227)
	at org.apache.directory.fortress.core.impl.AuditMgrImplTest.searchAuthZs(AuditMgrImplTest.java:301)
	at org.apache.directory.fortress.core.impl.AuditMgrImplTest.testSearchAuthZs(AuditMgrImplTest.java:248)

testSearchMods(org.apache.directory.fortress.core.impl.AuditMgrImplTest)  Time elapsed: 0.004 sec  <<< FAILURE!
junit.framework.AssertionFailedError: searchUserMods caught LdapException id=org.apache.directory.api.ldap.model.exception.LdapInvalidDnException: ERR_04202 A value is missing on some RDN
	at junit.framework.Assert.fail(Assert.java:57)
	at junit.framework.TestCase.fail(TestCase.java:227)
	at org.apache.directory.fortress.core.impl.AuditMgrImplTest.searchMods(AuditMgrImplTest.java:241)
	at org.apache.directory.fortress.core.impl.AuditMgrImplTest.testSearchMods(AuditMgrImplTest.java:205)

testSearchAdminMods(org.apache.directory.fortress.core.impl.AuditMgrImplTest)  Time elapsed: 0.005 sec  <<< FAILURE!
junit.framework.AssertionFailedError: searchAdminMods caught LdapException id=org.apache.directory.api.ldap.model.exception.LdapInvalidDnException: ERR_04202 A value is missing on some RDN
	at junit.framework.Assert.fail(Assert.java:57)
	at junit.framework.TestCase.fail(TestCase.java:227)
	at org.apache.directory.fortress.core.impl.AuditMgrImplTest.searchAdminMods(AuditMgrImplTest.java:195)
	at org.apache.directory.fortress.core.impl.AuditMgrImplTest.testSearchAdminMods(AuditMgrImplTest.java:94)


Results :

Failed tests: 
  AccessMgrImplTest.testAbacConstraintsRole:1297->createSessionsConstraints:1384 org.apache.directory.fortress.core.impl.AccessMgrImplTest.createSessionsConstraints washers cannot contain tellers, user: curly, constraint value: north
  AuditMgrImplTest.testGetAuthZs:311->getAuthZs:355 LdapException in AuditDAO.getAllAuthZs id=org.apache.directory.api.ldap.model.exception.LdapInvalidDnException: ERR_04202 A value is missing on some RDN
  AuditMgrImplTest.testSearchAdminMods:94->searchAdminMods:195 searchAdminMods caught LdapException id=org.apache.directory.api.ldap.model.exception.LdapInvalidDnException: ERR_04202 A value is missing on some RDN
  AuditMgrImplTest.testSearchAuthZs:248->searchAuthZs:301 LdapException in AuditDAO.searchAuthZs id=org.apache.directory.api.ldap.model.exception.LdapInvalidDnException: ERR_04202 A value is missing on some RDN
  AuditMgrImplTest.testSearchBinds:399->searchBinds:444 LdapException in AuditDAO.searchBinds id=org.apache.directory.api.ldap.model.exception.LdapInvalidDnException: ERR_04202 A value is missing on some RDN
  AuditMgrImplTest.testSearchMods:205->searchMods:241 searchUserMods caught LdapException id=org.apache.directory.api.ldap.model.exception.LdapInvalidDnException: ERR_04202 A value is missing on some RDN

Tests run: 132, Failures: 6, Errors: 0, Skipped: 0

[INFO] ------------------------------------------------------------------------
[INFO] BUILD FAILURE
[INFO] ------------------------------------------------------------------------
[INFO] Total time: 03:34 min
[INFO] Finished at: 2018-08-27T18:21:36+00:00
[INFO] Final Memory: 21M/317M
[INFO] ------------------------------------------------------------------------
[ERROR] Failed to execute goal org.apache.maven.plugins:maven-surefire-plugin:2.18.1:test (default-test) on project fortress-core: There are test failures.
[ERROR] 
[ERROR] Please refer to <https://builds.apache.org/job/dir-fortress-core-docker-openldap-test/ws/target/surefire-reports> for the individual test results.
[ERROR] -> [Help 1]
[ERROR] 
[ERROR] To see the full stack trace of the errors, re-run Maven with the -e switch.
[ERROR] Re-run Maven using the -X switch to enable full debug logging.
[ERROR] 
[ERROR] For more information about the errors and possible solutions, please read the following articles:
[ERROR] [Help 1] http://cwiki.apache.org/confluence/display/MAVEN/MojoFailureException
Build step 'Invoke top-level Maven targets' marked build as failure
[dir-fortress-core-docker-openldap-test] $ /bin/bash /tmp/jenkins3386309132370032760.sh
dir-fortress-core-docker-openldap-test
dir-fortress-core-docker-openldap-test
CONTAINER ID        IMAGE               COMMAND             CREATED             STATUS              PORTS               NAMES

Build failed in Jenkins: dir-fortress-core-docker-openldap-test #538

Posted by Apache Jenkins Server <je...@builds.apache.org>.
See <https://builds.apache.org/job/dir-fortress-core-docker-openldap-test/538/display/redirect?page=changes>

Changes:

[smckinney] cludge for broken build, add openldap log creds

------------------------------------------
[...truncated 222.41 KB...]
	at org.apache.directory.fortress.core.impl.AuditMgrImpl.searchBinds(AuditMgrImpl.java:156)
	at org.apache.directory.fortress.core.impl.AuditMgrImplTest.searchBinds(AuditMgrImplTest.java:424)
	at org.apache.directory.fortress.core.impl.AuditMgrImplTest.testSearchBinds(AuditMgrImplTest.java:399)
	at sun.reflect.NativeMethodAccessorImpl.invoke0(Native Method)
	at sun.reflect.NativeMethodAccessorImpl.invoke(NativeMethodAccessorImpl.java:62)
	at sun.reflect.DelegatingMethodAccessorImpl.invoke(DelegatingMethodAccessorImpl.java:43)
	at java.lang.reflect.Method.invoke(Method.java:498)
	at junit.framework.TestCase.runTest(TestCase.java:176)
	at junit.framework.TestCase.runBare(TestCase.java:141)
	at junit.framework.TestResult$1.protect(TestResult.java:122)
	at junit.framework.TestResult.runProtected(TestResult.java:142)
	at junit.framework.TestResult.run(TestResult.java:125)
	at junit.framework.TestCase.run(TestCase.java:129)
	at junit.framework.TestSuite.runTest(TestSuite.java:252)
	at junit.framework.TestSuite.run(TestSuite.java:247)
	at org.junit.internal.runners.JUnit38ClassRunner.run(JUnit38ClassRunner.java:86)
	at org.apache.maven.surefire.junit4.JUnit4Provider.execute(JUnit4Provider.java:283)
	at org.apache.maven.surefire.junit4.JUnit4Provider.executeWithRerun(JUnit4Provider.java:173)
	at org.apache.maven.surefire.junit4.JUnit4Provider.executeTestSet(JUnit4Provider.java:153)
	at org.apache.maven.surefire.junit4.JUnit4Provider.invoke(JUnit4Provider.java:128)
	at org.apache.maven.surefire.booter.ForkedBooter.invokeProviderInSameClassLoader(ForkedBooter.java:203)
	at org.apache.maven.surefire.booter.ForkedBooter.runSuitesInProcess(ForkedBooter.java:155)
	at org.apache.maven.surefire.booter.ForkedBooter.main(ForkedBooter.java:103)
Caused by: org.apache.directory.api.ldap.model.exception.LdapInvalidDnException: ERR_04202 A value is missing on some RDN
	at org.apache.directory.api.ldap.model.name.Dn.<init>(Dn.java:285)
	at org.apache.directory.api.ldap.model.name.Dn.<init>(Dn.java:217)
	at org.apache.directory.fortress.core.ldap.LdapDataProvider.search(LdapDataProvider.java:571)
	at org.apache.directory.fortress.core.impl.AuditDAO.searchBinds(AuditDAO.java:520)
	... 24 more
2018-08-27 18:15:021 INFO  LogUtil:64 - GET-AUTHZ TU1_UPD
2018-08-27 18:15:021 ERROR AuditMgrImplTest:352 - getUserAuthZs: failed with SecurityException rc=7002, msg=LdapException in AuditDAO.getAllAuthZs id=org.apache.directory.api.ldap.model.exception.LdapInvalidDnException: ERR_04202 A value is missing on some RDN
org.apache.directory.fortress.core.FinderException: LdapException in AuditDAO.getAllAuthZs id=org.apache.directory.api.ldap.model.exception.LdapInvalidDnException: ERR_04202 A value is missing on some RDN
	at org.apache.directory.fortress.core.impl.AuditDAO.getAllAuthZs(AuditDAO.java:449)
	at org.apache.directory.fortress.core.impl.AuditP.getAuthZs(AuditP.java:67)
	at org.apache.directory.fortress.core.impl.AuditMgrImpl.getUserAuthZs(AuditMgrImpl.java:126)
	at org.apache.directory.fortress.core.impl.AuditMgrImplTest.getAuthZs(AuditMgrImplTest.java:335)
	at org.apache.directory.fortress.core.impl.AuditMgrImplTest.testGetAuthZs(AuditMgrImplTest.java:311)
	at sun.reflect.NativeMethodAccessorImpl.invoke0(Native Method)
	at sun.reflect.NativeMethodAccessorImpl.invoke(NativeMethodAccessorImpl.java:62)
	at sun.reflect.DelegatingMethodAccessorImpl.invoke(DelegatingMethodAccessorImpl.java:43)
	at java.lang.reflect.Method.invoke(Method.java:498)
	at junit.framework.TestCase.runTest(TestCase.java:176)
	at junit.framework.TestCase.runBare(TestCase.java:141)
	at junit.framework.TestResult$1.protect(TestResult.java:122)
	at junit.framework.TestResult.runProtected(TestResult.java:142)
	at junit.framework.TestResult.run(TestResult.java:125)
	at junit.framework.TestCase.run(TestCase.java:129)
	at junit.framework.TestSuite.runTest(TestSuite.java:252)
	at junit.framework.TestSuite.run(TestSuite.java:247)
	at org.junit.internal.runners.JUnit38ClassRunner.run(JUnit38ClassRunner.java:86)
	at org.apache.maven.surefire.junit4.JUnit4Provider.execute(JUnit4Provider.java:283)
	at org.apache.maven.surefire.junit4.JUnit4Provider.executeWithRerun(JUnit4Provider.java:173)
	at org.apache.maven.surefire.junit4.JUnit4Provider.executeTestSet(JUnit4Provider.java:153)
	at org.apache.maven.surefire.junit4.JUnit4Provider.invoke(JUnit4Provider.java:128)
	at org.apache.maven.surefire.booter.ForkedBooter.invokeProviderInSameClassLoader(ForkedBooter.java:203)
	at org.apache.maven.surefire.booter.ForkedBooter.runSuitesInProcess(ForkedBooter.java:155)
	at org.apache.maven.surefire.booter.ForkedBooter.main(ForkedBooter.java:103)
Caused by: org.apache.directory.api.ldap.model.exception.LdapInvalidDnException: ERR_04202 A value is missing on some RDN
	at org.apache.directory.api.ldap.model.name.Dn.<init>(Dn.java:285)
	at org.apache.directory.api.ldap.model.name.Dn.<init>(Dn.java:217)
	at org.apache.directory.fortress.core.ldap.LdapDataProvider.search(LdapDataProvider.java:571)
	at org.apache.directory.fortress.core.impl.AuditDAO.getAllAuthZs(AuditDAO.java:437)
	... 24 more
2018-08-27 18:15:021 INFO  LogUtil:64 - GET-AUTHZ TU1_UPD
2018-08-27 18:15:021 ERROR AuditMgrImplTest:298 - searchAuthZs: failed with SecurityException rc=7002, msg=LdapException in AuditDAO.searchAuthZs id=org.apache.directory.api.ldap.model.exception.LdapInvalidDnException: ERR_04202 A value is missing on some RDN
org.apache.directory.fortress.core.FinderException: LdapException in AuditDAO.searchAuthZs id=org.apache.directory.api.ldap.model.exception.LdapInvalidDnException: ERR_04202 A value is missing on some RDN
	at org.apache.directory.fortress.core.impl.AuditDAO.searchAuthZs(AuditDAO.java:359)
	at org.apache.directory.fortress.core.impl.AuditP.searchAuthZs(AuditP.java:82)
	at org.apache.directory.fortress.core.impl.AuditMgrImpl.searchAuthZs(AuditMgrImpl.java:141)
	at org.apache.directory.fortress.core.impl.AuditMgrImplTest.searchAuthZs(AuditMgrImplTest.java:286)
	at org.apache.directory.fortress.core.impl.AuditMgrImplTest.testSearchAuthZs(AuditMgrImplTest.java:248)
	at sun.reflect.NativeMethodAccessorImpl.invoke0(Native Method)
	at sun.reflect.NativeMethodAccessorImpl.invoke(NativeMethodAccessorImpl.java:62)
	at sun.reflect.DelegatingMethodAccessorImpl.invoke(DelegatingMethodAccessorImpl.java:43)
	at java.lang.reflect.Method.invoke(Method.java:498)
	at junit.framework.TestCase.runTest(TestCase.java:176)
	at junit.framework.TestCase.runBare(TestCase.java:141)
	at junit.framework.TestResult$1.protect(TestResult.java:122)
	at junit.framework.TestResult.runProtected(TestResult.java:142)
	at junit.framework.TestResult.run(TestResult.java:125)
	at junit.framework.TestCase.run(TestCase.java:129)
	at junit.framework.TestSuite.runTest(TestSuite.java:252)
	at junit.framework.TestSuite.run(TestSuite.java:247)
	at org.junit.internal.runners.JUnit38ClassRunner.run(JUnit38ClassRunner.java:86)
	at org.apache.maven.surefire.junit4.JUnit4Provider.execute(JUnit4Provider.java:283)
	at org.apache.maven.surefire.junit4.JUnit4Provider.executeWithRerun(JUnit4Provider.java:173)
	at org.apache.maven.surefire.junit4.JUnit4Provider.executeTestSet(JUnit4Provider.java:153)
	at org.apache.maven.surefire.junit4.JUnit4Provider.invoke(JUnit4Provider.java:128)
	at org.apache.maven.surefire.booter.ForkedBooter.invokeProviderInSameClassLoader(ForkedBooter.java:203)
	at org.apache.maven.surefire.booter.ForkedBooter.runSuitesInProcess(ForkedBooter.java:155)
	at org.apache.maven.surefire.booter.ForkedBooter.main(ForkedBooter.java:103)
Caused by: org.apache.directory.api.ldap.model.exception.LdapInvalidDnException: ERR_04202 A value is missing on some RDN
	at org.apache.directory.api.ldap.model.name.Dn.<init>(Dn.java:285)
	at org.apache.directory.api.ldap.model.name.Dn.<init>(Dn.java:217)
	at org.apache.directory.fortress.core.ldap.LdapDataProvider.search(LdapDataProvider.java:571)
	at org.apache.directory.fortress.core.impl.AuditDAO.searchAuthZs(AuditDAO.java:347)
	... 24 more
2018-08-27 18:15:021 INFO  LogUtil:64 - SESS-USRS TU1_UPD
2018-08-27 18:15:021 ERROR AuditMgrImplTest:239 - searchUserSessions: failed with SecurityException rc=7003, msg=searchUserMods caught LdapException id=org.apache.directory.api.ldap.model.exception.LdapInvalidDnException: ERR_04202 A value is missing on some RDN
org.apache.directory.fortress.core.FinderException: searchUserMods caught LdapException id=org.apache.directory.api.ldap.model.exception.LdapInvalidDnException: ERR_04202 A value is missing on some RDN
	at org.apache.directory.fortress.core.impl.AuditDAO.searchUserMods(AuditDAO.java:588)
	at org.apache.directory.fortress.core.impl.AuditP.searchUserMods(AuditP.java:110)
	at org.apache.directory.fortress.core.impl.AuditMgrImpl.searchUserSessions(AuditMgrImpl.java:170)
	at org.apache.directory.fortress.core.impl.AuditMgrImplTest.searchMods(AuditMgrImplTest.java:229)
	at org.apache.directory.fortress.core.impl.AuditMgrImplTest.testSearchMods(AuditMgrImplTest.java:205)
	at sun.reflect.NativeMethodAccessorImpl.invoke0(Native Method)
	at sun.reflect.NativeMethodAccessorImpl.invoke(NativeMethodAccessorImpl.java:62)
	at sun.reflect.DelegatingMethodAccessorImpl.invoke(DelegatingMethodAccessorImpl.java:43)
	at java.lang.reflect.Method.invoke(Method.java:498)
	at junit.framework.TestCase.runTest(TestCase.java:176)
	at junit.framework.TestCase.runBare(TestCase.java:141)
	at junit.framework.TestResult$1.protect(TestResult.java:122)
	at junit.framework.TestResult.runProtected(TestResult.java:142)
	at junit.framework.TestResult.run(TestResult.java:125)
	at junit.framework.TestCase.run(TestCase.java:129)
	at junit.framework.TestSuite.runTest(TestSuite.java:252)
	at junit.framework.TestSuite.run(TestSuite.java:247)
	at org.junit.internal.runners.JUnit38ClassRunner.run(JUnit38ClassRunner.java:86)
	at org.apache.maven.surefire.junit4.JUnit4Provider.execute(JUnit4Provider.java:283)
	at org.apache.maven.surefire.junit4.JUnit4Provider.executeWithRerun(JUnit4Provider.java:173)
	at org.apache.maven.surefire.junit4.JUnit4Provider.executeTestSet(JUnit4Provider.java:153)
	at org.apache.maven.surefire.junit4.JUnit4Provider.invoke(JUnit4Provider.java:128)
	at org.apache.maven.surefire.booter.ForkedBooter.invokeProviderInSameClassLoader(ForkedBooter.java:203)
	at org.apache.maven.surefire.booter.ForkedBooter.runSuitesInProcess(ForkedBooter.java:155)
	at org.apache.maven.surefire.booter.ForkedBooter.main(ForkedBooter.java:103)
Caused by: org.apache.directory.api.ldap.model.exception.LdapInvalidDnException: ERR_04202 A value is missing on some RDN
	at org.apache.directory.api.ldap.model.name.Dn.<init>(Dn.java:285)
	at org.apache.directory.api.ldap.model.name.Dn.<init>(Dn.java:217)
	at org.apache.directory.fortress.core.ldap.LdapDataProvider.search(LdapDataProvider.java:571)
	at org.apache.directory.fortress.core.impl.AuditDAO.searchUserMods(AuditDAO.java:576)
	... 24 more
2018-08-27 18:15:021 INFO  LogUtil:64 - SESS-USRS RBAC TU0
2018-08-27 18:15:021 ERROR AuditMgrImplTest:192 - searchAdminMods: failed with SecurityException rc=7004, msg=searchAdminMods caught LdapException id=org.apache.directory.api.ldap.model.exception.LdapInvalidDnException: ERR_04202 A value is missing on some RDN
org.apache.directory.fortress.core.FinderException: searchAdminMods caught LdapException id=org.apache.directory.api.ldap.model.exception.LdapInvalidDnException: ERR_04202 A value is missing on some RDN
	at org.apache.directory.fortress.core.impl.AuditDAO.searchAdminMods(AuditDAO.java:678)
	at org.apache.directory.fortress.core.impl.AuditP.searchAdminMods(AuditP.java:125)
	at org.apache.directory.fortress.core.impl.AuditMgrImpl.searchAdminMods(AuditMgrImpl.java:190)
	at org.apache.directory.fortress.core.impl.AuditMgrImplTest.searchAdminMods(AuditMgrImplTest.java:173)
	at org.apache.directory.fortress.core.impl.AuditMgrImplTest.testSearchAdminMods(AuditMgrImplTest.java:94)
	at sun.reflect.NativeMethodAccessorImpl.invoke0(Native Method)
	at sun.reflect.NativeMethodAccessorImpl.invoke(NativeMethodAccessorImpl.java:62)
	at sun.reflect.DelegatingMethodAccessorImpl.invoke(DelegatingMethodAccessorImpl.java:43)
	at java.lang.reflect.Method.invoke(Method.java:498)
	at junit.framework.TestCase.runTest(TestCase.java:176)
	at junit.framework.TestCase.runBare(TestCase.java:141)
	at junit.framework.TestResult$1.protect(TestResult.java:122)
	at junit.framework.TestResult.runProtected(TestResult.java:142)
	at junit.framework.TestResult.run(TestResult.java:125)
	at junit.framework.TestCase.run(TestCase.java:129)
	at junit.framework.TestSuite.runTest(TestSuite.java:252)
	at junit.framework.TestSuite.run(TestSuite.java:247)
	at org.junit.internal.runners.JUnit38ClassRunner.run(JUnit38ClassRunner.java:86)
	at org.apache.maven.surefire.junit4.JUnit4Provider.execute(JUnit4Provider.java:283)
	at org.apache.maven.surefire.junit4.JUnit4Provider.executeWithRerun(JUnit4Provider.java:173)
	at org.apache.maven.surefire.junit4.JUnit4Provider.executeTestSet(JUnit4Provider.java:153)
	at org.apache.maven.surefire.junit4.JUnit4Provider.invoke(JUnit4Provider.java:128)
	at org.apache.maven.surefire.booter.ForkedBooter.invokeProviderInSameClassLoader(ForkedBooter.java:203)
	at org.apache.maven.surefire.booter.ForkedBooter.runSuitesInProcess(ForkedBooter.java:155)
	at org.apache.maven.surefire.booter.ForkedBooter.main(ForkedBooter.java:103)
Caused by: org.apache.directory.api.ldap.model.exception.LdapInvalidDnException: ERR_04202 A value is missing on some RDN
	at org.apache.directory.api.ldap.model.name.Dn.<init>(Dn.java:285)
	at org.apache.directory.api.ldap.model.name.Dn.<init>(Dn.java:217)
	at org.apache.directory.fortress.core.ldap.LdapDataProvider.search(LdapDataProvider.java:571)
	at org.apache.directory.fortress.core.impl.AuditDAO.searchAdminMods(AuditDAO.java:666)
	... 24 more
NUMBER OF ADDS: 1006
NUMBER OF BINDS: 1131
NUMBER OF DELETES: 0
NUMBER OF MODS: 4112
NUMBER OF READS: 19587
NUMBER OF SEARCHES: 7019
Tests run: 132, Failures: 6, Errors: 0, Skipped: 0, Time elapsed: 205.467 sec <<< FAILURE! - in org.apache.directory.fortress.core.impl.FortressJUnitTest
testAbacConstraintsRole(org.apache.directory.fortress.core.impl.AccessMgrImplTest)  Time elapsed: 0.027 sec  <<< FAILURE!
junit.framework.AssertionFailedError: org.apache.directory.fortress.core.impl.AccessMgrImplTest.createSessionsConstraints washers cannot contain tellers, user: curly, constraint value: north
	at junit.framework.Assert.fail(Assert.java:57)
	at junit.framework.TestCase.fail(TestCase.java:227)
	at org.apache.directory.fortress.core.impl.AccessMgrImplTest.createSessionsConstraints(AccessMgrImplTest.java:1384)
	at org.apache.directory.fortress.core.impl.AccessMgrImplTest.testAbacConstraintsRole(AccessMgrImplTest.java:1297)

testSearchBinds(org.apache.directory.fortress.core.impl.AuditMgrImplTest)  Time elapsed: 0.088 sec  <<< FAILURE!
junit.framework.AssertionFailedError: LdapException in AuditDAO.searchBinds id=org.apache.directory.api.ldap.model.exception.LdapInvalidDnException: ERR_04202 A value is missing on some RDN
	at junit.framework.Assert.fail(Assert.java:57)
	at junit.framework.TestCase.fail(TestCase.java:227)
	at org.apache.directory.fortress.core.impl.AuditMgrImplTest.searchBinds(AuditMgrImplTest.java:444)
	at org.apache.directory.fortress.core.impl.AuditMgrImplTest.testSearchBinds(AuditMgrImplTest.java:399)

testGetAuthZs(org.apache.directory.fortress.core.impl.AuditMgrImplTest)  Time elapsed: 0.007 sec  <<< FAILURE!
junit.framework.AssertionFailedError: LdapException in AuditDAO.getAllAuthZs id=org.apache.directory.api.ldap.model.exception.LdapInvalidDnException: ERR_04202 A value is missing on some RDN
	at junit.framework.Assert.fail(Assert.java:57)
	at junit.framework.TestCase.fail(TestCase.java:227)
	at org.apache.directory.fortress.core.impl.AuditMgrImplTest.getAuthZs(AuditMgrImplTest.java:355)
	at org.apache.directory.fortress.core.impl.AuditMgrImplTest.testGetAuthZs(AuditMgrImplTest.java:311)

testSearchAuthZs(org.apache.directory.fortress.core.impl.AuditMgrImplTest)  Time elapsed: 0.005 sec  <<< FAILURE!
junit.framework.AssertionFailedError: LdapException in AuditDAO.searchAuthZs id=org.apache.directory.api.ldap.model.exception.LdapInvalidDnException: ERR_04202 A value is missing on some RDN
	at junit.framework.Assert.fail(Assert.java:57)
	at junit.framework.TestCase.fail(TestCase.java:227)
	at org.apache.directory.fortress.core.impl.AuditMgrImplTest.searchAuthZs(AuditMgrImplTest.java:301)
	at org.apache.directory.fortress.core.impl.AuditMgrImplTest.testSearchAuthZs(AuditMgrImplTest.java:248)

testSearchMods(org.apache.directory.fortress.core.impl.AuditMgrImplTest)  Time elapsed: 0.005 sec  <<< FAILURE!
junit.framework.AssertionFailedError: searchUserMods caught LdapException id=org.apache.directory.api.ldap.model.exception.LdapInvalidDnException: ERR_04202 A value is missing on some RDN
	at junit.framework.Assert.fail(Assert.java:57)
	at junit.framework.TestCase.fail(TestCase.java:227)
	at org.apache.directory.fortress.core.impl.AuditMgrImplTest.searchMods(AuditMgrImplTest.java:241)
	at org.apache.directory.fortress.core.impl.AuditMgrImplTest.testSearchMods(AuditMgrImplTest.java:205)

testSearchAdminMods(org.apache.directory.fortress.core.impl.AuditMgrImplTest)  Time elapsed: 0.005 sec  <<< FAILURE!
junit.framework.AssertionFailedError: searchAdminMods caught LdapException id=org.apache.directory.api.ldap.model.exception.LdapInvalidDnException: ERR_04202 A value is missing on some RDN
	at junit.framework.Assert.fail(Assert.java:57)
	at junit.framework.TestCase.fail(TestCase.java:227)
	at org.apache.directory.fortress.core.impl.AuditMgrImplTest.searchAdminMods(AuditMgrImplTest.java:195)
	at org.apache.directory.fortress.core.impl.AuditMgrImplTest.testSearchAdminMods(AuditMgrImplTest.java:94)


Results :

Failed tests: 
  AccessMgrImplTest.testAbacConstraintsRole:1297->createSessionsConstraints:1384 org.apache.directory.fortress.core.impl.AccessMgrImplTest.createSessionsConstraints washers cannot contain tellers, user: curly, constraint value: north
  AuditMgrImplTest.testGetAuthZs:311->getAuthZs:355 LdapException in AuditDAO.getAllAuthZs id=org.apache.directory.api.ldap.model.exception.LdapInvalidDnException: ERR_04202 A value is missing on some RDN
  AuditMgrImplTest.testSearchAdminMods:94->searchAdminMods:195 searchAdminMods caught LdapException id=org.apache.directory.api.ldap.model.exception.LdapInvalidDnException: ERR_04202 A value is missing on some RDN
  AuditMgrImplTest.testSearchAuthZs:248->searchAuthZs:301 LdapException in AuditDAO.searchAuthZs id=org.apache.directory.api.ldap.model.exception.LdapInvalidDnException: ERR_04202 A value is missing on some RDN
  AuditMgrImplTest.testSearchBinds:399->searchBinds:444 LdapException in AuditDAO.searchBinds id=org.apache.directory.api.ldap.model.exception.LdapInvalidDnException: ERR_04202 A value is missing on some RDN
  AuditMgrImplTest.testSearchMods:205->searchMods:241 searchUserMods caught LdapException id=org.apache.directory.api.ldap.model.exception.LdapInvalidDnException: ERR_04202 A value is missing on some RDN

Tests run: 132, Failures: 6, Errors: 0, Skipped: 0

[INFO] ------------------------------------------------------------------------
[INFO] BUILD FAILURE
[INFO] ------------------------------------------------------------------------
[INFO] Total time: 03:32 min
[INFO] Finished at: 2018-08-27T18:15:21+00:00
[INFO] Final Memory: 21M/312M
[INFO] ------------------------------------------------------------------------
[ERROR] Failed to execute goal org.apache.maven.plugins:maven-surefire-plugin:2.18.1:test (default-test) on project fortress-core: There are test failures.
[ERROR] 
[ERROR] Please refer to <https://builds.apache.org/job/dir-fortress-core-docker-openldap-test/ws/target/surefire-reports> for the individual test results.
[ERROR] -> [Help 1]
[ERROR] 
[ERROR] To see the full stack trace of the errors, re-run Maven with the -e switch.
[ERROR] Re-run Maven using the -X switch to enable full debug logging.
[ERROR] 
[ERROR] For more information about the errors and possible solutions, please read the following articles:
[ERROR] [Help 1] http://cwiki.apache.org/confluence/display/MAVEN/MojoFailureException
Build step 'Invoke top-level Maven targets' marked build as failure
[dir-fortress-core-docker-openldap-test] $ /bin/bash /tmp/jenkins929850062698624000.sh
dir-fortress-core-docker-openldap-test
dir-fortress-core-docker-openldap-test
CONTAINER ID        IMAGE               COMMAND             CREATED             STATUS              PORTS               NAMES

Build failed in Jenkins: dir-fortress-core-docker-openldap-test #537

Posted by Apache Jenkins Server <je...@builds.apache.org>.
See <https://builds.apache.org/job/dir-fortress-core-docker-openldap-test/537/display/redirect?page=changes>

Changes:

[smckinney] cludge for broken build, add openldap log creds

------------------------------------------
[...truncated 221.30 KB...]
	at org.apache.directory.fortress.core.impl.AuditMgrImpl.searchBinds(AuditMgrImpl.java:156)
	at org.apache.directory.fortress.core.impl.AuditMgrImplTest.searchBinds(AuditMgrImplTest.java:424)
	at org.apache.directory.fortress.core.impl.AuditMgrImplTest.testSearchBinds(AuditMgrImplTest.java:399)
	at sun.reflect.NativeMethodAccessorImpl.invoke0(Native Method)
	at sun.reflect.NativeMethodAccessorImpl.invoke(NativeMethodAccessorImpl.java:62)
	at sun.reflect.DelegatingMethodAccessorImpl.invoke(DelegatingMethodAccessorImpl.java:43)
	at java.lang.reflect.Method.invoke(Method.java:498)
	at junit.framework.TestCase.runTest(TestCase.java:176)
	at junit.framework.TestCase.runBare(TestCase.java:141)
	at junit.framework.TestResult$1.protect(TestResult.java:122)
	at junit.framework.TestResult.runProtected(TestResult.java:142)
	at junit.framework.TestResult.run(TestResult.java:125)
	at junit.framework.TestCase.run(TestCase.java:129)
	at junit.framework.TestSuite.runTest(TestSuite.java:252)
	at junit.framework.TestSuite.run(TestSuite.java:247)
	at org.junit.internal.runners.JUnit38ClassRunner.run(JUnit38ClassRunner.java:86)
	at org.apache.maven.surefire.junit4.JUnit4Provider.execute(JUnit4Provider.java:283)
	at org.apache.maven.surefire.junit4.JUnit4Provider.executeWithRerun(JUnit4Provider.java:173)
	at org.apache.maven.surefire.junit4.JUnit4Provider.executeTestSet(JUnit4Provider.java:153)
	at org.apache.maven.surefire.junit4.JUnit4Provider.invoke(JUnit4Provider.java:128)
	at org.apache.maven.surefire.booter.ForkedBooter.invokeProviderInSameClassLoader(ForkedBooter.java:203)
	at org.apache.maven.surefire.booter.ForkedBooter.runSuitesInProcess(ForkedBooter.java:155)
	at org.apache.maven.surefire.booter.ForkedBooter.main(ForkedBooter.java:103)
Caused by: org.apache.directory.api.ldap.model.exception.LdapInvalidDnException: ERR_04202 A value is missing on some RDN
	at org.apache.directory.api.ldap.model.name.Dn.<init>(Dn.java:285)
	at org.apache.directory.api.ldap.model.name.Dn.<init>(Dn.java:217)
	at org.apache.directory.fortress.core.ldap.LdapDataProvider.search(LdapDataProvider.java:571)
	at org.apache.directory.fortress.core.impl.AuditDAO.searchBinds(AuditDAO.java:520)
	... 24 more
2018-08-27 18:02:009 INFO  LogUtil:64 - GET-AUTHZ TU1_UPD
2018-08-27 18:02:009 ERROR AuditMgrImplTest:352 - getUserAuthZs: failed with SecurityException rc=7002, msg=LdapException in AuditDAO.getAllAuthZs id=org.apache.directory.api.ldap.model.exception.LdapInvalidDnException: ERR_04202 A value is missing on some RDN
org.apache.directory.fortress.core.FinderException: LdapException in AuditDAO.getAllAuthZs id=org.apache.directory.api.ldap.model.exception.LdapInvalidDnException: ERR_04202 A value is missing on some RDN
	at org.apache.directory.fortress.core.impl.AuditDAO.getAllAuthZs(AuditDAO.java:449)
	at org.apache.directory.fortress.core.impl.AuditP.getAuthZs(AuditP.java:67)
	at org.apache.directory.fortress.core.impl.AuditMgrImpl.getUserAuthZs(AuditMgrImpl.java:126)
	at org.apache.directory.fortress.core.impl.AuditMgrImplTest.getAuthZs(AuditMgrImplTest.java:335)
	at org.apache.directory.fortress.core.impl.AuditMgrImplTest.testGetAuthZs(AuditMgrImplTest.java:311)
	at sun.reflect.NativeMethodAccessorImpl.invoke0(Native Method)
	at sun.reflect.NativeMethodAccessorImpl.invoke(NativeMethodAccessorImpl.java:62)
	at sun.reflect.DelegatingMethodAccessorImpl.invoke(DelegatingMethodAccessorImpl.java:43)
	at java.lang.reflect.Method.invoke(Method.java:498)
	at junit.framework.TestCase.runTest(TestCase.java:176)
	at junit.framework.TestCase.runBare(TestCase.java:141)
	at junit.framework.TestResult$1.protect(TestResult.java:122)
	at junit.framework.TestResult.runProtected(TestResult.java:142)
	at junit.framework.TestResult.run(TestResult.java:125)
	at junit.framework.TestCase.run(TestCase.java:129)
	at junit.framework.TestSuite.runTest(TestSuite.java:252)
	at junit.framework.TestSuite.run(TestSuite.java:247)
	at org.junit.internal.runners.JUnit38ClassRunner.run(JUnit38ClassRunner.java:86)
	at org.apache.maven.surefire.junit4.JUnit4Provider.execute(JUnit4Provider.java:283)
	at org.apache.maven.surefire.junit4.JUnit4Provider.executeWithRerun(JUnit4Provider.java:173)
	at org.apache.maven.surefire.junit4.JUnit4Provider.executeTestSet(JUnit4Provider.java:153)
	at org.apache.maven.surefire.junit4.JUnit4Provider.invoke(JUnit4Provider.java:128)
	at org.apache.maven.surefire.booter.ForkedBooter.invokeProviderInSameClassLoader(ForkedBooter.java:203)
	at org.apache.maven.surefire.booter.ForkedBooter.runSuitesInProcess(ForkedBooter.java:155)
	at org.apache.maven.surefire.booter.ForkedBooter.main(ForkedBooter.java:103)
Caused by: org.apache.directory.api.ldap.model.exception.LdapInvalidDnException: ERR_04202 A value is missing on some RDN
	at org.apache.directory.api.ldap.model.name.Dn.<init>(Dn.java:285)
	at org.apache.directory.api.ldap.model.name.Dn.<init>(Dn.java:217)
	at org.apache.directory.fortress.core.ldap.LdapDataProvider.search(LdapDataProvider.java:571)
	at org.apache.directory.fortress.core.impl.AuditDAO.getAllAuthZs(AuditDAO.java:437)
	... 24 more
2018-08-27 18:02:009 INFO  LogUtil:64 - GET-AUTHZ TU1_UPD
2018-08-27 18:02:009 ERROR AuditMgrImplTest:298 - searchAuthZs: failed with SecurityException rc=7002, msg=LdapException in AuditDAO.searchAuthZs id=org.apache.directory.api.ldap.model.exception.LdapInvalidDnException: ERR_04202 A value is missing on some RDN
org.apache.directory.fortress.core.FinderException: LdapException in AuditDAO.searchAuthZs id=org.apache.directory.api.ldap.model.exception.LdapInvalidDnException: ERR_04202 A value is missing on some RDN
	at org.apache.directory.fortress.core.impl.AuditDAO.searchAuthZs(AuditDAO.java:359)
	at org.apache.directory.fortress.core.impl.AuditP.searchAuthZs(AuditP.java:82)
	at org.apache.directory.fortress.core.impl.AuditMgrImpl.searchAuthZs(AuditMgrImpl.java:141)
	at org.apache.directory.fortress.core.impl.AuditMgrImplTest.searchAuthZs(AuditMgrImplTest.java:286)
	at org.apache.directory.fortress.core.impl.AuditMgrImplTest.testSearchAuthZs(AuditMgrImplTest.java:248)
	at sun.reflect.NativeMethodAccessorImpl.invoke0(Native Method)
	at sun.reflect.NativeMethodAccessorImpl.invoke(NativeMethodAccessorImpl.java:62)
	at sun.reflect.DelegatingMethodAccessorImpl.invoke(DelegatingMethodAccessorImpl.java:43)
	at java.lang.reflect.Method.invoke(Method.java:498)
	at junit.framework.TestCase.runTest(TestCase.java:176)
	at junit.framework.TestCase.runBare(TestCase.java:141)
	at junit.framework.TestResult$1.protect(TestResult.java:122)
	at junit.framework.TestResult.runProtected(TestResult.java:142)
	at junit.framework.TestResult.run(TestResult.java:125)
	at junit.framework.TestCase.run(TestCase.java:129)
	at junit.framework.TestSuite.runTest(TestSuite.java:252)
	at junit.framework.TestSuite.run(TestSuite.java:247)
	at org.junit.internal.runners.JUnit38ClassRunner.run(JUnit38ClassRunner.java:86)
	at org.apache.maven.surefire.junit4.JUnit4Provider.execute(JUnit4Provider.java:283)
	at org.apache.maven.surefire.junit4.JUnit4Provider.executeWithRerun(JUnit4Provider.java:173)
	at org.apache.maven.surefire.junit4.JUnit4Provider.executeTestSet(JUnit4Provider.java:153)
	at org.apache.maven.surefire.junit4.JUnit4Provider.invoke(JUnit4Provider.java:128)
	at org.apache.maven.surefire.booter.ForkedBooter.invokeProviderInSameClassLoader(ForkedBooter.java:203)
	at org.apache.maven.surefire.booter.ForkedBooter.runSuitesInProcess(ForkedBooter.java:155)
	at org.apache.maven.surefire.booter.ForkedBooter.main(ForkedBooter.java:103)
Caused by: org.apache.directory.api.ldap.model.exception.LdapInvalidDnException: ERR_04202 A value is missing on some RDN
	at org.apache.directory.api.ldap.model.name.Dn.<init>(Dn.java:285)
	at org.apache.directory.api.ldap.model.name.Dn.<init>(Dn.java:217)
	at org.apache.directory.fortress.core.ldap.LdapDataProvider.search(LdapDataProvider.java:571)
	at org.apache.directory.fortress.core.impl.AuditDAO.searchAuthZs(AuditDAO.java:347)
	... 24 more
2018-08-27 18:02:009 INFO  LogUtil:64 - SESS-USRS TU1_UPD
2018-08-27 18:02:009 ERROR AuditMgrImplTest:239 - searchUserSessions: failed with SecurityException rc=7003, msg=searchUserMods caught LdapException id=org.apache.directory.api.ldap.model.exception.LdapInvalidDnException: ERR_04202 A value is missing on some RDN
org.apache.directory.fortress.core.FinderException: searchUserMods caught LdapException id=org.apache.directory.api.ldap.model.exception.LdapInvalidDnException: ERR_04202 A value is missing on some RDN
	at org.apache.directory.fortress.core.impl.AuditDAO.searchUserMods(AuditDAO.java:588)
	at org.apache.directory.fortress.core.impl.AuditP.searchUserMods(AuditP.java:110)
	at org.apache.directory.fortress.core.impl.AuditMgrImpl.searchUserSessions(AuditMgrImpl.java:170)
	at org.apache.directory.fortress.core.impl.AuditMgrImplTest.searchMods(AuditMgrImplTest.java:229)
	at org.apache.directory.fortress.core.impl.AuditMgrImplTest.testSearchMods(AuditMgrImplTest.java:205)
	at sun.reflect.NativeMethodAccessorImpl.invoke0(Native Method)
	at sun.reflect.NativeMethodAccessorImpl.invoke(NativeMethodAccessorImpl.java:62)
	at sun.reflect.DelegatingMethodAccessorImpl.invoke(DelegatingMethodAccessorImpl.java:43)
	at java.lang.reflect.Method.invoke(Method.java:498)
	at junit.framework.TestCase.runTest(TestCase.java:176)
	at junit.framework.TestCase.runBare(TestCase.java:141)
	at junit.framework.TestResult$1.protect(TestResult.java:122)
	at junit.framework.TestResult.runProtected(TestResult.java:142)
	at junit.framework.TestResult.run(TestResult.java:125)
	at junit.framework.TestCase.run(TestCase.java:129)
	at junit.framework.TestSuite.runTest(TestSuite.java:252)
	at junit.framework.TestSuite.run(TestSuite.java:247)
	at org.junit.internal.runners.JUnit38ClassRunner.run(JUnit38ClassRunner.java:86)
	at org.apache.maven.surefire.junit4.JUnit4Provider.execute(JUnit4Provider.java:283)
	at org.apache.maven.surefire.junit4.JUnit4Provider.executeWithRerun(JUnit4Provider.java:173)
	at org.apache.maven.surefire.junit4.JUnit4Provider.executeTestSet(JUnit4Provider.java:153)
	at org.apache.maven.surefire.junit4.JUnit4Provider.invoke(JUnit4Provider.java:128)
	at org.apache.maven.surefire.booter.ForkedBooter.invokeProviderInSameClassLoader(ForkedBooter.java:203)
	at org.apache.maven.surefire.booter.ForkedBooter.runSuitesInProcess(ForkedBooter.java:155)
	at org.apache.maven.surefire.booter.ForkedBooter.main(ForkedBooter.java:103)
Caused by: org.apache.directory.api.ldap.model.exception.LdapInvalidDnException: ERR_04202 A value is missing on some RDN
	at org.apache.directory.api.ldap.model.name.Dn.<init>(Dn.java:285)
	at org.apache.directory.api.ldap.model.name.Dn.<init>(Dn.java:217)
	at org.apache.directory.fortress.core.ldap.LdapDataProvider.search(LdapDataProvider.java:571)
	at org.apache.directory.fortress.core.impl.AuditDAO.searchUserMods(AuditDAO.java:576)
	... 24 more
2018-08-27 18:02:009 INFO  LogUtil:64 - SESS-USRS RBAC TU0
2018-08-27 18:02:009 ERROR AuditMgrImplTest:192 - searchAdminMods: failed with SecurityException rc=7004, msg=searchAdminMods caught LdapException id=org.apache.directory.api.ldap.model.exception.LdapInvalidDnException: ERR_04202 A value is missing on some RDN
org.apache.directory.fortress.core.FinderException: searchAdminMods caught LdapException id=org.apache.directory.api.ldap.model.exception.LdapInvalidDnException: ERR_04202 A value is missing on some RDN
	at org.apache.directory.fortress.core.impl.AuditDAO.searchAdminMods(AuditDAO.java:678)
	at org.apache.directory.fortress.core.impl.AuditP.searchAdminMods(AuditP.java:125)
	at org.apache.directory.fortress.core.impl.AuditMgrImpl.searchAdminMods(AuditMgrImpl.java:190)
	at org.apache.directory.fortress.core.impl.AuditMgrImplTest.searchAdminMods(AuditMgrImplTest.java:173)
	at org.apache.directory.fortress.core.impl.AuditMgrImplTest.testSearchAdminMods(AuditMgrImplTest.java:94)
	at sun.reflect.NativeMethodAccessorImpl.invoke0(Native Method)
	at sun.reflect.NativeMethodAccessorImpl.invoke(NativeMethodAccessorImpl.java:62)
	at sun.reflect.DelegatingMethodAccessorImpl.invoke(DelegatingMethodAccessorImpl.java:43)
	at java.lang.reflect.Method.invoke(Method.java:498)
	at junit.framework.TestCase.runTest(TestCase.java:176)
	at junit.framework.TestCase.runBare(TestCase.java:141)
	at junit.framework.TestResult$1.protect(TestResult.java:122)
	at junit.framework.TestResult.runProtected(TestResult.java:142)
	at junit.framework.TestResult.run(TestResult.java:125)
	at junit.framework.TestCase.run(TestCase.java:129)
	at junit.framework.TestSuite.runTest(TestSuite.java:252)
	at junit.framework.TestSuite.run(TestSuite.java:247)
	at org.junit.internal.runners.JUnit38ClassRunner.run(JUnit38ClassRunner.java:86)
	at org.apache.maven.surefire.junit4.JUnit4Provider.execute(JUnit4Provider.java:283)
	at org.apache.maven.surefire.junit4.JUnit4Provider.executeWithRerun(JUnit4Provider.java:173)
	at org.apache.maven.surefire.junit4.JUnit4Provider.executeTestSet(JUnit4Provider.java:153)
	at org.apache.maven.surefire.junit4.JUnit4Provider.invoke(JUnit4Provider.java:128)
	at org.apache.maven.surefire.booter.ForkedBooter.invokeProviderInSameClassLoader(ForkedBooter.java:203)
	at org.apache.maven.surefire.booter.ForkedBooter.runSuitesInProcess(ForkedBooter.java:155)
	at org.apache.maven.surefire.booter.ForkedBooter.main(ForkedBooter.java:103)
Caused by: org.apache.directory.api.ldap.model.exception.LdapInvalidDnException: ERR_04202 A value is missing on some RDN
	at org.apache.directory.api.ldap.model.name.Dn.<init>(Dn.java:285)
	at org.apache.directory.api.ldap.model.name.Dn.<init>(Dn.java:217)
	at org.apache.directory.fortress.core.ldap.LdapDataProvider.search(LdapDataProvider.java:571)
	at org.apache.directory.fortress.core.impl.AuditDAO.searchAdminMods(AuditDAO.java:666)
	... 24 more
NUMBER OF ADDS: 1006
NUMBER OF BINDS: 1131
NUMBER OF DELETES: 0
NUMBER OF MODS: 4112
NUMBER OF READS: 19587
NUMBER OF SEARCHES: 7019
Tests run: 132, Failures: 6, Errors: 0, Skipped: 0, Time elapsed: 213.514 sec <<< FAILURE! - in org.apache.directory.fortress.core.impl.FortressJUnitTest
testAbacConstraintsRole(org.apache.directory.fortress.core.impl.AccessMgrImplTest)  Time elapsed: 0.03 sec  <<< FAILURE!
junit.framework.AssertionFailedError: org.apache.directory.fortress.core.impl.AccessMgrImplTest.createSessionsConstraints washers cannot contain tellers, user: curly, constraint value: north
	at junit.framework.Assert.fail(Assert.java:57)
	at junit.framework.TestCase.fail(TestCase.java:227)
	at org.apache.directory.fortress.core.impl.AccessMgrImplTest.createSessionsConstraints(AccessMgrImplTest.java:1384)
	at org.apache.directory.fortress.core.impl.AccessMgrImplTest.testAbacConstraintsRole(AccessMgrImplTest.java:1297)

testSearchBinds(org.apache.directory.fortress.core.impl.AuditMgrImplTest)  Time elapsed: 0.084 sec  <<< FAILURE!
junit.framework.AssertionFailedError: LdapException in AuditDAO.searchBinds id=org.apache.directory.api.ldap.model.exception.LdapInvalidDnException: ERR_04202 A value is missing on some RDN
	at junit.framework.Assert.fail(Assert.java:57)
	at junit.framework.TestCase.fail(TestCase.java:227)
	at org.apache.directory.fortress.core.impl.AuditMgrImplTest.searchBinds(AuditMgrImplTest.java:444)
	at org.apache.directory.fortress.core.impl.AuditMgrImplTest.testSearchBinds(AuditMgrImplTest.java:399)

testGetAuthZs(org.apache.directory.fortress.core.impl.AuditMgrImplTest)  Time elapsed: 0.007 sec  <<< FAILURE!
junit.framework.AssertionFailedError: LdapException in AuditDAO.getAllAuthZs id=org.apache.directory.api.ldap.model.exception.LdapInvalidDnException: ERR_04202 A value is missing on some RDN
	at junit.framework.Assert.fail(Assert.java:57)
	at junit.framework.TestCase.fail(TestCase.java:227)
	at org.apache.directory.fortress.core.impl.AuditMgrImplTest.getAuthZs(AuditMgrImplTest.java:355)
	at org.apache.directory.fortress.core.impl.AuditMgrImplTest.testGetAuthZs(AuditMgrImplTest.java:311)

testSearchAuthZs(org.apache.directory.fortress.core.impl.AuditMgrImplTest)  Time elapsed: 0.005 sec  <<< FAILURE!
junit.framework.AssertionFailedError: LdapException in AuditDAO.searchAuthZs id=org.apache.directory.api.ldap.model.exception.LdapInvalidDnException: ERR_04202 A value is missing on some RDN
	at junit.framework.Assert.fail(Assert.java:57)
	at junit.framework.TestCase.fail(TestCase.java:227)
	at org.apache.directory.fortress.core.impl.AuditMgrImplTest.searchAuthZs(AuditMgrImplTest.java:301)
	at org.apache.directory.fortress.core.impl.AuditMgrImplTest.testSearchAuthZs(AuditMgrImplTest.java:248)

testSearchMods(org.apache.directory.fortress.core.impl.AuditMgrImplTest)  Time elapsed: 0.005 sec  <<< FAILURE!
junit.framework.AssertionFailedError: searchUserMods caught LdapException id=org.apache.directory.api.ldap.model.exception.LdapInvalidDnException: ERR_04202 A value is missing on some RDN
	at junit.framework.Assert.fail(Assert.java:57)
	at junit.framework.TestCase.fail(TestCase.java:227)
	at org.apache.directory.fortress.core.impl.AuditMgrImplTest.searchMods(AuditMgrImplTest.java:241)
	at org.apache.directory.fortress.core.impl.AuditMgrImplTest.testSearchMods(AuditMgrImplTest.java:205)

testSearchAdminMods(org.apache.directory.fortress.core.impl.AuditMgrImplTest)  Time elapsed: 0.007 sec  <<< FAILURE!
junit.framework.AssertionFailedError: searchAdminMods caught LdapException id=org.apache.directory.api.ldap.model.exception.LdapInvalidDnException: ERR_04202 A value is missing on some RDN
	at junit.framework.Assert.fail(Assert.java:57)
	at junit.framework.TestCase.fail(TestCase.java:227)
	at org.apache.directory.fortress.core.impl.AuditMgrImplTest.searchAdminMods(AuditMgrImplTest.java:195)
	at org.apache.directory.fortress.core.impl.AuditMgrImplTest.testSearchAdminMods(AuditMgrImplTest.java:94)


Results :

Failed tests: 
  AccessMgrImplTest.testAbacConstraintsRole:1297->createSessionsConstraints:1384 org.apache.directory.fortress.core.impl.AccessMgrImplTest.createSessionsConstraints washers cannot contain tellers, user: curly, constraint value: north
  AuditMgrImplTest.testGetAuthZs:311->getAuthZs:355 LdapException in AuditDAO.getAllAuthZs id=org.apache.directory.api.ldap.model.exception.LdapInvalidDnException: ERR_04202 A value is missing on some RDN
  AuditMgrImplTest.testSearchAdminMods:94->searchAdminMods:195 searchAdminMods caught LdapException id=org.apache.directory.api.ldap.model.exception.LdapInvalidDnException: ERR_04202 A value is missing on some RDN
  AuditMgrImplTest.testSearchAuthZs:248->searchAuthZs:301 LdapException in AuditDAO.searchAuthZs id=org.apache.directory.api.ldap.model.exception.LdapInvalidDnException: ERR_04202 A value is missing on some RDN
  AuditMgrImplTest.testSearchBinds:399->searchBinds:444 LdapException in AuditDAO.searchBinds id=org.apache.directory.api.ldap.model.exception.LdapInvalidDnException: ERR_04202 A value is missing on some RDN
  AuditMgrImplTest.testSearchMods:205->searchMods:241 searchUserMods caught LdapException id=org.apache.directory.api.ldap.model.exception.LdapInvalidDnException: ERR_04202 A value is missing on some RDN

Tests run: 132, Failures: 6, Errors: 0, Skipped: 0

[INFO] ------------------------------------------------------------------------
[INFO] BUILD FAILURE
[INFO] ------------------------------------------------------------------------
[INFO] Total time: 03:43 min
[INFO] Finished at: 2018-08-27T18:02:09+00:00
[INFO] Final Memory: 21M/309M
[INFO] ------------------------------------------------------------------------
[ERROR] Failed to execute goal org.apache.maven.plugins:maven-surefire-plugin:2.18.1:test (default-test) on project fortress-core: There are test failures.
[ERROR] 
[ERROR] Please refer to <https://builds.apache.org/job/dir-fortress-core-docker-openldap-test/ws/target/surefire-reports> for the individual test results.
[ERROR] -> [Help 1]
[ERROR] 
[ERROR] To see the full stack trace of the errors, re-run Maven with the -e switch.
[ERROR] Re-run Maven using the -X switch to enable full debug logging.
[ERROR] 
[ERROR] For more information about the errors and possible solutions, please read the following articles:
[ERROR] [Help 1] http://cwiki.apache.org/confluence/display/MAVEN/MojoFailureException
Build step 'Invoke top-level Maven targets' marked build as failure
[dir-fortress-core-docker-openldap-test] $ /bin/bash /tmp/jenkins6463638690137492388.sh
dir-fortress-core-docker-openldap-test
dir-fortress-core-docker-openldap-test
CONTAINER ID        IMAGE               COMMAND             CREATED             STATUS              PORTS               NAMES

Build failed in Jenkins: dir-fortress-core-docker-openldap-test #536

Posted by Apache Jenkins Server <je...@builds.apache.org>.
See <https://builds.apache.org/job/dir-fortress-core-docker-openldap-test/536/display/redirect>

------------------------------------------
[...truncated 227.75 KB...]
	at junit.framework.TestResult$1.protect(TestResult.java:122)
	at junit.framework.TestResult.runProtected(TestResult.java:142)
	at junit.framework.TestResult.run(TestResult.java:125)
	at junit.framework.TestCase.run(TestCase.java:129)
	at junit.framework.TestSuite.runTest(TestSuite.java:252)
	at junit.framework.TestSuite.run(TestSuite.java:247)
	at org.junit.internal.runners.JUnit38ClassRunner.run(JUnit38ClassRunner.java:86)
	at org.apache.maven.surefire.junit4.JUnit4Provider.execute(JUnit4Provider.java:283)
	at org.apache.maven.surefire.junit4.JUnit4Provider.executeWithRerun(JUnit4Provider.java:173)
	at org.apache.maven.surefire.junit4.JUnit4Provider.executeTestSet(JUnit4Provider.java:153)
	at org.apache.maven.surefire.junit4.JUnit4Provider.invoke(JUnit4Provider.java:128)
	at org.apache.maven.surefire.booter.ForkedBooter.invokeProviderInSameClassLoader(ForkedBooter.java:203)
	at org.apache.maven.surefire.booter.ForkedBooter.runSuitesInProcess(ForkedBooter.java:155)
	at org.apache.maven.surefire.booter.ForkedBooter.main(ForkedBooter.java:103)
Caused by: org.apache.directory.api.ldap.model.exception.LdapException: org.apache.directory.api.ldap.model.exception.LdapInvalidDnException: ERR_04202 A value is missing on some RDN
	at org.apache.directory.fortress.core.ldap.LdapConnectionProvider.getLogConnection(LdapConnectionProvider.java:343)
	at org.apache.directory.fortress.core.ldap.LdapDataProvider.getLogConnection(LdapDataProvider.java:1261)
	at org.apache.directory.fortress.core.impl.AuditDAO.getAllAuthZs(AuditDAO.java:436)
	... 24 more
Caused by: org.apache.directory.api.ldap.model.exception.LdapInvalidDnException: ERR_04202 A value is missing on some RDN
	at org.apache.directory.api.ldap.model.name.Dn.<init>(Dn.java:285)
	at org.apache.directory.ldap.client.api.AbstractLdapConnection.bind(AbstractLdapConnection.java:114)
	at org.apache.directory.ldap.client.api.DefaultLdapConnectionFactory.bindConnection(DefaultLdapConnectionFactory.java:64)
	at org.apache.directory.ldap.client.api.DefaultLdapConnectionFactory.newLdapConnection(DefaultLdapConnectionFactory.java:107)
	at org.apache.directory.ldap.client.api.ValidatingPoolableLdapConnectionFactory.makeObject(ValidatingPoolableLdapConnectionFactory.java:134)
	at org.apache.directory.ldap.client.api.ValidatingPoolableLdapConnectionFactory.makeObject(ValidatingPoolableLdapConnectionFactory.java:59)
	at org.apache.commons.pool.impl.GenericObjectPool.borrowObject(GenericObjectPool.java:1188)
	at org.apache.directory.ldap.client.api.LdapConnectionPool.getConnection(LdapConnectionPool.java:123)
	at org.apache.directory.fortress.core.ldap.LdapConnectionProvider.getLogConnection(LdapConnectionProvider.java:339)
	... 26 more
2018-08-27 17:52:040 INFO  LogUtil:64 - GET-AUTHZ TU1_UPD
2018-08-27 17:52:040 ERROR DefaultLdapConnectionFactory:68 - unable to bind connection: ERR_04202 A value is missing on some RDN
2018-08-27 17:52:040 ERROR AuditMgrImplTest:298 - searchAuthZs: failed with SecurityException rc=7002, msg=LdapException in AuditDAO.searchAuthZs id=org.apache.directory.api.ldap.model.exception.LdapException: org.apache.directory.api.ldap.model.exception.LdapInvalidDnException: ERR_04202 A value is missing on some RDN
org.apache.directory.fortress.core.FinderException: LdapException in AuditDAO.searchAuthZs id=org.apache.directory.api.ldap.model.exception.LdapException: org.apache.directory.api.ldap.model.exception.LdapInvalidDnException: ERR_04202 A value is missing on some RDN
	at org.apache.directory.fortress.core.impl.AuditDAO.searchAuthZs(AuditDAO.java:359)
	at org.apache.directory.fortress.core.impl.AuditP.searchAuthZs(AuditP.java:82)
	at org.apache.directory.fortress.core.impl.AuditMgrImpl.searchAuthZs(AuditMgrImpl.java:141)
	at org.apache.directory.fortress.core.impl.AuditMgrImplTest.searchAuthZs(AuditMgrImplTest.java:286)
	at org.apache.directory.fortress.core.impl.AuditMgrImplTest.testSearchAuthZs(AuditMgrImplTest.java:248)
	at sun.reflect.NativeMethodAccessorImpl.invoke0(Native Method)
	at sun.reflect.NativeMethodAccessorImpl.invoke(NativeMethodAccessorImpl.java:62)
	at sun.reflect.DelegatingMethodAccessorImpl.invoke(DelegatingMethodAccessorImpl.java:43)
	at java.lang.reflect.Method.invoke(Method.java:498)
	at junit.framework.TestCase.runTest(TestCase.java:176)
	at junit.framework.TestCase.runBare(TestCase.java:141)
	at junit.framework.TestResult$1.protect(TestResult.java:122)
	at junit.framework.TestResult.runProtected(TestResult.java:142)
	at junit.framework.TestResult.run(TestResult.java:125)
	at junit.framework.TestCase.run(TestCase.java:129)
	at junit.framework.TestSuite.runTest(TestSuite.java:252)
	at junit.framework.TestSuite.run(TestSuite.java:247)
	at org.junit.internal.runners.JUnit38ClassRunner.run(JUnit38ClassRunner.java:86)
	at org.apache.maven.surefire.junit4.JUnit4Provider.execute(JUnit4Provider.java:283)
	at org.apache.maven.surefire.junit4.JUnit4Provider.executeWithRerun(JUnit4Provider.java:173)
	at org.apache.maven.surefire.junit4.JUnit4Provider.executeTestSet(JUnit4Provider.java:153)
	at org.apache.maven.surefire.junit4.JUnit4Provider.invoke(JUnit4Provider.java:128)
	at org.apache.maven.surefire.booter.ForkedBooter.invokeProviderInSameClassLoader(ForkedBooter.java:203)
	at org.apache.maven.surefire.booter.ForkedBooter.runSuitesInProcess(ForkedBooter.java:155)
	at org.apache.maven.surefire.booter.ForkedBooter.main(ForkedBooter.java:103)
Caused by: org.apache.directory.api.ldap.model.exception.LdapException: org.apache.directory.api.ldap.model.exception.LdapInvalidDnException: ERR_04202 A value is missing on some RDN
	at org.apache.directory.fortress.core.ldap.LdapConnectionProvider.getLogConnection(LdapConnectionProvider.java:343)
	at org.apache.directory.fortress.core.ldap.LdapDataProvider.getLogConnection(LdapDataProvider.java:1261)
	at org.apache.directory.fortress.core.impl.AuditDAO.searchAuthZs(AuditDAO.java:346)
	... 24 more
Caused by: org.apache.directory.api.ldap.model.exception.LdapInvalidDnException: ERR_04202 A value is missing on some RDN
	at org.apache.directory.api.ldap.model.name.Dn.<init>(Dn.java:285)
	at org.apache.directory.ldap.client.api.AbstractLdapConnection.bind(AbstractLdapConnection.java:114)
	at org.apache.directory.ldap.client.api.DefaultLdapConnectionFactory.bindConnection(DefaultLdapConnectionFactory.java:64)
	at org.apache.directory.ldap.client.api.DefaultLdapConnectionFactory.newLdapConnection(DefaultLdapConnectionFactory.java:107)
	at org.apache.directory.ldap.client.api.ValidatingPoolableLdapConnectionFactory.makeObject(ValidatingPoolableLdapConnectionFactory.java:134)
	at org.apache.directory.ldap.client.api.ValidatingPoolableLdapConnectionFactory.makeObject(ValidatingPoolableLdapConnectionFactory.java:59)
	at org.apache.commons.pool.impl.GenericObjectPool.borrowObject(GenericObjectPool.java:1188)
	at org.apache.directory.ldap.client.api.LdapConnectionPool.getConnection(LdapConnectionPool.java:123)
	at org.apache.directory.fortress.core.ldap.LdapConnectionProvider.getLogConnection(LdapConnectionProvider.java:339)
	... 26 more
2018-08-27 17:52:040 INFO  LogUtil:64 - SESS-USRS TU1_UPD
2018-08-27 17:52:040 ERROR DefaultLdapConnectionFactory:68 - unable to bind connection: ERR_04202 A value is missing on some RDN
2018-08-27 17:52:040 ERROR AuditMgrImplTest:239 - searchUserSessions: failed with SecurityException rc=7003, msg=searchUserMods caught LdapException id=org.apache.directory.api.ldap.model.exception.LdapException: org.apache.directory.api.ldap.model.exception.LdapInvalidDnException: ERR_04202 A value is missing on some RDN
org.apache.directory.fortress.core.FinderException: searchUserMods caught LdapException id=org.apache.directory.api.ldap.model.exception.LdapException: org.apache.directory.api.ldap.model.exception.LdapInvalidDnException: ERR_04202 A value is missing on some RDN
	at org.apache.directory.fortress.core.impl.AuditDAO.searchUserMods(AuditDAO.java:588)
	at org.apache.directory.fortress.core.impl.AuditP.searchUserMods(AuditP.java:110)
	at org.apache.directory.fortress.core.impl.AuditMgrImpl.searchUserSessions(AuditMgrImpl.java:170)
	at org.apache.directory.fortress.core.impl.AuditMgrImplTest.searchMods(AuditMgrImplTest.java:229)
	at org.apache.directory.fortress.core.impl.AuditMgrImplTest.testSearchMods(AuditMgrImplTest.java:205)
	at sun.reflect.NativeMethodAccessorImpl.invoke0(Native Method)
	at sun.reflect.NativeMethodAccessorImpl.invoke(NativeMethodAccessorImpl.java:62)
	at sun.reflect.DelegatingMethodAccessorImpl.invoke(DelegatingMethodAccessorImpl.java:43)
	at java.lang.reflect.Method.invoke(Method.java:498)
	at junit.framework.TestCase.runTest(TestCase.java:176)
	at junit.framework.TestCase.runBare(TestCase.java:141)
	at junit.framework.TestResult$1.protect(TestResult.java:122)
	at junit.framework.TestResult.runProtected(TestResult.java:142)
	at junit.framework.TestResult.run(TestResult.java:125)
	at junit.framework.TestCase.run(TestCase.java:129)
	at junit.framework.TestSuite.runTest(TestSuite.java:252)
	at junit.framework.TestSuite.run(TestSuite.java:247)
	at org.junit.internal.runners.JUnit38ClassRunner.run(JUnit38ClassRunner.java:86)
	at org.apache.maven.surefire.junit4.JUnit4Provider.execute(JUnit4Provider.java:283)
	at org.apache.maven.surefire.junit4.JUnit4Provider.executeWithRerun(JUnit4Provider.java:173)
	at org.apache.maven.surefire.junit4.JUnit4Provider.executeTestSet(JUnit4Provider.java:153)
	at org.apache.maven.surefire.junit4.JUnit4Provider.invoke(JUnit4Provider.java:128)
	at org.apache.maven.surefire.booter.ForkedBooter.invokeProviderInSameClassLoader(ForkedBooter.java:203)
	at org.apache.maven.surefire.booter.ForkedBooter.runSuitesInProcess(ForkedBooter.java:155)
	at org.apache.maven.surefire.booter.ForkedBooter.main(ForkedBooter.java:103)
Caused by: org.apache.directory.api.ldap.model.exception.LdapException: org.apache.directory.api.ldap.model.exception.LdapInvalidDnException: ERR_04202 A value is missing on some RDN
	at org.apache.directory.fortress.core.ldap.LdapConnectionProvider.getLogConnection(LdapConnectionProvider.java:343)
	at org.apache.directory.fortress.core.ldap.LdapDataProvider.getLogConnection(LdapDataProvider.java:1261)
	at org.apache.directory.fortress.core.impl.AuditDAO.searchUserMods(AuditDAO.java:575)
	... 24 more
Caused by: org.apache.directory.api.ldap.model.exception.LdapInvalidDnException: ERR_04202 A value is missing on some RDN
	at org.apache.directory.api.ldap.model.name.Dn.<init>(Dn.java:285)
	at org.apache.directory.ldap.client.api.AbstractLdapConnection.bind(AbstractLdapConnection.java:114)
	at org.apache.directory.ldap.client.api.DefaultLdapConnectionFactory.bindConnection(DefaultLdapConnectionFactory.java:64)
	at org.apache.directory.ldap.client.api.DefaultLdapConnectionFactory.newLdapConnection(DefaultLdapConnectionFactory.java:107)
	at org.apache.directory.ldap.client.api.ValidatingPoolableLdapConnectionFactory.makeObject(ValidatingPoolableLdapConnectionFactory.java:134)
	at org.apache.directory.ldap.client.api.ValidatingPoolableLdapConnectionFactory.makeObject(ValidatingPoolableLdapConnectionFactory.java:59)
	at org.apache.commons.pool.impl.GenericObjectPool.borrowObject(GenericObjectPool.java:1188)
	at org.apache.directory.ldap.client.api.LdapConnectionPool.getConnection(LdapConnectionPool.java:123)
	at org.apache.directory.fortress.core.ldap.LdapConnectionProvider.getLogConnection(LdapConnectionProvider.java:339)
	... 26 more
2018-08-27 17:52:041 INFO  LogUtil:64 - SESS-USRS RBAC TU0
2018-08-27 17:52:041 ERROR DefaultLdapConnectionFactory:68 - unable to bind connection: ERR_04202 A value is missing on some RDN
2018-08-27 17:52:041 ERROR AuditMgrImplTest:192 - searchAdminMods: failed with SecurityException rc=7004, msg=searchAdminMods caught LdapException id=org.apache.directory.api.ldap.model.exception.LdapException: org.apache.directory.api.ldap.model.exception.LdapInvalidDnException: ERR_04202 A value is missing on some RDN
org.apache.directory.fortress.core.FinderException: searchAdminMods caught LdapException id=org.apache.directory.api.ldap.model.exception.LdapException: org.apache.directory.api.ldap.model.exception.LdapInvalidDnException: ERR_04202 A value is missing on some RDN
	at org.apache.directory.fortress.core.impl.AuditDAO.searchAdminMods(AuditDAO.java:678)
	at org.apache.directory.fortress.core.impl.AuditP.searchAdminMods(AuditP.java:125)
	at org.apache.directory.fortress.core.impl.AuditMgrImpl.searchAdminMods(AuditMgrImpl.java:190)
	at org.apache.directory.fortress.core.impl.AuditMgrImplTest.searchAdminMods(AuditMgrImplTest.java:173)
	at org.apache.directory.fortress.core.impl.AuditMgrImplTest.testSearchAdminMods(AuditMgrImplTest.java:94)
	at sun.reflect.NativeMethodAccessorImpl.invoke0(Native Method)
	at sun.reflect.NativeMethodAccessorImpl.invoke(NativeMethodAccessorImpl.java:62)
	at sun.reflect.DelegatingMethodAccessorImpl.invoke(DelegatingMethodAccessorImpl.java:43)
	at java.lang.reflect.Method.invoke(Method.java:498)
	at junit.framework.TestCase.runTest(TestCase.java:176)
	at junit.framework.TestCase.runBare(TestCase.java:141)
	at junit.framework.TestResult$1.protect(TestResult.java:122)
	at junit.framework.TestResult.runProtected(TestResult.java:142)
	at junit.framework.TestResult.run(TestResult.java:125)
	at junit.framework.TestCase.run(TestCase.java:129)
	at junit.framework.TestSuite.runTest(TestSuite.java:252)
	at junit.framework.TestSuite.run(TestSuite.java:247)
	at org.junit.internal.runners.JUnit38ClassRunner.run(JUnit38ClassRunner.java:86)
	at org.apache.maven.surefire.junit4.JUnit4Provider.execute(JUnit4Provider.java:283)
	at org.apache.maven.surefire.junit4.JUnit4Provider.executeWithRerun(JUnit4Provider.java:173)
	at org.apache.maven.surefire.junit4.JUnit4Provider.executeTestSet(JUnit4Provider.java:153)
	at org.apache.maven.surefire.junit4.JUnit4Provider.invoke(JUnit4Provider.java:128)
	at org.apache.maven.surefire.booter.ForkedBooter.invokeProviderInSameClassLoader(ForkedBooter.java:203)
	at org.apache.maven.surefire.booter.ForkedBooter.runSuitesInProcess(ForkedBooter.java:155)
	at org.apache.maven.surefire.booter.ForkedBooter.main(ForkedBooter.java:103)
Caused by: org.apache.directory.api.ldap.model.exception.LdapException: org.apache.directory.api.ldap.model.exception.LdapInvalidDnException: ERR_04202 A value is missing on some RDN
	at org.apache.directory.fortress.core.ldap.LdapConnectionProvider.getLogConnection(LdapConnectionProvider.java:343)
	at org.apache.directory.fortress.core.ldap.LdapDataProvider.getLogConnection(LdapDataProvider.java:1261)
	at org.apache.directory.fortress.core.impl.AuditDAO.searchAdminMods(AuditDAO.java:665)
	... 24 more
Caused by: org.apache.directory.api.ldap.model.exception.LdapInvalidDnException: ERR_04202 A value is missing on some RDN
	at org.apache.directory.api.ldap.model.name.Dn.<init>(Dn.java:285)
	at org.apache.directory.ldap.client.api.AbstractLdapConnection.bind(AbstractLdapConnection.java:114)
	at org.apache.directory.ldap.client.api.DefaultLdapConnectionFactory.bindConnection(DefaultLdapConnectionFactory.java:64)
	at org.apache.directory.ldap.client.api.DefaultLdapConnectionFactory.newLdapConnection(DefaultLdapConnectionFactory.java:107)
	at org.apache.directory.ldap.client.api.ValidatingPoolableLdapConnectionFactory.makeObject(ValidatingPoolableLdapConnectionFactory.java:134)
	at org.apache.directory.ldap.client.api.ValidatingPoolableLdapConnectionFactory.makeObject(ValidatingPoolableLdapConnectionFactory.java:59)
	at org.apache.commons.pool.impl.GenericObjectPool.borrowObject(GenericObjectPool.java:1188)
	at org.apache.directory.ldap.client.api.LdapConnectionPool.getConnection(LdapConnectionPool.java:123)
	at org.apache.directory.fortress.core.ldap.LdapConnectionProvider.getLogConnection(LdapConnectionProvider.java:339)
	... 26 more
NUMBER OF ADDS: 1006
NUMBER OF BINDS: 1131
NUMBER OF DELETES: 0
NUMBER OF MODS: 4112
NUMBER OF READS: 19587
NUMBER OF SEARCHES: 7014
Tests run: 132, Failures: 6, Errors: 0, Skipped: 0, Time elapsed: 216.739 sec <<< FAILURE! - in org.apache.directory.fortress.core.impl.FortressJUnitTest
testAbacConstraintsRole(org.apache.directory.fortress.core.impl.AccessMgrImplTest)  Time elapsed: 0.022 sec  <<< FAILURE!
junit.framework.AssertionFailedError: org.apache.directory.fortress.core.impl.AccessMgrImplTest.createSessionsConstraints washers cannot contain tellers, user: curly, constraint value: north
	at junit.framework.Assert.fail(Assert.java:57)
	at junit.framework.TestCase.fail(TestCase.java:227)
	at org.apache.directory.fortress.core.impl.AccessMgrImplTest.createSessionsConstraints(AccessMgrImplTest.java:1384)
	at org.apache.directory.fortress.core.impl.AccessMgrImplTest.testAbacConstraintsRole(AccessMgrImplTest.java:1297)

testSearchBinds(org.apache.directory.fortress.core.impl.AuditMgrImplTest)  Time elapsed: 0.074 sec  <<< FAILURE!
junit.framework.AssertionFailedError: LdapException in AuditDAO.searchBinds id=org.apache.directory.api.ldap.model.exception.LdapException: org.apache.directory.api.ldap.model.exception.LdapInvalidDnException: ERR_04202 A value is missing on some RDN
	at junit.framework.Assert.fail(Assert.java:57)
	at junit.framework.TestCase.fail(TestCase.java:227)
	at org.apache.directory.fortress.core.impl.AuditMgrImplTest.searchBinds(AuditMgrImplTest.java:444)
	at org.apache.directory.fortress.core.impl.AuditMgrImplTest.testSearchBinds(AuditMgrImplTest.java:399)

testGetAuthZs(org.apache.directory.fortress.core.impl.AuditMgrImplTest)  Time elapsed: 0.006 sec  <<< FAILURE!
junit.framework.AssertionFailedError: LdapException in AuditDAO.getAllAuthZs id=org.apache.directory.api.ldap.model.exception.LdapException: org.apache.directory.api.ldap.model.exception.LdapInvalidDnException: ERR_04202 A value is missing on some RDN
	at junit.framework.Assert.fail(Assert.java:57)
	at junit.framework.TestCase.fail(TestCase.java:227)
	at org.apache.directory.fortress.core.impl.AuditMgrImplTest.getAuthZs(AuditMgrImplTest.java:355)
	at org.apache.directory.fortress.core.impl.AuditMgrImplTest.testGetAuthZs(AuditMgrImplTest.java:311)

testSearchAuthZs(org.apache.directory.fortress.core.impl.AuditMgrImplTest)  Time elapsed: 0.004 sec  <<< FAILURE!
junit.framework.AssertionFailedError: LdapException in AuditDAO.searchAuthZs id=org.apache.directory.api.ldap.model.exception.LdapException: org.apache.directory.api.ldap.model.exception.LdapInvalidDnException: ERR_04202 A value is missing on some RDN
	at junit.framework.Assert.fail(Assert.java:57)
	at junit.framework.TestCase.fail(TestCase.java:227)
	at org.apache.directory.fortress.core.impl.AuditMgrImplTest.searchAuthZs(AuditMgrImplTest.java:301)
	at org.apache.directory.fortress.core.impl.AuditMgrImplTest.testSearchAuthZs(AuditMgrImplTest.java:248)

testSearchMods(org.apache.directory.fortress.core.impl.AuditMgrImplTest)  Time elapsed: 0.003 sec  <<< FAILURE!
junit.framework.AssertionFailedError: searchUserMods caught LdapException id=org.apache.directory.api.ldap.model.exception.LdapException: org.apache.directory.api.ldap.model.exception.LdapInvalidDnException: ERR_04202 A value is missing on some RDN
	at junit.framework.Assert.fail(Assert.java:57)
	at junit.framework.TestCase.fail(TestCase.java:227)
	at org.apache.directory.fortress.core.impl.AuditMgrImplTest.searchMods(AuditMgrImplTest.java:241)
	at org.apache.directory.fortress.core.impl.AuditMgrImplTest.testSearchMods(AuditMgrImplTest.java:205)

testSearchAdminMods(org.apache.directory.fortress.core.impl.AuditMgrImplTest)  Time elapsed: 0.005 sec  <<< FAILURE!
junit.framework.AssertionFailedError: searchAdminMods caught LdapException id=org.apache.directory.api.ldap.model.exception.LdapException: org.apache.directory.api.ldap.model.exception.LdapInvalidDnException: ERR_04202 A value is missing on some RDN
	at junit.framework.Assert.fail(Assert.java:57)
	at junit.framework.TestCase.fail(TestCase.java:227)
	at org.apache.directory.fortress.core.impl.AuditMgrImplTest.searchAdminMods(AuditMgrImplTest.java:195)
	at org.apache.directory.fortress.core.impl.AuditMgrImplTest.testSearchAdminMods(AuditMgrImplTest.java:94)


Results :

Failed tests: 
  AccessMgrImplTest.testAbacConstraintsRole:1297->createSessionsConstraints:1384 org.apache.directory.fortress.core.impl.AccessMgrImplTest.createSessionsConstraints washers cannot contain tellers, user: curly, constraint value: north
  AuditMgrImplTest.testGetAuthZs:311->getAuthZs:355 LdapException in AuditDAO.getAllAuthZs id=org.apache.directory.api.ldap.model.exception.LdapException: org.apache.directory.api.ldap.model.exception.LdapInvalidDnException: ERR_04202 A value is missing on some RDN
  AuditMgrImplTest.testSearchAdminMods:94->searchAdminMods:195 searchAdminMods caught LdapException id=org.apache.directory.api.ldap.model.exception.LdapException: org.apache.directory.api.ldap.model.exception.LdapInvalidDnException: ERR_04202 A value is missing on some RDN
  AuditMgrImplTest.testSearchAuthZs:248->searchAuthZs:301 LdapException in AuditDAO.searchAuthZs id=org.apache.directory.api.ldap.model.exception.LdapException: org.apache.directory.api.ldap.model.exception.LdapInvalidDnException: ERR_04202 A value is missing on some RDN
  AuditMgrImplTest.testSearchBinds:399->searchBinds:444 LdapException in AuditDAO.searchBinds id=org.apache.directory.api.ldap.model.exception.LdapException: org.apache.directory.api.ldap.model.exception.LdapInvalidDnException: ERR_04202 A value is missing on some RDN
  AuditMgrImplTest.testSearchMods:205->searchMods:241 searchUserMods caught LdapException id=org.apache.directory.api.ldap.model.exception.LdapException: org.apache.directory.api.ldap.model.exception.LdapInvalidDnException: ERR_04202 A value is missing on some RDN

Tests run: 132, Failures: 6, Errors: 0, Skipped: 0

[INFO] ------------------------------------------------------------------------
[INFO] BUILD FAILURE
[INFO] ------------------------------------------------------------------------
[INFO] Total time: 03:46 min
[INFO] Finished at: 2018-08-27T17:52:41+00:00
[INFO] Final Memory: 21M/327M
[INFO] ------------------------------------------------------------------------
[ERROR] Failed to execute goal org.apache.maven.plugins:maven-surefire-plugin:2.18.1:test (default-test) on project fortress-core: There are test failures.
[ERROR] 
[ERROR] Please refer to <https://builds.apache.org/job/dir-fortress-core-docker-openldap-test/ws/target/surefire-reports> for the individual test results.
[ERROR] -> [Help 1]
[ERROR] 
[ERROR] To see the full stack trace of the errors, re-run Maven with the -e switch.
[ERROR] Re-run Maven using the -X switch to enable full debug logging.
[ERROR] 
[ERROR] For more information about the errors and possible solutions, please read the following articles:
[ERROR] [Help 1] http://cwiki.apache.org/confluence/display/MAVEN/MojoFailureException
Build step 'Invoke top-level Maven targets' marked build as failure
[dir-fortress-core-docker-openldap-test] $ /bin/bash /tmp/jenkins1403630941925425591.sh
dir-fortress-core-docker-openldap-test
dir-fortress-core-docker-openldap-test
CONTAINER ID        IMAGE               COMMAND             CREATED             STATUS              PORTS               NAMES