You are viewing a plain text version of this content. The canonical link for it is here.
Posted to dev@stratos.apache.org by Dale Chalfant <dc...@greaterbrain.com> on 2014/07/14 21:31:15 UTC

jclouds exception performing mvn clean install

Hello devs:

I ran a mvn clean install and the build failed; please see below.
Is this an issue with the Stratos' fork of jclouds, or should I post to the jclouds dev mailing list?

Test suite progress: tests succeeded: 385, failed: 1, skipped: 0.
[pool-70-thread-2] Test testRuleStartPortWhenNotEqual(org.jclouds.openstack.nova.v2_0.predicates.SecurityGroupPredicatesTest) succeeded: 2ms
Test suite progress: tests succeeded: 386, failed: 1, skipped: 0.
Tests run: 387, Failures: 1, Errors: 0, Skipped: 0, Time elapsed: 48.763 sec <<< FAILURE!
testCreateSecurityGroup(org.jclouds.openstack.nova.v2_0.compute.extensions.NovaSecurityGroupExtensionExpectTest)  Time elapsed: 0.001 sec  <<< FAILURE!
com.google.common.util.concurrent.UncheckedExecutionException: java.lang.IllegalArgumentException: timeout value is negative
                at com.google.common.cache.LocalCache$Segment.get(LocalCache.java:2199)
                at com.google.common.cache.LocalCache.get(LocalCache.java:3932)
                at com.google.common.cache.LocalCache.getOrLoad(LocalCache.java:3936)
                at com.google.common.cache.LocalCache$LocalLoadingCache.get(LocalCache.java:4806)
                at com.google.common.cache.LocalCache$LocalLoadingCache.getUnchecked(LocalCache.java:4812)
                at com.google.common.cache.LocalCache$LocalLoadingCache.apply(LocalCache.java:4830)
                at org.jclouds.openstack.nova.v2_0.compute.extensions.NovaSecurityGroupExtension.createSecurityGroup(NovaSecurityGroupExtension.java:176)
                at org.jclouds.openstack.nova.v2_0.compute.extensions.NovaSecurityGroupExtension.createSecurityGroup(NovaSecurityGroupExtension.java:169)
                at org.jclouds.openstack.nova.v2_0.compute.extensions.NovaSecurityGroupExtensionExpectTest.testCreateSecurityGroup(NovaSecurityGroupExtensionExpectTest.java:199)
Caused by: java.lang.IllegalArgumentException: timeout value is negative
                at java.lang.Thread.sleep(Native Method)
                at org.jclouds.util.Predicates2$RetryablePredicate.apply(Predicates2.java:109)
                at org.jclouds.openstack.nova.v2_0.compute.loaders.FindSecurityGroupOrCreate.load(FindSecurityGroupOrCreate.java:57)
                at org.jclouds.openstack.nova.v2_0.compute.loaders.FindSecurityGroupOrCreate.load(FindSecurityGroupOrCreate.java:39)
                at com.google.common.cache.LocalCache$LoadingValueReference.loadFuture(LocalCache.java:3522)
                at com.google.common.cache.LocalCache$Segment.loadSync(LocalCache.java:2315)
                at com.google.common.cache.LocalCache$Segment.lockedGetOrLoad(LocalCache.java:2278)
                at com.google.common.cache.LocalCache$Segment.get(LocalCache.java:2193)
                ... 21 more


Results :

Failed tests:   testCreateSecurityGroup(org.jclouds.openstack.nova.v2_0.compute.extensions.NovaSecurityGroupExtensionExpectTest): java.lang.IllegalArgumentException: timeout value is negative

Tests run: 387, Failures: 1, Errors: 0, Skipped: 0


Kind regards,


Dale Chalfant

[http://greaterbrain.com/Pages/signature.png]


Re: jclouds exception performing mvn clean install

Posted by Nirmal Fernando <ni...@gmail.com>.
ok.. Cool.. Thanks for update Dale.


On Tue, Jul 15, 2014 at 5:08 PM, Dale Chalfant <dc...@greaterbrain.com>
wrote:

>  This is no longer occurring; please disregard.
>
>
>
> Thanks,
>
> Dale
>
>
>
> *From:* Dale Chalfant [mailto:dchalfant@greaterbrain.com]
> *Sent:* Monday, July 14, 2014 3:31 PM
> *To:* dev@stratos.apache.org
> *Subject:* jclouds exception performing mvn clean install
>
>
>
> Hello devs:
>
>
>
> I ran a mvn clean install and the build failed; please see below.
>
> Is this an issue with the Stratos’ fork of jclouds, or should I post to
> the jclouds dev mailing list?
>
>
>
> Test suite progress: tests succeeded: 385, failed: 1, skipped: 0.
>
> [pool-70-thread-2] Test
> testRuleStartPortWhenNotEqual(org.jclouds.openstack.nova.v2_0.predicates.SecurityGroupPredicatesTest)
> succeeded: 2ms
>
> Test suite progress: tests succeeded: 386, failed: 1, skipped: 0.
>
> Tests run: 387, Failures: 1, Errors: 0, Skipped: 0, Time elapsed: 48.763
> sec <<< FAILURE!
>
> testCreateSecurityGroup(org.jclouds.openstack.nova.v2_0.compute.extensions.NovaSecurityGroupExtensionExpectTest)
> Time elapsed: 0.001 sec  <<< FAILURE!
>
> com.google.common.util.concurrent.UncheckedExecutionException:
> java.lang.IllegalArgumentException: timeout value is negative
>
>                 at
> com.google.common.cache.LocalCache$Segment.get(LocalCache.java:2199)
>
>                 at
> com.google.common.cache.LocalCache.get(LocalCache.java:3932)
>
>                 at
> com.google.common.cache.LocalCache.getOrLoad(LocalCache.java:3936)
>
>                 at
> com.google.common.cache.LocalCache$LocalLoadingCache.get(LocalCache.java:4806)
>
>                 at
> com.google.common.cache.LocalCache$LocalLoadingCache.getUnchecked(LocalCache.java:4812)
>
>                 at
> com.google.common.cache.LocalCache$LocalLoadingCache.apply(LocalCache.java:4830)
>
>                 at
> org.jclouds.openstack.nova.v2_0.compute.extensions.NovaSecurityGroupExtension.createSecurityGroup(NovaSecurityGroupExtension.java:176)
>
>                 at
> org.jclouds.openstack.nova.v2_0.compute.extensions.NovaSecurityGroupExtension.createSecurityGroup(NovaSecurityGroupExtension.java:169)
>
>                 at
> org.jclouds.openstack.nova.v2_0.compute.extensions.NovaSecurityGroupExtensionExpectTest.testCreateSecurityGroup(NovaSecurityGroupExtensionExpectTest.java:199)
>
> Caused by: java.lang.IllegalArgumentException: timeout value is negative
>
>                 at java.lang.Thread.sleep(Native Method)
>
>                 at
> org.jclouds.util.Predicates2$RetryablePredicate.apply(Predicates2.java:109)
>
>                 at
> org.jclouds.openstack.nova.v2_0.compute.loaders.FindSecurityGroupOrCreate.load(FindSecurityGroupOrCreate.java:57)
>
>                 at
> org.jclouds.openstack.nova.v2_0.compute.loaders.FindSecurityGroupOrCreate.load(FindSecurityGroupOrCreate.java:39)
>
>                 at
> com.google.common.cache.LocalCache$LoadingValueReference.loadFuture(LocalCache.java:3522)
>
>                 at
> com.google.common.cache.LocalCache$Segment.loadSync(LocalCache.java:2315)
>
>                 at
> com.google.common.cache.LocalCache$Segment.lockedGetOrLoad(LocalCache.java:2278)
>
>                 at
> com.google.common.cache.LocalCache$Segment.get(LocalCache.java:2193)
>
>                 ... 21 more
>
>
>
>
>
> Results :
>
>
>
> Failed tests:
> testCreateSecurityGroup(org.jclouds.openstack.nova.v2_0.compute.extensions.NovaSecurityGroupExtensionExpectTest):
> java.lang.IllegalArgumentException: timeout value is negative
>
>
>
> Tests run: 387, Failures: 1, Errors: 0, Skipped: 0
>
>
>
>
>
> Kind regards,
>
>
>
>
>
> Dale Chalfant
>
>
>
> [image: http://greaterbrain.com/Pages/signature.png]
>
>
>



-- 
Best Regards,
Nirmal

Nirmal Fernando.
PPMC Member & Committer of Apache Stratos,
Senior Software Engineer, WSO2 Inc.

Blog: http://nirmalfdo.blogspot.com/

RE: jclouds exception performing mvn clean install

Posted by Dale Chalfant <dc...@greaterbrain.com>.
This is no longer occurring; please disregard.

Thanks,
Dale

From: Dale Chalfant [mailto:dchalfant@greaterbrain.com]
Sent: Monday, July 14, 2014 3:31 PM
To: dev@stratos.apache.org
Subject: jclouds exception performing mvn clean install

Hello devs:

I ran a mvn clean install and the build failed; please see below.
Is this an issue with the Stratos' fork of jclouds, or should I post to the jclouds dev mailing list?

Test suite progress: tests succeeded: 385, failed: 1, skipped: 0.
[pool-70-thread-2] Test testRuleStartPortWhenNotEqual(org.jclouds.openstack.nova.v2_0.predicates.SecurityGroupPredicatesTest) succeeded: 2ms
Test suite progress: tests succeeded: 386, failed: 1, skipped: 0.
Tests run: 387, Failures: 1, Errors: 0, Skipped: 0, Time elapsed: 48.763 sec <<< FAILURE!
testCreateSecurityGroup(org.jclouds.openstack.nova.v2_0.compute.extensions.NovaSecurityGroupExtensionExpectTest)  Time elapsed: 0.001 sec  <<< FAILURE!
com.google.common.util.concurrent.UncheckedExecutionException: java.lang.IllegalArgumentException: timeout value is negative
                at com.google.common.cache.LocalCache$Segment.get(LocalCache.java:2199)
                at com.google.common.cache.LocalCache.get(LocalCache.java:3932)
                at com.google.common.cache.LocalCache.getOrLoad(LocalCache.java:3936)
                at com.google.common.cache.LocalCache$LocalLoadingCache.get(LocalCache.java:4806)
                at com.google.common.cache.LocalCache$LocalLoadingCache.getUnchecked(LocalCache.java:4812)
                at com.google.common.cache.LocalCache$LocalLoadingCache.apply(LocalCache.java:4830)
                at org.jclouds.openstack.nova.v2_0.compute.extensions.NovaSecurityGroupExtension.createSecurityGroup(NovaSecurityGroupExtension.java:176)
                at org.jclouds.openstack.nova.v2_0.compute.extensions.NovaSecurityGroupExtension.createSecurityGroup(NovaSecurityGroupExtension.java:169)
                at org.jclouds.openstack.nova.v2_0.compute.extensions.NovaSecurityGroupExtensionExpectTest.testCreateSecurityGroup(NovaSecurityGroupExtensionExpectTest.java:199)
Caused by: java.lang.IllegalArgumentException: timeout value is negative
                at java.lang.Thread.sleep(Native Method)
                at org.jclouds.util.Predicates2$RetryablePredicate.apply(Predicates2.java:109)
                at org.jclouds.openstack.nova.v2_0.compute.loaders.FindSecurityGroupOrCreate.load(FindSecurityGroupOrCreate.java:57)
                at org.jclouds.openstack.nova.v2_0.compute.loaders.FindSecurityGroupOrCreate.load(FindSecurityGroupOrCreate.java:39)
                at com.google.common.cache.LocalCache$LoadingValueReference.loadFuture(LocalCache.java:3522)
                at com.google.common.cache.LocalCache$Segment.loadSync(LocalCache.java:2315)
                at com.google.common.cache.LocalCache$Segment.lockedGetOrLoad(LocalCache.java:2278)
                at com.google.common.cache.LocalCache$Segment.get(LocalCache.java:2193)
                ... 21 more


Results :

Failed tests:   testCreateSecurityGroup(org.jclouds.openstack.nova.v2_0.compute.extensions.NovaSecurityGroupExtensionExpectTest): java.lang.IllegalArgumentException: timeout value is negative

Tests run: 387, Failures: 1, Errors: 0, Skipped: 0


Kind regards,


Dale Chalfant

[http://greaterbrain.com/Pages/signature.png]