You are viewing a plain text version of this content. The canonical link for it is here.
Posted to builds@beam.apache.org by Apache Jenkins Server <je...@builds.apache.org> on 2023/04/22 18:23:32 UTC

beam_PostCommit_Java_Jpms_Dataflow_Java17 - Build # 1757 - Aborted!

beam_PostCommit_Java_Jpms_Dataflow_Java17 - Build # 1757 - Aborted:

Check console output at https://ci-beam.apache.org/job/beam_PostCommit_Java_Jpms_Dataflow_Java17/1757/ to view the results.

Jenkins build is back to normal : beam_PostCommit_Java_Jpms_Dataflow_Java17 #1782

Posted by Apache Jenkins Server <je...@builds.apache.org>.
See <https://ci-beam.apache.org/job/beam_PostCommit_Java_Jpms_Dataflow_Java17/1782/display/redirect>


---------------------------------------------------------------------
To unsubscribe, e-mail: builds-unsubscribe@beam.apache.org
For additional commands, e-mail: builds-help@beam.apache.org


beam_PostCommit_Java_Jpms_Dataflow_Java17 - Build # 1781 - Aborted!

Posted by Apache Jenkins Server <je...@builds.apache.org>.
beam_PostCommit_Java_Jpms_Dataflow_Java17 - Build # 1781 - Aborted:

Check console output at https://ci-beam.apache.org/job/beam_PostCommit_Java_Jpms_Dataflow_Java17/1781/ to view the results.

Build failed in Jenkins: beam_PostCommit_Java_Jpms_Dataflow_Java17 #1780

Posted by Apache Jenkins Server <je...@builds.apache.org>.
See <https://ci-beam.apache.org/job/beam_PostCommit_Java_Jpms_Dataflow_Java17/1780/display/redirect>

Changes:


------------------------------------------
Started by timer
Running as SYSTEM
[EnvInject] - Loading node environment variables.
Building remotely on apache-beam-jenkins-9 (beam) in workspace <https://ci-beam.apache.org/job/beam_PostCommit_Java_Jpms_Dataflow_Java17/ws/>
The recommended git tool is: NONE
No credentials specified
Wiping out workspace first.
Cloning the remote Git repository
Using shallow clone with depth 1
Avoid fetching tags
Cloning repository https://github.com/apache/beam.git
 > git init <https://ci-beam.apache.org/job/beam_PostCommit_Java_Jpms_Dataflow_Java17/ws/src> # timeout=10
Fetching upstream changes from https://github.com/apache/beam.git
 > git --version # timeout=10
 > git --version # 'git version 2.25.1'
 > git fetch --no-tags --force --progress --depth=1 -- https://github.com/apache/beam.git +refs/heads/*:refs/remotes/origin/* # timeout=10
 > git config remote.origin.url https://github.com/apache/beam.git # timeout=10
 > git config --add remote.origin.fetch +refs/heads/*:refs/remotes/origin/* # timeout=10
 > git config remote.origin.url https://github.com/apache/beam.git # timeout=10
Using shallow fetch with depth 1
Fetching upstream changes from https://github.com/apache/beam.git
 > git fetch --no-tags --force --progress --depth=1 -- https://github.com/apache/beam.git +refs/heads/*:refs/remotes/origin/* +refs/pull/${ghprbPullId}/*:refs/remotes/origin/pr/${ghprbPullId}/* # timeout=10
 > git rev-parse origin/master^{commit} # timeout=10
Checking out Revision 8bda63bc8ea0c1de9ec29d0da080df1769c65a2b (origin/master)
 > git config core.sparsecheckout # timeout=10
 > git checkout -f 8bda63bc8ea0c1de9ec29d0da080df1769c65a2b # timeout=10
Commit message: "Allow implicit flattening for yaml inputs. (#26423)"
 > git rev-list --no-walk 8bda63bc8ea0c1de9ec29d0da080df1769c65a2b # timeout=10
No emails were triggered.
[EnvInject] - Executing scripts and injecting environment variables after the SCM step.
[EnvInject] - Injecting as environment variables the properties content 
SETUPTOOLS_USE_DISTUTILS=stdlib
SPARK_LOCAL_IP=127.0.0.1

[EnvInject] - Variables injected successfully.
[Gradle] - Launching build.
[src] $ <https://ci-beam.apache.org/job/beam_PostCommit_Java_Jpms_Dataflow_Java17/ws/src/gradlew> --continue --max-workers=8 -Dorg.gradle.jvmargs=-Xms2g -Dorg.gradle.jvmargs=-Xmx6g -Dorg.gradle.vfs.watch=false -Pdocker-pull-licenses -PskipCheckerFramework -PcompileAndRunTestsWithJava17 -Pjava17Home=/usr/lib/jvm/java-17-openjdk-amd64 -Pmaven_home=/home/jenkins/tools/maven/apache-maven-3.5.4 :sdks:java:testing:jpms-tests:dataflowRunnerIntegrationTest
To honour the JVM settings for this build a single-use Daemon process will be forked. See https://docs.gradle.org/7.5.1/userguide/gradle_daemon.html#sec:disabling_the_daemon.
Daemon will be stopped at the end of the build 
Configuration on demand is an incubating feature.
Gradle Enterprise plugins resolution: https://plugins.gradle.org/m2
Applying com.gradle.CommonCustomUserDataGradlePlugin via init script
> Task :buildSrc:compileJava NO-SOURCE
> Task :buildSrc:compileGroovy FROM-CACHE
> Task :buildSrc:pluginDescriptors
> Task :buildSrc:processResources
> Task :buildSrc:classes
> Task :buildSrc:jar
> Task :buildSrc:assemble
> Task :buildSrc:spotlessGroovy FROM-CACHE
> Task :buildSrc:spotlessGroovyCheck UP-TO-DATE
> Task :buildSrc:spotlessGroovyGradle FROM-CACHE
> Task :buildSrc:spotlessGroovyGradleCheck UP-TO-DATE
> Task :buildSrc:spotlessCheck UP-TO-DATE
> Task :buildSrc:pluginUnderTestMetadata
> Task :buildSrc:compileTestJava NO-SOURCE
> Task :buildSrc:compileTestGroovy NO-SOURCE
> Task :buildSrc:processTestResources NO-SOURCE
> Task :buildSrc:testClasses UP-TO-DATE
> Task :buildSrc:test NO-SOURCE
> Task :buildSrc:validatePlugins FROM-CACHE
> Task :buildSrc:check UP-TO-DATE
> Task :buildSrc:build

> Configure project :sdks:java:container:java8
docker-pull-licenses set, creating go-licenses

> Configure project :sdks:java:container:java11
docker-pull-licenses set, creating go-licenses

> Task :runners:core-construction-java:processResources NO-SOURCE
> Task :sdks:java:core:generateAvroProtocol NO-SOURCE
> Task :runners:core-java:processResources NO-SOURCE
> Task :sdks:java:fn-execution:processResources NO-SOURCE
> Task :sdks:java:extensions:avro:generateAvroProtocol NO-SOURCE
> Task :sdks:java:core:generateAvroJava NO-SOURCE
> Task :sdks:java:extensions:google-cloud-platform-core:processResources NO-SOURCE
> Task :sdks:java:extensions:avro:generateAvroJava NO-SOURCE
> Task :model:fn-execution:extractProto
> Task :sdks:java:harness:processResources NO-SOURCE
> Task :sdks:java:extensions:avro:processResources NO-SOURCE
> Task :model:job-management:extractProto
> Task :runners:java-fn-execution:processResources NO-SOURCE
> Task :sdks:java:extensions:arrow:processResources NO-SOURCE
> Task :sdks:java:expansion-service:processResources NO-SOURCE
> Task :sdks:java:testing:jpms-tests:processResources NO-SOURCE
> Task :sdks:java:testing:jpms-tests:processTestResources NO-SOURCE
> Task :sdks:java:io:kafka:processResources NO-SOURCE
> Task :sdks:java:extensions:protobuf:extractProto
> Task :sdks:java:core:generateGrammarSource FROM-CACHE
> Task :sdks:java:io:google-cloud-platform:processResources NO-SOURCE
> Task :sdks:java:extensions:protobuf:processResources NO-SOURCE
> Task :model:fn-execution:processResources
> Task :model:job-management:processResources
> Task :sdks:java:core:processResources
> Task :runners:google-cloud-dataflow-java:processResources
> Task :model:pipeline:extractIncludeProto
> Task :model:pipeline:extractProto
> Task :model:pipeline:generateProto FROM-CACHE
> Task :model:pipeline:compileJava FROM-CACHE
> Task :model:pipeline:processResources
> Task :model:pipeline:classes
> Task :model:pipeline:jar
> Task :model:pipeline:shadowJar FROM-CACHE
> Task :model:fn-execution:extractIncludeProto
> Task :model:fn-execution:generateProto FROM-CACHE
> Task :model:job-management:extractIncludeProto
> Task :model:job-management:generateProto FROM-CACHE
> Task :model:fn-execution:compileJava FROM-CACHE
> Task :model:fn-execution:classes
> Task :model:job-management:compileJava FROM-CACHE
> Task :model:job-management:classes
> Task :model:fn-execution:shadowJar FROM-CACHE
> Task :model:job-management:shadowJar FROM-CACHE
> Task :sdks:java:core:compileJava FROM-CACHE
> Task :sdks:java:core:classes
> Task :sdks:java:core:shadowJar FROM-CACHE
> Task :sdks:java:extensions:arrow:compileJava FROM-CACHE
> Task :sdks:java:extensions:arrow:classes UP-TO-DATE
> Task :sdks:java:extensions:arrow:jar
> Task :sdks:java:fn-execution:compileJava FROM-CACHE
> Task :sdks:java:fn-execution:classes UP-TO-DATE
> Task :sdks:java:fn-execution:jar
> Task :sdks:java:extensions:avro:compileJava FROM-CACHE
> Task :sdks:java:extensions:avro:classes UP-TO-DATE
> Task :sdks:java:extensions:avro:jar
> Task :runners:core-construction-java:compileJava FROM-CACHE
> Task :runners:core-construction-java:classes UP-TO-DATE
> Task :sdks:java:extensions:protobuf:extractIncludeProto
> Task :sdks:java:extensions:protobuf:generateProto NO-SOURCE
> Task :sdks:java:extensions:protobuf:compileJava FROM-CACHE
> Task :sdks:java:extensions:protobuf:classes UP-TO-DATE
> Task :sdks:java:extensions:protobuf:jar
> Task :runners:core-construction-java:jar
> Task :runners:core-java:compileJava FROM-CACHE
> Task :runners:core-java:classes UP-TO-DATE
> Task :runners:core-java:jar
> Task :sdks:java:extensions:google-cloud-platform-core:compileJava FROM-CACHE
> Task :sdks:java:extensions:google-cloud-platform-core:classes UP-TO-DATE
> Task :sdks:java:harness:compileJava FROM-CACHE
> Task :sdks:java:harness:classes UP-TO-DATE
> Task :sdks:java:extensions:google-cloud-platform-core:jar
> Task :sdks:java:harness:jar
> Task :runners:java-fn-execution:compileJava FROM-CACHE
> Task :runners:java-fn-execution:classes UP-TO-DATE
> Task :runners:java-fn-execution:jar
> Task :sdks:java:expansion-service:compileJava FROM-CACHE
> Task :sdks:java:expansion-service:classes UP-TO-DATE
> Task :sdks:java:expansion-service:jar
> Task :sdks:java:io:kafka:compileJava FROM-CACHE
> Task :sdks:java:io:kafka:classes UP-TO-DATE
> Task :sdks:java:testing:jpms-tests:compileJava FROM-CACHE
> Task :sdks:java:testing:jpms-tests:classes UP-TO-DATE
> Task :sdks:java:testing:jpms-tests:jar
> Task :sdks:java:io:kafka:jar
> Task :sdks:java:testing:jpms-tests:compileTestJava FROM-CACHE
> Task :sdks:java:testing:jpms-tests:testClasses UP-TO-DATE
> Task :sdks:java:testing:jpms-tests:testJar
> Task :sdks:java:io:google-cloud-platform:compileJava FROM-CACHE
> Task :sdks:java:io:google-cloud-platform:classes UP-TO-DATE
> Task :sdks:java:io:google-cloud-platform:jar
> Task :runners:google-cloud-dataflow-java:compileJava FROM-CACHE
> Task :runners:google-cloud-dataflow-java:classes
> Task :runners:google-cloud-dataflow-java:jar
> Task :sdks:java:testing:jpms-tests:dataflowRunnerIntegrationTest

org.apache.beam.sdk.jpmstests.JpmsIT > testE2EJpms FAILED
    java.lang.RuntimeException at JpmsIT.java:63

1 test completed, 1 failed

> Task :sdks:java:testing:jpms-tests:dataflowRunnerIntegrationTest FAILED

FAILURE: Build failed with an exception.

* What went wrong:
Execution failed for task ':sdks:java:testing:jpms-tests:dataflowRunnerIntegrationTest'.
> There were failing tests. See the report at: file://<https://ci-beam.apache.org/job/beam_PostCommit_Java_Jpms_Dataflow_Java17/ws/src/sdks/java/testing/jpms-tests/build/reports/tests/dataflowRunnerIntegrationTest/index.html>

* Try:
> Run with --stacktrace option to get the stack trace.
> Run with --info or --debug option to get more log output.

* Get more help at https://help.gradle.org

Deprecated Gradle features were used in this build, making it incompatible with Gradle 8.0.

You can use '--warning-mode all' to show the individual deprecation warnings and determine if they come from your own scripts or plugins.

See https://docs.gradle.org/7.5.1/userguide/command_line_interface.html#sec:command_line_warnings

BUILD FAILED in 3h 39m 55s
67 actionable tasks: 34 executed, 31 from cache, 2 up-to-date
Build scan background action failed.
java.lang.IllegalArgumentException: com.gradle.enterprise.gradleplugin.internal.extension.a is not an interface
	at java.lang.reflect.Proxy$ProxyClassFactory.apply(Proxy.java:590)
	at java.lang.reflect.Proxy$ProxyClassFactory.apply(Proxy.java:557)
	at java.lang.reflect.WeakCache$Factory.get(WeakCache.java:230)
	at java.lang.reflect.WeakCache.get(WeakCache.java:127)
	at java.lang.reflect.Proxy.getProxyClass0(Proxy.java:419)
	at java.lang.reflect.Proxy.newProxyInstance(Proxy.java:719)
	at com.gradle.ProxyFactory$ProxyingInvocationHandler.createLocalProxy(ProxyFactory.java:64)
	at com.gradle.ProxyFactory$ProxyingInvocationHandler.lambda$adaptActionArg$1(ProxyFactory.java:59)
	at com.gradle.enterprise.gradleplugin.internal.extension.b$3.run(SourceFile:100)
	at java.util.concurrent.Executors$RunnableAdapter.call(Executors.java:511)
	at java.util.concurrent.FutureTask.run(FutureTask.java:266)
	at java.util.concurrent.ThreadPoolExecutor.runWorker(ThreadPoolExecutor.java:1149)
	at java.util.concurrent.ThreadPoolExecutor$Worker.run(ThreadPoolExecutor.java:624)
	at java.lang.Thread.run(Thread.java:750)

Publishing build scan...
https://gradle.com/s/i6silcvtvgxwi

Build step 'Invoke Gradle script' changed build result to FAILURE
Build step 'Invoke Gradle script' marked build as failure

---------------------------------------------------------------------
To unsubscribe, e-mail: builds-unsubscribe@beam.apache.org
For additional commands, e-mail: builds-help@beam.apache.org


beam_PostCommit_Java_Jpms_Dataflow_Java17 - Build # 1779 - Aborted!

Posted by Apache Jenkins Server <je...@builds.apache.org>.
beam_PostCommit_Java_Jpms_Dataflow_Java17 - Build # 1779 - Aborted:

Check console output at https://ci-beam.apache.org/job/beam_PostCommit_Java_Jpms_Dataflow_Java17/1779/ to view the results.

Build failed in Jenkins: beam_PostCommit_Java_Jpms_Dataflow_Java17 #1778

Posted by Apache Jenkins Server <je...@builds.apache.org>.
See <https://ci-beam.apache.org/job/beam_PostCommit_Java_Jpms_Dataflow_Java17/1778/display/redirect>

Changes:


------------------------------------------
[...truncated 3.28 KB...]
Configuration on demand is an incubating feature.
Gradle Enterprise plugins resolution: https://plugins.gradle.org/m2
Applying com.gradle.CommonCustomUserDataGradlePlugin via init script
> Task :buildSrc:compileJava NO-SOURCE
> Task :buildSrc:compileGroovy FROM-CACHE
> Task :buildSrc:pluginDescriptors
> Task :buildSrc:processResources
> Task :buildSrc:classes
> Task :buildSrc:jar
> Task :buildSrc:assemble
> Task :buildSrc:spotlessGroovy FROM-CACHE
> Task :buildSrc:spotlessGroovyCheck UP-TO-DATE
> Task :buildSrc:spotlessGroovyGradle FROM-CACHE
> Task :buildSrc:spotlessGroovyGradleCheck UP-TO-DATE
> Task :buildSrc:spotlessCheck UP-TO-DATE
> Task :buildSrc:pluginUnderTestMetadata
> Task :buildSrc:compileTestJava NO-SOURCE
> Task :buildSrc:compileTestGroovy NO-SOURCE
> Task :buildSrc:processTestResources NO-SOURCE
> Task :buildSrc:testClasses UP-TO-DATE
> Task :buildSrc:test NO-SOURCE
> Task :buildSrc:validatePlugins FROM-CACHE
> Task :buildSrc:check UP-TO-DATE
> Task :buildSrc:build

> Configure project :sdks:java:container:java8
docker-pull-licenses set, creating go-licenses

> Configure project :sdks:java:container:java11
docker-pull-licenses set, creating go-licenses

> Task :sdks:java:fn-execution:processResources NO-SOURCE
> Task :runners:core-java:processResources NO-SOURCE
> Task :sdks:java:core:generateAvroProtocol NO-SOURCE
> Task :sdks:java:extensions:avro:generateAvroProtocol NO-SOURCE
> Task :runners:core-construction-java:processResources NO-SOURCE
> Task :sdks:java:extensions:avro:generateAvroJava NO-SOURCE
> Task :sdks:java:extensions:avro:processResources NO-SOURCE
> Task :sdks:java:harness:processResources NO-SOURCE
> Task :sdks:java:expansion-service:processResources NO-SOURCE
> Task :sdks:java:extensions:arrow:processResources NO-SOURCE
> Task :sdks:java:core:generateAvroJava NO-SOURCE
> Task :sdks:java:testing:jpms-tests:processResources NO-SOURCE
> Task :runners:java-fn-execution:processResources NO-SOURCE
> Task :sdks:java:extensions:google-cloud-platform-core:processResources NO-SOURCE
> Task :model:fn-execution:extractProto
> Task :model:job-management:extractProto
> Task :sdks:java:io:kafka:processResources NO-SOURCE
> Task :sdks:java:io:google-cloud-platform:processResources NO-SOURCE
> Task :sdks:java:testing:jpms-tests:processTestResources NO-SOURCE
> Task :sdks:java:extensions:protobuf:extractProto
> Task :sdks:java:extensions:protobuf:processResources NO-SOURCE
> Task :sdks:java:core:generateGrammarSource FROM-CACHE
> Task :model:fn-execution:processResources
> Task :model:job-management:processResources
> Task :sdks:java:core:processResources
> Task :runners:google-cloud-dataflow-java:processResources
> Task :model:pipeline:extractIncludeProto
> Task :model:pipeline:extractProto
> Task :model:pipeline:generateProto FROM-CACHE
> Task :model:pipeline:compileJava
> Task :model:pipeline:processResources
> Task :model:pipeline:classes
> Task :model:pipeline:jar
> Task :model:pipeline:shadowJar FROM-CACHE
> Task :model:job-management:extractIncludeProto
> Task :model:fn-execution:extractIncludeProto
> Task :model:job-management:generateProto FROM-CACHE
> Task :model:fn-execution:generateProto FROM-CACHE
> Task :model:job-management:compileJava
> Task :model:job-management:classes
> Task :model:job-management:shadowJar FROM-CACHE
> Task :model:fn-execution:compileJava
> Task :model:fn-execution:classes
> Task :model:fn-execution:shadowJar FROM-CACHE
> Task :sdks:java:core:compileJava
Note: Some input files use or override a deprecated API.
Note: Recompile with -Xlint:deprecation for details.
Note: Some input files use unchecked or unsafe operations.
Note: Recompile with -Xlint:unchecked for details.

> Task :sdks:java:core:classes
> Task :sdks:java:core:shadowJar
> Task :sdks:java:extensions:protobuf:extractIncludeProto
> Task :sdks:java:extensions:protobuf:generateProto NO-SOURCE
> Task :sdks:java:extensions:arrow:compileJava
> Task :sdks:java:extensions:arrow:classes
> Task :sdks:java:extensions:arrow:jar

> Task :sdks:java:extensions:avro:compileJava
Note: Some input files use or override a deprecated API.
Note: Recompile with -Xlint:deprecation for details.
Note: Some input files use unchecked or unsafe operations.
Note: Recompile with -Xlint:unchecked for details.

> Task :sdks:java:extensions:avro:classes
> Task :sdks:java:extensions:avro:jar

> Task :sdks:java:fn-execution:compileJava
Note: <https://ci-beam.apache.org/job/beam_PostCommit_Java_Jpms_Dataflow_Java17/ws/src/sdks/java/fn-execution/src/main/java/org/apache/beam/sdk/fn/data/BeamFnDataInboundObserver.java> uses or overrides a deprecated API.
Note: Recompile with -Xlint:deprecation for details.
Note: Some input files use unchecked or unsafe operations.
Note: Recompile with -Xlint:unchecked for details.

> Task :sdks:java:fn-execution:classes
> Task :sdks:java:fn-execution:jar

> Task :sdks:java:extensions:protobuf:compileJava
Note: Some input files use or override a deprecated API.
Note: Recompile with -Xlint:deprecation for details.
Note: Some input files use unchecked or unsafe operations.
Note: Recompile with -Xlint:unchecked for details.

> Task :sdks:java:extensions:protobuf:classes
> Task :sdks:java:extensions:protobuf:jar

> Task :runners:core-construction-java:compileJava
Note: Some input files use or override a deprecated API.
Note: Recompile with -Xlint:deprecation for details.
Note: Some input files use unchecked or unsafe operations.
Note: Recompile with -Xlint:unchecked for details.

> Task :runners:core-construction-java:classes
> Task :runners:core-construction-java:jar

> Task :runners:core-java:compileJava
Note: Some input files use or override a deprecated API.
Note: Recompile with -Xlint:deprecation for details.
Note: Some input files use unchecked or unsafe operations.
Note: Recompile with -Xlint:unchecked for details.

> Task :runners:core-java:classes
> Task :runners:core-java:jar

> Task :sdks:java:extensions:google-cloud-platform-core:compileJava
Note: Some input files use or override a deprecated API.
Note: Recompile with -Xlint:deprecation for details.

> Task :sdks:java:extensions:google-cloud-platform-core:classes
> Task :sdks:java:extensions:google-cloud-platform-core:jar

> Task :sdks:java:harness:compileJava
Note: Some input files use or override a deprecated API.
Note: Recompile with -Xlint:deprecation for details.
Note: Some input files use unchecked or unsafe operations.
Note: Recompile with -Xlint:unchecked for details.

> Task :sdks:java:harness:classes
> Task :sdks:java:harness:jar
> Task :sdks:java:testing:jpms-tests:compileJava
> Task :sdks:java:testing:jpms-tests:classes
> Task :sdks:java:testing:jpms-tests:jar
> Task :sdks:java:testing:jpms-tests:compileTestJava
> Task :sdks:java:testing:jpms-tests:testClasses
> Task :sdks:java:testing:jpms-tests:testJar

> Task :runners:java-fn-execution:compileJava
Note: <https://ci-beam.apache.org/job/beam_PostCommit_Java_Jpms_Dataflow_Java17/ws/src/runners/java-fn-execution/src/main/java/org/apache/beam/runners/fnexecution/wire/ByteStringCoder.java> uses or overrides a deprecated API.
Note: Recompile with -Xlint:deprecation for details.
Note: Some input files use unchecked or unsafe operations.
Note: Recompile with -Xlint:unchecked for details.

> Task :runners:java-fn-execution:classes
> Task :runners:java-fn-execution:jar

> Task :sdks:java:expansion-service:compileJava
Note: Some input files use unchecked or unsafe operations.
Note: Recompile with -Xlint:unchecked for details.

> Task :sdks:java:expansion-service:classes
> Task :sdks:java:expansion-service:jar

> Task :sdks:java:io:kafka:compileJava
Note: Some input files use or override a deprecated API.
Note: Recompile with -Xlint:deprecation for details.
Note: Some input files use unchecked or unsafe operations.
Note: Recompile with -Xlint:unchecked for details.

> Task :sdks:java:io:kafka:classes
> Task :sdks:java:io:kafka:jar

> Task :sdks:java:io:google-cloud-platform:compileJava
Note: Some input files use or override a deprecated API.
Note: Recompile with -Xlint:deprecation for details.
Note: Some input files use unchecked or unsafe operations.
Note: Recompile with -Xlint:unchecked for details.

> Task :sdks:java:io:google-cloud-platform:classes
> Task :sdks:java:io:google-cloud-platform:jar

> Task :runners:google-cloud-dataflow-java:compileJava
Note: Some input files use or override a deprecated API.
Note: Recompile with -Xlint:deprecation for details.
Note: Some input files use unchecked or unsafe operations.
Note: Recompile with -Xlint:unchecked for details.

> Task :runners:google-cloud-dataflow-java:classes
> Task :runners:google-cloud-dataflow-java:jar
> Task :sdks:java:testing:jpms-tests:dataflowRunnerIntegrationTest

org.apache.beam.sdk.jpmstests.JpmsIT > testE2EJpms FAILED
    java.lang.RuntimeException at JpmsIT.java:63

1 test completed, 1 failed

> Task :sdks:java:testing:jpms-tests:dataflowRunnerIntegrationTest FAILED

FAILURE: Build failed with an exception.

* What went wrong:
Execution failed for task ':sdks:java:testing:jpms-tests:dataflowRunnerIntegrationTest'.
> There were failing tests. See the report at: file://<https://ci-beam.apache.org/job/beam_PostCommit_Java_Jpms_Dataflow_Java17/ws/src/sdks/java/testing/jpms-tests/build/reports/tests/dataflowRunnerIntegrationTest/index.html>

* Try:
> Run with --stacktrace option to get the stack trace.
> Run with --info or --debug option to get more log output.

* Get more help at https://help.gradle.org

Deprecated Gradle features were used in this build, making it incompatible with Gradle 8.0.

You can use '--warning-mode all' to show the individual deprecation warnings and determine if they come from your own scripts or plugins.

See https://docs.gradle.org/7.5.1/userguide/command_line_interface.html#sec:command_line_warnings

BUILD FAILED in 3h 47m 14s
67 actionable tasks: 54 executed, 11 from cache, 2 up-to-date
Build scan background action failed.
java.lang.IllegalArgumentException: com.gradle.enterprise.gradleplugin.internal.extension.a is not an interface
	at java.lang.reflect.Proxy$ProxyClassFactory.apply(Proxy.java:590)
	at java.lang.reflect.Proxy$ProxyClassFactory.apply(Proxy.java:557)
	at java.lang.reflect.WeakCache$Factory.get(WeakCache.java:230)
	at java.lang.reflect.WeakCache.get(WeakCache.java:127)
	at java.lang.reflect.Proxy.getProxyClass0(Proxy.java:419)
	at java.lang.reflect.Proxy.newProxyInstance(Proxy.java:719)
	at com.gradle.ProxyFactory$ProxyingInvocationHandler.createLocalProxy(ProxyFactory.java:64)
	at com.gradle.ProxyFactory$ProxyingInvocationHandler.lambda$adaptActionArg$1(ProxyFactory.java:59)
	at com.gradle.enterprise.gradleplugin.internal.extension.b$3.run(SourceFile:100)
	at java.util.concurrent.Executors$RunnableAdapter.call(Executors.java:511)
	at java.util.concurrent.FutureTask.run(FutureTask.java:266)
	at java.util.concurrent.ThreadPoolExecutor.runWorker(ThreadPoolExecutor.java:1149)
	at java.util.concurrent.ThreadPoolExecutor$Worker.run(ThreadPoolExecutor.java:624)
	at java.lang.Thread.run(Thread.java:750)

Publishing build scan...
https://gradle.com/s/6oiniage35gy4

Build step 'Invoke Gradle script' changed build result to FAILURE
Build step 'Invoke Gradle script' marked build as failure

---------------------------------------------------------------------
To unsubscribe, e-mail: builds-unsubscribe@beam.apache.org
For additional commands, e-mail: builds-help@beam.apache.org


beam_PostCommit_Java_Jpms_Dataflow_Java17 - Build # 1777 - Aborted!

Posted by Apache Jenkins Server <je...@builds.apache.org>.
beam_PostCommit_Java_Jpms_Dataflow_Java17 - Build # 1777 - Aborted:

Check console output at https://ci-beam.apache.org/job/beam_PostCommit_Java_Jpms_Dataflow_Java17/1777/ to view the results.

Build failed in Jenkins: beam_PostCommit_Java_Jpms_Dataflow_Java17 #1776

Posted by Apache Jenkins Server <je...@builds.apache.org>.
See <https://ci-beam.apache.org/job/beam_PostCommit_Java_Jpms_Dataflow_Java17/1776/display/redirect?page=changes>

Changes:

[noreply] Merge pull request #26443 from kennknowles/hcatalog-nullness


------------------------------------------
Started by timer
Running as SYSTEM
[EnvInject] - Loading node environment variables.
Building remotely on apache-beam-jenkins-8 (beam) in workspace <https://ci-beam.apache.org/job/beam_PostCommit_Java_Jpms_Dataflow_Java17/ws/>
The recommended git tool is: NONE
No credentials specified
Wiping out workspace first.
Cloning the remote Git repository
Using shallow clone with depth 1
Avoid fetching tags
Cloning repository https://github.com/apache/beam.git
 > git init <https://ci-beam.apache.org/job/beam_PostCommit_Java_Jpms_Dataflow_Java17/ws/src> # timeout=10
Fetching upstream changes from https://github.com/apache/beam.git
 > git --version # timeout=10
 > git --version # 'git version 2.25.1'
 > git fetch --no-tags --force --progress --depth=1 -- https://github.com/apache/beam.git +refs/heads/*:refs/remotes/origin/* # timeout=10
 > git config remote.origin.url https://github.com/apache/beam.git # timeout=10
 > git config --add remote.origin.fetch +refs/heads/*:refs/remotes/origin/* # timeout=10
 > git config remote.origin.url https://github.com/apache/beam.git # timeout=10
Using shallow fetch with depth 1
Fetching upstream changes from https://github.com/apache/beam.git
 > git fetch --no-tags --force --progress --depth=1 -- https://github.com/apache/beam.git +refs/heads/*:refs/remotes/origin/* +refs/pull/${ghprbPullId}/*:refs/remotes/origin/pr/${ghprbPullId}/* # timeout=10
 > git rev-parse origin/master^{commit} # timeout=10
Checking out Revision 4fce2535f766bcd9e9d722b1b3c1b2d982605b1d (origin/master)
 > git config core.sparsecheckout # timeout=10
 > git checkout -f 4fce2535f766bcd9e9d722b1b3c1b2d982605b1d # timeout=10
Commit message: "Merge pull request #26443 from kennknowles/hcatalog-nullness"
 > git rev-list --no-walk bd4ea843d370130140214512ed51869673f6ff72 # timeout=10
No emails were triggered.
[EnvInject] - Executing scripts and injecting environment variables after the SCM step.
[EnvInject] - Injecting as environment variables the properties content 
SETUPTOOLS_USE_DISTUTILS=stdlib
SPARK_LOCAL_IP=127.0.0.1

[EnvInject] - Variables injected successfully.
[Gradle] - Launching build.
[src] $ <https://ci-beam.apache.org/job/beam_PostCommit_Java_Jpms_Dataflow_Java17/ws/src/gradlew> --continue --max-workers=8 -Dorg.gradle.jvmargs=-Xms2g -Dorg.gradle.jvmargs=-Xmx6g -Dorg.gradle.vfs.watch=false -Pdocker-pull-licenses -PskipCheckerFramework -PcompileAndRunTestsWithJava17 -Pjava17Home=/usr/lib/jvm/java-17-openjdk-amd64 -Pmaven_home=/home/jenkins/tools/maven/apache-maven-3.5.4 :sdks:java:testing:jpms-tests:dataflowRunnerIntegrationTest
To honour the JVM settings for this build a single-use Daemon process will be forked. See https://docs.gradle.org/7.5.1/userguide/gradle_daemon.html#sec:disabling_the_daemon.
Daemon will be stopped at the end of the build 
Configuration on demand is an incubating feature.
Gradle Enterprise plugins resolution: https://plugins.gradle.org/m2
Applying com.gradle.CommonCustomUserDataGradlePlugin via init script
> Task :buildSrc:compileJava NO-SOURCE
> Task :buildSrc:compileGroovy FROM-CACHE
> Task :buildSrc:pluginDescriptors
> Task :buildSrc:processResources
> Task :buildSrc:classes
> Task :buildSrc:jar
> Task :buildSrc:assemble
> Task :buildSrc:spotlessGroovy FROM-CACHE
> Task :buildSrc:spotlessGroovyCheck UP-TO-DATE
> Task :buildSrc:spotlessGroovyGradle FROM-CACHE
> Task :buildSrc:spotlessGroovyGradleCheck UP-TO-DATE
> Task :buildSrc:spotlessCheck UP-TO-DATE
> Task :buildSrc:pluginUnderTestMetadata
> Task :buildSrc:compileTestJava NO-SOURCE
> Task :buildSrc:compileTestGroovy NO-SOURCE
> Task :buildSrc:processTestResources NO-SOURCE
> Task :buildSrc:testClasses UP-TO-DATE
> Task :buildSrc:test NO-SOURCE
> Task :buildSrc:validatePlugins FROM-CACHE
> Task :buildSrc:check UP-TO-DATE
> Task :buildSrc:build

> Configure project :sdks:java:container:java8
docker-pull-licenses set, creating go-licenses

> Configure project :sdks:java:container:java11
docker-pull-licenses set, creating go-licenses

> Task :sdks:java:extensions:avro:generateAvroProtocol NO-SOURCE
> Task :sdks:java:core:generateAvroProtocol NO-SOURCE
> Task :sdks:java:fn-execution:processResources NO-SOURCE
> Task :runners:core-java:processResources NO-SOURCE
> Task :runners:core-construction-java:processResources NO-SOURCE
> Task :sdks:java:core:generateAvroJava NO-SOURCE
> Task :sdks:java:extensions:avro:generateAvroJava NO-SOURCE
> Task :sdks:java:harness:processResources NO-SOURCE
> Task :sdks:java:extensions:avro:processResources NO-SOURCE
> Task :sdks:java:extensions:google-cloud-platform-core:processResources NO-SOURCE
> Task :model:job-management:extractProto
> Task :model:fn-execution:extractProto
> Task :sdks:java:testing:jpms-tests:processResources NO-SOURCE
> Task :runners:java-fn-execution:processResources NO-SOURCE
> Task :sdks:java:expansion-service:processResources NO-SOURCE
> Task :sdks:java:testing:jpms-tests:processTestResources NO-SOURCE
> Task :sdks:java:extensions:arrow:processResources NO-SOURCE
> Task :sdks:java:io:kafka:processResources NO-SOURCE
> Task :model:job-management:processResources
> Task :sdks:java:io:google-cloud-platform:processResources NO-SOURCE
> Task :sdks:java:extensions:protobuf:extractProto
> Task :sdks:java:core:generateGrammarSource FROM-CACHE
> Task :model:fn-execution:processResources
> Task :sdks:java:extensions:protobuf:processResources NO-SOURCE
> Task :runners:google-cloud-dataflow-java:processResources
> Task :sdks:java:core:processResources
> Task :model:pipeline:extractIncludeProto
> Task :model:pipeline:extractProto
> Task :model:pipeline:generateProto FROM-CACHE
> Task :model:pipeline:compileJava FROM-CACHE
> Task :model:pipeline:processResources
> Task :model:pipeline:classes
> Task :model:pipeline:jar
> Task :model:pipeline:shadowJar FROM-CACHE
> Task :model:job-management:extractIncludeProto
> Task :model:fn-execution:extractIncludeProto
> Task :model:job-management:generateProto FROM-CACHE
> Task :model:fn-execution:generateProto FROM-CACHE
> Task :model:job-management:compileJava FROM-CACHE
> Task :model:job-management:classes
> Task :model:fn-execution:compileJava FROM-CACHE
> Task :model:fn-execution:classes
> Task :model:fn-execution:shadowJar FROM-CACHE
> Task :model:job-management:shadowJar FROM-CACHE
> Task :sdks:java:core:compileJava FROM-CACHE
> Task :sdks:java:core:classes
> Task :sdks:java:core:shadowJar FROM-CACHE
> Task :sdks:java:extensions:arrow:compileJava FROM-CACHE
> Task :sdks:java:extensions:arrow:classes UP-TO-DATE
> Task :sdks:java:extensions:avro:compileJava FROM-CACHE
> Task :sdks:java:extensions:avro:classes UP-TO-DATE
> Task :sdks:java:extensions:arrow:jar
> Task :sdks:java:fn-execution:compileJava FROM-CACHE
> Task :sdks:java:fn-execution:classes UP-TO-DATE
> Task :sdks:java:extensions:avro:jar
> Task :sdks:java:fn-execution:jar
> Task :runners:core-construction-java:compileJava FROM-CACHE
> Task :runners:core-construction-java:classes UP-TO-DATE
> Task :sdks:java:extensions:protobuf:extractIncludeProto
> Task :sdks:java:extensions:protobuf:generateProto NO-SOURCE
> Task :runners:core-construction-java:jar
> Task :sdks:java:extensions:protobuf:compileJava FROM-CACHE
> Task :sdks:java:extensions:protobuf:classes UP-TO-DATE
> Task :sdks:java:extensions:protobuf:jar
> Task :runners:core-java:compileJava FROM-CACHE
> Task :runners:core-java:classes UP-TO-DATE
> Task :runners:core-java:jar
> Task :sdks:java:harness:compileJava FROM-CACHE
> Task :sdks:java:harness:classes UP-TO-DATE
> Task :sdks:java:extensions:google-cloud-platform-core:compileJava FROM-CACHE
> Task :sdks:java:extensions:google-cloud-platform-core:classes UP-TO-DATE
> Task :sdks:java:extensions:google-cloud-platform-core:jar
> Task :sdks:java:harness:jar
> Task :runners:java-fn-execution:compileJava FROM-CACHE
> Task :runners:java-fn-execution:classes UP-TO-DATE
> Task :runners:java-fn-execution:jar
> Task :sdks:java:expansion-service:compileJava FROM-CACHE
> Task :sdks:java:expansion-service:classes UP-TO-DATE
> Task :sdks:java:expansion-service:jar
> Task :sdks:java:io:kafka:compileJava FROM-CACHE
> Task :sdks:java:io:kafka:classes UP-TO-DATE
> Task :sdks:java:io:kafka:jar
> Task :sdks:java:io:google-cloud-platform:compileJava FROM-CACHE
> Task :sdks:java:io:google-cloud-platform:classes UP-TO-DATE
> Task :sdks:java:io:google-cloud-platform:jar
> Task :runners:google-cloud-dataflow-java:compileJava FROM-CACHE
> Task :runners:google-cloud-dataflow-java:classes
> Task :runners:google-cloud-dataflow-java:jar
> Task :sdks:java:testing:jpms-tests:compileJava
> Task :sdks:java:testing:jpms-tests:classes
> Task :sdks:java:testing:jpms-tests:jar
> Task :sdks:java:testing:jpms-tests:compileTestJava
> Task :sdks:java:testing:jpms-tests:testClasses
> Task :sdks:java:testing:jpms-tests:testJar
> Task :sdks:java:testing:jpms-tests:dataflowRunnerIntegrationTest

org.apache.beam.sdk.jpmstests.JpmsIT > testE2EJpms FAILED
    java.lang.RuntimeException at JpmsIT.java:63

1 test completed, 1 failed

> Task :sdks:java:testing:jpms-tests:dataflowRunnerIntegrationTest FAILED

FAILURE: Build failed with an exception.

* What went wrong:
Execution failed for task ':sdks:java:testing:jpms-tests:dataflowRunnerIntegrationTest'.
> There were failing tests. See the report at: file://<https://ci-beam.apache.org/job/beam_PostCommit_Java_Jpms_Dataflow_Java17/ws/src/sdks/java/testing/jpms-tests/build/reports/tests/dataflowRunnerIntegrationTest/index.html>

* Try:
> Run with --stacktrace option to get the stack trace.
> Run with --info or --debug option to get more log output.

* Get more help at https://help.gradle.org

Deprecated Gradle features were used in this build, making it incompatible with Gradle 8.0.

You can use '--warning-mode all' to show the individual deprecation warnings and determine if they come from your own scripts or plugins.

See https://docs.gradle.org/7.5.1/userguide/command_line_interface.html#sec:command_line_warnings

BUILD FAILED in 3h 40m 8s
67 actionable tasks: 36 executed, 29 from cache, 2 up-to-date
Build scan background action failed.
java.lang.IllegalArgumentException: com.gradle.enterprise.gradleplugin.internal.extension.a is not an interface
	at java.lang.reflect.Proxy$ProxyClassFactory.apply(Proxy.java:590)
	at java.lang.reflect.Proxy$ProxyClassFactory.apply(Proxy.java:557)
	at java.lang.reflect.WeakCache$Factory.get(WeakCache.java:230)
	at java.lang.reflect.WeakCache.get(WeakCache.java:127)
	at java.lang.reflect.Proxy.getProxyClass0(Proxy.java:419)
	at java.lang.reflect.Proxy.newProxyInstance(Proxy.java:719)
	at com.gradle.ProxyFactory$ProxyingInvocationHandler.createLocalProxy(ProxyFactory.java:64)
	at com.gradle.ProxyFactory$ProxyingInvocationHandler.lambda$adaptActionArg$1(ProxyFactory.java:59)
	at com.gradle.enterprise.gradleplugin.internal.extension.b$3.run(SourceFile:100)
	at java.util.concurrent.Executors$RunnableAdapter.call(Executors.java:511)
	at java.util.concurrent.FutureTask.run(FutureTask.java:266)
	at java.util.concurrent.ThreadPoolExecutor.runWorker(ThreadPoolExecutor.java:1149)
	at java.util.concurrent.ThreadPoolExecutor$Worker.run(ThreadPoolExecutor.java:624)
	at java.lang.Thread.run(Thread.java:750)

Publishing build scan...
https://gradle.com/s/dnf7d2ql24me4

Build step 'Invoke Gradle script' changed build result to FAILURE
Build step 'Invoke Gradle script' marked build as failure

---------------------------------------------------------------------
To unsubscribe, e-mail: builds-unsubscribe@beam.apache.org
For additional commands, e-mail: builds-help@beam.apache.org


beam_PostCommit_Java_Jpms_Dataflow_Java17 - Build # 1775 - Aborted!

Posted by Apache Jenkins Server <je...@builds.apache.org>.
beam_PostCommit_Java_Jpms_Dataflow_Java17 - Build # 1775 - Aborted:

Check console output at https://ci-beam.apache.org/job/beam_PostCommit_Java_Jpms_Dataflow_Java17/1775/ to view the results.

Build failed in Jenkins: beam_PostCommit_Java_Jpms_Dataflow_Java17 #1774

Posted by Apache Jenkins Server <je...@builds.apache.org>.
See <https://ci-beam.apache.org/job/beam_PostCommit_Java_Jpms_Dataflow_Java17/1774/display/redirect>

Changes:


------------------------------------------
Started by timer
Running as SYSTEM
[EnvInject] - Loading node environment variables.
Building remotely on apache-beam-jenkins-1 (beam) in workspace <https://ci-beam.apache.org/job/beam_PostCommit_Java_Jpms_Dataflow_Java17/ws/>
The recommended git tool is: NONE
No credentials specified
Wiping out workspace first.
Cloning the remote Git repository
Using shallow clone with depth 1
Avoid fetching tags
Cloning repository https://github.com/apache/beam.git
 > git init <https://ci-beam.apache.org/job/beam_PostCommit_Java_Jpms_Dataflow_Java17/ws/src> # timeout=10
Fetching upstream changes from https://github.com/apache/beam.git
 > git --version # timeout=10
 > git --version # 'git version 2.25.1'
 > git fetch --no-tags --force --progress --depth=1 -- https://github.com/apache/beam.git +refs/heads/*:refs/remotes/origin/* # timeout=10
 > git config remote.origin.url https://github.com/apache/beam.git # timeout=10
 > git config --add remote.origin.fetch +refs/heads/*:refs/remotes/origin/* # timeout=10
 > git config remote.origin.url https://github.com/apache/beam.git # timeout=10
Using shallow fetch with depth 1
Fetching upstream changes from https://github.com/apache/beam.git
 > git fetch --no-tags --force --progress --depth=1 -- https://github.com/apache/beam.git +refs/heads/*:refs/remotes/origin/* +refs/pull/${ghprbPullId}/*:refs/remotes/origin/pr/${ghprbPullId}/* # timeout=10
 > git rev-parse origin/master^{commit} # timeout=10
Checking out Revision 3440ae59a815e2ee90528b503d116a21ac5b1672 (origin/master)
 > git config core.sparsecheckout # timeout=10
 > git checkout -f 3440ae59a815e2ee90528b503d116a21ac5b1672 # timeout=10
Commit message: "Move snapshot build into cut release branch step (#26438)"
 > git rev-list --no-walk 6768ea359a5a89b3bff88038a83381bae3a875c1 # timeout=10
First time build. Skipping changelog.
No emails were triggered.
[EnvInject] - Executing scripts and injecting environment variables after the SCM step.
[EnvInject] - Injecting as environment variables the properties content 
SETUPTOOLS_USE_DISTUTILS=stdlib
SPARK_LOCAL_IP=127.0.0.1

[EnvInject] - Variables injected successfully.
[Gradle] - Launching build.
[src] $ <https://ci-beam.apache.org/job/beam_PostCommit_Java_Jpms_Dataflow_Java17/ws/src/gradlew> --continue --max-workers=8 -Dorg.gradle.jvmargs=-Xms2g -Dorg.gradle.jvmargs=-Xmx6g -Dorg.gradle.vfs.watch=false -Pdocker-pull-licenses -PskipCheckerFramework -PcompileAndRunTestsWithJava17 -Pjava17Home=/usr/lib/jvm/java-17-openjdk-amd64 -Pmaven_home=/home/jenkins/tools/maven/apache-maven-3.5.4 :sdks:java:testing:jpms-tests:dataflowRunnerIntegrationTest
To honour the JVM settings for this build a single-use Daemon process will be forked. See https://docs.gradle.org/7.5.1/userguide/gradle_daemon.html#sec:disabling_the_daemon.
Daemon will be stopped at the end of the build 
Configuration on demand is an incubating feature.
Gradle Enterprise plugins resolution: https://plugins.gradle.org/m2
Applying com.gradle.CommonCustomUserDataGradlePlugin via init script
> Task :buildSrc:compileJava NO-SOURCE
> Task :buildSrc:compileGroovy FROM-CACHE
> Task :buildSrc:pluginDescriptors
> Task :buildSrc:processResources
> Task :buildSrc:classes
> Task :buildSrc:jar
> Task :buildSrc:assemble
> Task :buildSrc:spotlessGroovy FROM-CACHE
> Task :buildSrc:spotlessGroovyCheck UP-TO-DATE
> Task :buildSrc:spotlessGroovyGradle FROM-CACHE
> Task :buildSrc:spotlessGroovyGradleCheck UP-TO-DATE
> Task :buildSrc:spotlessCheck UP-TO-DATE
> Task :buildSrc:pluginUnderTestMetadata
> Task :buildSrc:compileTestJava NO-SOURCE
> Task :buildSrc:compileTestGroovy NO-SOURCE
> Task :buildSrc:processTestResources NO-SOURCE
> Task :buildSrc:testClasses UP-TO-DATE
> Task :buildSrc:test NO-SOURCE
> Task :buildSrc:validatePlugins FROM-CACHE
> Task :buildSrc:check UP-TO-DATE
> Task :buildSrc:build

> Configure project :sdks:java:container:java8
docker-pull-licenses set, creating go-licenses

> Configure project :sdks:java:container:java11
docker-pull-licenses set, creating go-licenses

> Task :sdks:java:extensions:avro:generateAvroProtocol NO-SOURCE
> Task :sdks:java:fn-execution:processResources NO-SOURCE
> Task :runners:core-construction-java:processResources NO-SOURCE
> Task :sdks:java:core:generateAvroProtocol NO-SOURCE
> Task :runners:core-java:processResources NO-SOURCE
> Task :sdks:java:extensions:avro:generateAvroJava NO-SOURCE
> Task :sdks:java:core:generateAvroJava NO-SOURCE
> Task :sdks:java:harness:processResources NO-SOURCE
> Task :model:fn-execution:extractProto
> Task :model:job-management:extractProto
> Task :sdks:java:extensions:google-cloud-platform-core:processResources NO-SOURCE
> Task :sdks:java:testing:jpms-tests:processResources NO-SOURCE
> Task :runners:java-fn-execution:processResources NO-SOURCE
> Task :sdks:java:extensions:avro:processResources NO-SOURCE
> Task :sdks:java:testing:jpms-tests:processTestResources NO-SOURCE
> Task :sdks:java:expansion-service:processResources NO-SOURCE
> Task :sdks:java:extensions:arrow:processResources NO-SOURCE
> Task :sdks:java:io:kafka:processResources NO-SOURCE
> Task :sdks:java:io:google-cloud-platform:processResources NO-SOURCE
> Task :model:job-management:processResources
> Task :sdks:java:extensions:protobuf:extractProto
> Task :sdks:java:extensions:protobuf:processResources NO-SOURCE
> Task :sdks:java:core:generateGrammarSource FROM-CACHE
> Task :model:fn-execution:processResources
> Task :runners:google-cloud-dataflow-java:processResources
> Task :sdks:java:core:processResources
> Task :model:pipeline:extractIncludeProto
> Task :model:pipeline:extractProto
> Task :model:pipeline:generateProto FROM-CACHE
> Task :model:pipeline:compileJava FROM-CACHE
> Task :model:pipeline:processResources
> Task :model:pipeline:classes
> Task :model:pipeline:jar
> Task :model:pipeline:shadowJar FROM-CACHE
> Task :model:job-management:extractIncludeProto
> Task :model:fn-execution:extractIncludeProto
> Task :model:job-management:generateProto FROM-CACHE
> Task :model:fn-execution:generateProto FROM-CACHE
> Task :model:job-management:compileJava FROM-CACHE
> Task :model:job-management:classes
> Task :model:fn-execution:compileJava FROM-CACHE
> Task :model:fn-execution:classes
> Task :model:job-management:shadowJar FROM-CACHE
> Task :model:fn-execution:shadowJar FROM-CACHE
> Task :sdks:java:core:compileJava FROM-CACHE
> Task :sdks:java:core:classes
> Task :sdks:java:core:shadowJar FROM-CACHE
> Task :sdks:java:extensions:arrow:compileJava FROM-CACHE
> Task :sdks:java:extensions:arrow:classes UP-TO-DATE
> Task :sdks:java:extensions:avro:compileJava FROM-CACHE
> Task :sdks:java:extensions:avro:classes UP-TO-DATE
> Task :sdks:java:extensions:arrow:jar
> Task :sdks:java:extensions:avro:jar
> Task :sdks:java:fn-execution:compileJava FROM-CACHE
> Task :sdks:java:fn-execution:classes UP-TO-DATE
> Task :sdks:java:fn-execution:jar
> Task :runners:core-construction-java:compileJava FROM-CACHE
> Task :runners:core-construction-java:classes UP-TO-DATE
> Task :sdks:java:extensions:protobuf:extractIncludeProto
> Task :sdks:java:extensions:protobuf:generateProto NO-SOURCE
> Task :runners:core-construction-java:jar
> Task :sdks:java:extensions:protobuf:compileJava FROM-CACHE
> Task :sdks:java:extensions:protobuf:classes UP-TO-DATE
> Task :sdks:java:extensions:protobuf:jar
> Task :runners:core-java:compileJava FROM-CACHE
> Task :runners:core-java:classes UP-TO-DATE
> Task :runners:core-java:jar
> Task :sdks:java:extensions:google-cloud-platform-core:compileJava FROM-CACHE
> Task :sdks:java:extensions:google-cloud-platform-core:classes UP-TO-DATE
> Task :sdks:java:harness:compileJava FROM-CACHE
> Task :sdks:java:harness:classes UP-TO-DATE
> Task :sdks:java:extensions:google-cloud-platform-core:jar
> Task :sdks:java:harness:jar
> Task :runners:java-fn-execution:compileJava FROM-CACHE
> Task :runners:java-fn-execution:classes UP-TO-DATE
> Task :runners:java-fn-execution:jar
> Task :sdks:java:expansion-service:compileJava FROM-CACHE
> Task :sdks:java:expansion-service:classes UP-TO-DATE
> Task :sdks:java:expansion-service:jar
> Task :sdks:java:io:kafka:compileJava FROM-CACHE
> Task :sdks:java:io:kafka:classes UP-TO-DATE
> Task :sdks:java:io:kafka:jar
> Task :sdks:java:io:google-cloud-platform:compileJava FROM-CACHE
> Task :sdks:java:io:google-cloud-platform:classes UP-TO-DATE
> Task :sdks:java:io:google-cloud-platform:jar
> Task :runners:google-cloud-dataflow-java:compileJava FROM-CACHE
> Task :runners:google-cloud-dataflow-java:classes
> Task :runners:google-cloud-dataflow-java:jar
> Task :sdks:java:testing:jpms-tests:compileJava
> Task :sdks:java:testing:jpms-tests:classes
> Task :sdks:java:testing:jpms-tests:jar
> Task :sdks:java:testing:jpms-tests:compileTestJava
> Task :sdks:java:testing:jpms-tests:testClasses
> Task :sdks:java:testing:jpms-tests:testJar
> Task :sdks:java:testing:jpms-tests:dataflowRunnerIntegrationTest

org.apache.beam.sdk.jpmstests.JpmsIT > testE2EJpms FAILED
    java.lang.RuntimeException at JpmsIT.java:63

1 test completed, 1 failed

> Task :sdks:java:testing:jpms-tests:dataflowRunnerIntegrationTest FAILED

FAILURE: Build failed with an exception.

* What went wrong:
Execution failed for task ':sdks:java:testing:jpms-tests:dataflowRunnerIntegrationTest'.
> There were failing tests. See the report at: file://<https://ci-beam.apache.org/job/beam_PostCommit_Java_Jpms_Dataflow_Java17/ws/src/sdks/java/testing/jpms-tests/build/reports/tests/dataflowRunnerIntegrationTest/index.html>

* Try:
> Run with --stacktrace option to get the stack trace.
> Run with --info or --debug option to get more log output.

* Get more help at https://help.gradle.org

Deprecated Gradle features were used in this build, making it incompatible with Gradle 8.0.

You can use '--warning-mode all' to show the individual deprecation warnings and determine if they come from your own scripts or plugins.

See https://docs.gradle.org/7.5.1/userguide/command_line_interface.html#sec:command_line_warnings

BUILD FAILED in 3h 3m 36s
67 actionable tasks: 36 executed, 29 from cache, 2 up-to-date
Build scan background action failed.
java.lang.IllegalArgumentException: com.gradle.enterprise.gradleplugin.internal.extension.a is not an interface
	at java.lang.reflect.Proxy$ProxyClassFactory.apply(Proxy.java:590)
	at java.lang.reflect.Proxy$ProxyClassFactory.apply(Proxy.java:557)
	at java.lang.reflect.WeakCache$Factory.get(WeakCache.java:230)
	at java.lang.reflect.WeakCache.get(WeakCache.java:127)
	at java.lang.reflect.Proxy.getProxyClass0(Proxy.java:419)
	at java.lang.reflect.Proxy.newProxyInstance(Proxy.java:719)
	at com.gradle.ProxyFactory$ProxyingInvocationHandler.createLocalProxy(ProxyFactory.java:64)
	at com.gradle.ProxyFactory$ProxyingInvocationHandler.lambda$adaptActionArg$1(ProxyFactory.java:59)
	at com.gradle.enterprise.gradleplugin.internal.extension.b$3.run(SourceFile:100)
	at java.util.concurrent.Executors$RunnableAdapter.call(Executors.java:511)
	at java.util.concurrent.FutureTask.run(FutureTask.java:266)
	at java.util.concurrent.ThreadPoolExecutor.runWorker(ThreadPoolExecutor.java:1149)
	at java.util.concurrent.ThreadPoolExecutor$Worker.run(ThreadPoolExecutor.java:624)
	at java.lang.Thread.run(Thread.java:750)

Publishing build scan...
https://gradle.com/s/rtfsugcsjccda

Build step 'Invoke Gradle script' changed build result to FAILURE
Build step 'Invoke Gradle script' marked build as failure

---------------------------------------------------------------------
To unsubscribe, e-mail: builds-unsubscribe@beam.apache.org
For additional commands, e-mail: builds-help@beam.apache.org


beam_PostCommit_Java_Jpms_Dataflow_Java17 - Build # 1773 - Aborted!

Posted by Apache Jenkins Server <je...@builds.apache.org>.
beam_PostCommit_Java_Jpms_Dataflow_Java17 - Build # 1773 - Aborted:

Check console output at https://ci-beam.apache.org/job/beam_PostCommit_Java_Jpms_Dataflow_Java17/1773/ to view the results.

Build failed in Jenkins: beam_PostCommit_Java_Jpms_Dataflow_Java17 #1772

Posted by Apache Jenkins Server <je...@builds.apache.org>.
See <https://ci-beam.apache.org/job/beam_PostCommit_Java_Jpms_Dataflow_Java17/1772/display/redirect>

Changes:


------------------------------------------
Started by timer
Running as SYSTEM
[EnvInject] - Loading node environment variables.
Building remotely on apache-beam-jenkins-8 (beam) in workspace <https://ci-beam.apache.org/job/beam_PostCommit_Java_Jpms_Dataflow_Java17/ws/>
The recommended git tool is: NONE
No credentials specified
Wiping out workspace first.
Cloning the remote Git repository
Using shallow clone with depth 1
Avoid fetching tags
Cloning repository https://github.com/apache/beam.git
 > git init <https://ci-beam.apache.org/job/beam_PostCommit_Java_Jpms_Dataflow_Java17/ws/src> # timeout=10
Fetching upstream changes from https://github.com/apache/beam.git
 > git --version # timeout=10
 > git --version # 'git version 2.25.1'
 > git fetch --no-tags --force --progress --depth=1 -- https://github.com/apache/beam.git +refs/heads/*:refs/remotes/origin/* # timeout=10
 > git config remote.origin.url https://github.com/apache/beam.git # timeout=10
 > git config --add remote.origin.fetch +refs/heads/*:refs/remotes/origin/* # timeout=10
 > git config remote.origin.url https://github.com/apache/beam.git # timeout=10
Using shallow fetch with depth 1
Fetching upstream changes from https://github.com/apache/beam.git
 > git fetch --no-tags --force --progress --depth=1 -- https://github.com/apache/beam.git +refs/heads/*:refs/remotes/origin/* +refs/pull/${ghprbPullId}/*:refs/remotes/origin/pr/${ghprbPullId}/* # timeout=10
 > git rev-parse origin/master^{commit} # timeout=10
Checking out Revision 4183e747becebd18becee5fff547af365910fc9c (origin/master)
 > git config core.sparsecheckout # timeout=10
 > git checkout -f 4183e747becebd18becee5fff547af365910fc9c # timeout=10
Commit message: "Bump github.com/aws/aws-sdk-go-v2/feature/s3/manager in /sdks (#26411)"
 > git rev-list --no-walk 4183e747becebd18becee5fff547af365910fc9c # timeout=10
No emails were triggered.
[EnvInject] - Executing scripts and injecting environment variables after the SCM step.
[EnvInject] - Injecting as environment variables the properties content 
SETUPTOOLS_USE_DISTUTILS=stdlib
SPARK_LOCAL_IP=127.0.0.1

[EnvInject] - Variables injected successfully.
[Gradle] - Launching build.
[src] $ <https://ci-beam.apache.org/job/beam_PostCommit_Java_Jpms_Dataflow_Java17/ws/src/gradlew> --continue --max-workers=8 -Dorg.gradle.jvmargs=-Xms2g -Dorg.gradle.jvmargs=-Xmx6g -Dorg.gradle.vfs.watch=false -Pdocker-pull-licenses -PskipCheckerFramework -PcompileAndRunTestsWithJava17 -Pjava17Home=/usr/lib/jvm/java-17-openjdk-amd64 -Pmaven_home=/home/jenkins/tools/maven/apache-maven-3.5.4 :sdks:java:testing:jpms-tests:dataflowRunnerIntegrationTest
To honour the JVM settings for this build a single-use Daemon process will be forked. See https://docs.gradle.org/7.5.1/userguide/gradle_daemon.html#sec:disabling_the_daemon.
Daemon will be stopped at the end of the build 
Configuration on demand is an incubating feature.
Gradle Enterprise plugins resolution: https://plugins.gradle.org/m2
Applying com.gradle.CommonCustomUserDataGradlePlugin via init script
> Task :buildSrc:compileJava NO-SOURCE
> Task :buildSrc:compileGroovy FROM-CACHE
> Task :buildSrc:pluginDescriptors
> Task :buildSrc:processResources
> Task :buildSrc:classes
> Task :buildSrc:jar
> Task :buildSrc:assemble
> Task :buildSrc:spotlessGroovy FROM-CACHE
> Task :buildSrc:spotlessGroovyCheck UP-TO-DATE
> Task :buildSrc:spotlessGroovyGradle FROM-CACHE
> Task :buildSrc:spotlessGroovyGradleCheck UP-TO-DATE
> Task :buildSrc:spotlessCheck UP-TO-DATE
> Task :buildSrc:pluginUnderTestMetadata
> Task :buildSrc:compileTestJava NO-SOURCE
> Task :buildSrc:compileTestGroovy NO-SOURCE
> Task :buildSrc:processTestResources NO-SOURCE
> Task :buildSrc:testClasses UP-TO-DATE
> Task :buildSrc:test NO-SOURCE
> Task :buildSrc:validatePlugins FROM-CACHE
> Task :buildSrc:check UP-TO-DATE
> Task :buildSrc:build

> Configure project :sdks:java:container:java8
docker-pull-licenses set, creating go-licenses

> Configure project :sdks:java:container:java11
docker-pull-licenses set, creating go-licenses

> Task :sdks:java:extensions:avro:generateAvroProtocol NO-SOURCE
> Task :sdks:java:fn-execution:processResources NO-SOURCE
> Task :runners:core-java:processResources NO-SOURCE
> Task :sdks:java:core:generateAvroProtocol NO-SOURCE
> Task :runners:core-construction-java:processResources NO-SOURCE
> Task :model:job-management:extractProto
> Task :model:fn-execution:extractProto
> Task :sdks:java:extensions:avro:generateAvroJava NO-SOURCE
> Task :sdks:java:core:generateAvroJava NO-SOURCE
> Task :sdks:java:extensions:avro:processResources NO-SOURCE
> Task :sdks:java:harness:processResources NO-SOURCE
> Task :sdks:java:extensions:google-cloud-platform-core:processResources NO-SOURCE
> Task :sdks:java:testing:jpms-tests:processResources NO-SOURCE
> Task :runners:java-fn-execution:processResources NO-SOURCE
> Task :sdks:java:expansion-service:processResources NO-SOURCE
> Task :sdks:java:testing:jpms-tests:processTestResources NO-SOURCE
> Task :sdks:java:extensions:arrow:processResources NO-SOURCE
> Task :model:job-management:processResources
> Task :sdks:java:io:google-cloud-platform:processResources NO-SOURCE
> Task :model:fn-execution:processResources
> Task :sdks:java:io:kafka:processResources NO-SOURCE
> Task :sdks:java:extensions:protobuf:extractProto
> Task :sdks:java:extensions:protobuf:processResources NO-SOURCE
> Task :sdks:java:core:generateGrammarSource FROM-CACHE
> Task :sdks:java:core:processResources
> Task :runners:google-cloud-dataflow-java:processResources
> Task :model:pipeline:extractIncludeProto
> Task :model:pipeline:extractProto
> Task :model:pipeline:generateProto FROM-CACHE
> Task :model:pipeline:compileJava FROM-CACHE
> Task :model:pipeline:processResources
> Task :model:pipeline:classes
> Task :model:pipeline:jar
> Task :model:pipeline:shadowJar FROM-CACHE
> Task :model:job-management:extractIncludeProto
> Task :model:fn-execution:extractIncludeProto
> Task :model:job-management:generateProto FROM-CACHE
> Task :model:fn-execution:generateProto FROM-CACHE
> Task :model:job-management:compileJava FROM-CACHE
> Task :model:job-management:classes
> Task :model:fn-execution:compileJava FROM-CACHE
> Task :model:fn-execution:classes
> Task :model:job-management:shadowJar FROM-CACHE
> Task :model:fn-execution:shadowJar FROM-CACHE
> Task :sdks:java:core:compileJava FROM-CACHE
> Task :sdks:java:core:classes
> Task :sdks:java:core:shadowJar FROM-CACHE
> Task :sdks:java:extensions:arrow:compileJava FROM-CACHE
> Task :sdks:java:extensions:arrow:classes UP-TO-DATE
> Task :sdks:java:extensions:avro:compileJava FROM-CACHE
> Task :sdks:java:extensions:avro:classes UP-TO-DATE
> Task :sdks:java:extensions:arrow:jar
> Task :sdks:java:extensions:avro:jar
> Task :sdks:java:fn-execution:compileJava FROM-CACHE
> Task :sdks:java:fn-execution:classes UP-TO-DATE
> Task :sdks:java:fn-execution:jar
> Task :runners:core-construction-java:compileJava FROM-CACHE
> Task :runners:core-construction-java:classes UP-TO-DATE
> Task :runners:core-construction-java:jar
> Task :sdks:java:extensions:protobuf:extractIncludeProto
> Task :sdks:java:extensions:protobuf:generateProto NO-SOURCE
> Task :sdks:java:extensions:protobuf:compileJava FROM-CACHE
> Task :sdks:java:extensions:protobuf:classes UP-TO-DATE
> Task :sdks:java:extensions:protobuf:jar
> Task :runners:core-java:compileJava FROM-CACHE
> Task :runners:core-java:classes UP-TO-DATE
> Task :runners:core-java:jar
> Task :sdks:java:extensions:google-cloud-platform-core:compileJava FROM-CACHE
> Task :sdks:java:extensions:google-cloud-platform-core:classes UP-TO-DATE
> Task :sdks:java:harness:compileJava FROM-CACHE
> Task :sdks:java:harness:classes UP-TO-DATE
> Task :sdks:java:extensions:google-cloud-platform-core:jar
> Task :sdks:java:harness:jar
> Task :runners:java-fn-execution:compileJava FROM-CACHE
> Task :runners:java-fn-execution:classes UP-TO-DATE
> Task :runners:java-fn-execution:jar
> Task :sdks:java:expansion-service:compileJava FROM-CACHE
> Task :sdks:java:expansion-service:classes UP-TO-DATE
> Task :sdks:java:expansion-service:jar
> Task :sdks:java:io:kafka:compileJava FROM-CACHE
> Task :sdks:java:io:kafka:classes UP-TO-DATE
> Task :sdks:java:io:kafka:jar
> Task :sdks:java:io:google-cloud-platform:compileJava FROM-CACHE
> Task :sdks:java:io:google-cloud-platform:classes UP-TO-DATE
> Task :sdks:java:io:google-cloud-platform:jar
> Task :runners:google-cloud-dataflow-java:compileJava FROM-CACHE
> Task :runners:google-cloud-dataflow-java:classes
> Task :runners:google-cloud-dataflow-java:jar
> Task :sdks:java:testing:jpms-tests:compileJava
> Task :sdks:java:testing:jpms-tests:classes
> Task :sdks:java:testing:jpms-tests:jar
> Task :sdks:java:testing:jpms-tests:compileTestJava
> Task :sdks:java:testing:jpms-tests:testClasses
> Task :sdks:java:testing:jpms-tests:testJar
> Task :sdks:java:testing:jpms-tests:dataflowRunnerIntegrationTest

org.apache.beam.sdk.jpmstests.JpmsIT > testE2EJpms FAILED
    java.lang.RuntimeException at JpmsIT.java:63

1 test completed, 1 failed

> Task :sdks:java:testing:jpms-tests:dataflowRunnerIntegrationTest FAILED

FAILURE: Build failed with an exception.

* What went wrong:
Execution failed for task ':sdks:java:testing:jpms-tests:dataflowRunnerIntegrationTest'.
> There were failing tests. See the report at: file://<https://ci-beam.apache.org/job/beam_PostCommit_Java_Jpms_Dataflow_Java17/ws/src/sdks/java/testing/jpms-tests/build/reports/tests/dataflowRunnerIntegrationTest/index.html>

* Try:
> Run with --stacktrace option to get the stack trace.
> Run with --info or --debug option to get more log output.

* Get more help at https://help.gradle.org

Deprecated Gradle features were used in this build, making it incompatible with Gradle 8.0.

You can use '--warning-mode all' to show the individual deprecation warnings and determine if they come from your own scripts or plugins.

See https://docs.gradle.org/7.5.1/userguide/command_line_interface.html#sec:command_line_warnings

BUILD FAILED in 3h 40m 1s
67 actionable tasks: 36 executed, 29 from cache, 2 up-to-date
Build scan background action failed.
java.lang.IllegalArgumentException: com.gradle.enterprise.gradleplugin.internal.extension.a is not an interface
	at java.lang.reflect.Proxy$ProxyClassFactory.apply(Proxy.java:590)
	at java.lang.reflect.Proxy$ProxyClassFactory.apply(Proxy.java:557)
	at java.lang.reflect.WeakCache$Factory.get(WeakCache.java:230)
	at java.lang.reflect.WeakCache.get(WeakCache.java:127)
	at java.lang.reflect.Proxy.getProxyClass0(Proxy.java:419)
	at java.lang.reflect.Proxy.newProxyInstance(Proxy.java:719)
	at com.gradle.ProxyFactory$ProxyingInvocationHandler.createLocalProxy(ProxyFactory.java:64)
	at com.gradle.ProxyFactory$ProxyingInvocationHandler.lambda$adaptActionArg$1(ProxyFactory.java:59)
	at com.gradle.enterprise.gradleplugin.internal.extension.b$3.run(SourceFile:100)
	at java.util.concurrent.Executors$RunnableAdapter.call(Executors.java:511)
	at java.util.concurrent.FutureTask.run(FutureTask.java:266)
	at java.util.concurrent.ThreadPoolExecutor.runWorker(ThreadPoolExecutor.java:1149)
	at java.util.concurrent.ThreadPoolExecutor$Worker.run(ThreadPoolExecutor.java:624)
	at java.lang.Thread.run(Thread.java:750)

Publishing build scan...
https://gradle.com/s/yoiqf45hl5liw

Build step 'Invoke Gradle script' changed build result to FAILURE
Build step 'Invoke Gradle script' marked build as failure

---------------------------------------------------------------------
To unsubscribe, e-mail: builds-unsubscribe@beam.apache.org
For additional commands, e-mail: builds-help@beam.apache.org


beam_PostCommit_Java_Jpms_Dataflow_Java17 - Build # 1771 - Aborted!

Posted by Apache Jenkins Server <je...@builds.apache.org>.
beam_PostCommit_Java_Jpms_Dataflow_Java17 - Build # 1771 - Aborted:

Check console output at https://ci-beam.apache.org/job/beam_PostCommit_Java_Jpms_Dataflow_Java17/1771/ to view the results.

Build failed in Jenkins: beam_PostCommit_Java_Jpms_Dataflow_Java17 #1770

Posted by Apache Jenkins Server <je...@builds.apache.org>.
See <https://ci-beam.apache.org/job/beam_PostCommit_Java_Jpms_Dataflow_Java17/1770/display/redirect>

Changes:


------------------------------------------
Started by timer
Running as SYSTEM
[EnvInject] - Loading node environment variables.
Building remotely on apache-beam-jenkins-7 (beam) in workspace <https://ci-beam.apache.org/job/beam_PostCommit_Java_Jpms_Dataflow_Java17/ws/>
The recommended git tool is: NONE
No credentials specified
Wiping out workspace first.
Cloning the remote Git repository
Using shallow clone with depth 1
Avoid fetching tags
Cloning repository https://github.com/apache/beam.git
 > git init <https://ci-beam.apache.org/job/beam_PostCommit_Java_Jpms_Dataflow_Java17/ws/src> # timeout=10
Fetching upstream changes from https://github.com/apache/beam.git
 > git --version # timeout=10
 > git --version # 'git version 2.25.1'
 > git fetch --no-tags --force --progress --depth=1 -- https://github.com/apache/beam.git +refs/heads/*:refs/remotes/origin/* # timeout=10
 > git config remote.origin.url https://github.com/apache/beam.git # timeout=10
 > git config --add remote.origin.fetch +refs/heads/*:refs/remotes/origin/* # timeout=10
 > git config remote.origin.url https://github.com/apache/beam.git # timeout=10
Using shallow fetch with depth 1
Fetching upstream changes from https://github.com/apache/beam.git
 > git fetch --no-tags --force --progress --depth=1 -- https://github.com/apache/beam.git +refs/heads/*:refs/remotes/origin/* +refs/pull/${ghprbPullId}/*:refs/remotes/origin/pr/${ghprbPullId}/* # timeout=10
 > git rev-parse origin/master^{commit} # timeout=10
Checking out Revision b54684aea935ebbff9640305f0c757ca3c2fd0ae (origin/master)
 > git config core.sparsecheckout # timeout=10
 > git checkout -f b54684aea935ebbff9640305f0c757ca3c2fd0ae # timeout=10
Commit message: "Merge pull request #26416 from Abacn/revert-a12fee"
 > git rev-list --no-walk 7a060c5c95f2fbff07bdf455a86705cd6b5e8ee7 # timeout=10
First time build. Skipping changelog.
No emails were triggered.
[EnvInject] - Executing scripts and injecting environment variables after the SCM step.
[EnvInject] - Injecting as environment variables the properties content 
SETUPTOOLS_USE_DISTUTILS=stdlib
SPARK_LOCAL_IP=127.0.0.1

[EnvInject] - Variables injected successfully.
[Gradle] - Launching build.
[src] $ <https://ci-beam.apache.org/job/beam_PostCommit_Java_Jpms_Dataflow_Java17/ws/src/gradlew> --continue --max-workers=8 -Dorg.gradle.jvmargs=-Xms2g -Dorg.gradle.jvmargs=-Xmx6g -Dorg.gradle.vfs.watch=false -Pdocker-pull-licenses -PskipCheckerFramework -PcompileAndRunTestsWithJava17 -Pjava17Home=/usr/lib/jvm/java-17-openjdk-amd64 -Pmaven_home=/home/jenkins/tools/maven/apache-maven-3.5.4 :sdks:java:testing:jpms-tests:dataflowRunnerIntegrationTest
To honour the JVM settings for this build a single-use Daemon process will be forked. See https://docs.gradle.org/7.5.1/userguide/gradle_daemon.html#sec:disabling_the_daemon.
Daemon will be stopped at the end of the build 
Configuration on demand is an incubating feature.
Gradle Enterprise plugins resolution: https://plugins.gradle.org/m2
Applying com.gradle.CommonCustomUserDataGradlePlugin via init script
> Task :buildSrc:compileJava NO-SOURCE
> Task :buildSrc:compileGroovy FROM-CACHE
> Task :buildSrc:pluginDescriptors
> Task :buildSrc:processResources
> Task :buildSrc:classes
> Task :buildSrc:jar
> Task :buildSrc:assemble
> Task :buildSrc:spotlessGroovy FROM-CACHE
> Task :buildSrc:spotlessGroovyCheck UP-TO-DATE
> Task :buildSrc:spotlessGroovyGradle FROM-CACHE
> Task :buildSrc:spotlessGroovyGradleCheck UP-TO-DATE
> Task :buildSrc:spotlessCheck UP-TO-DATE
> Task :buildSrc:pluginUnderTestMetadata
> Task :buildSrc:compileTestJava NO-SOURCE
> Task :buildSrc:compileTestGroovy NO-SOURCE
> Task :buildSrc:processTestResources NO-SOURCE
> Task :buildSrc:testClasses UP-TO-DATE
> Task :buildSrc:test NO-SOURCE
> Task :buildSrc:validatePlugins FROM-CACHE
> Task :buildSrc:check UP-TO-DATE
> Task :buildSrc:build

> Configure project :sdks:java:container:java8
docker-pull-licenses set, creating go-licenses

> Configure project :sdks:java:container:java11
docker-pull-licenses set, creating go-licenses

> Task :runners:core-construction-java:processResources NO-SOURCE
> Task :sdks:java:core:generateAvroProtocol NO-SOURCE
> Task :runners:core-java:processResources NO-SOURCE
> Task :sdks:java:extensions:avro:generateAvroProtocol NO-SOURCE
> Task :sdks:java:fn-execution:processResources NO-SOURCE
> Task :sdks:java:extensions:google-cloud-platform-core:processResources NO-SOURCE
> Task :sdks:java:core:generateAvroJava NO-SOURCE
> Task :model:job-management:extractProto
> Task :model:fn-execution:extractProto
> Task :sdks:java:testing:jpms-tests:processResources NO-SOURCE
> Task :sdks:java:extensions:avro:generateAvroJava NO-SOURCE
> Task :sdks:java:harness:processResources NO-SOURCE
> Task :sdks:java:testing:jpms-tests:processTestResources NO-SOURCE
> Task :runners:java-fn-execution:processResources NO-SOURCE
> Task :sdks:java:extensions:avro:processResources NO-SOURCE
> Task :sdks:java:extensions:arrow:processResources NO-SOURCE
> Task :sdks:java:expansion-service:processResources NO-SOURCE
> Task :sdks:java:io:kafka:processResources NO-SOURCE
> Task :model:job-management:processResources
> Task :sdks:java:io:google-cloud-platform:processResources NO-SOURCE
> Task :model:fn-execution:processResources
> Task :sdks:java:extensions:protobuf:extractProto
> Task :sdks:java:extensions:protobuf:processResources NO-SOURCE
> Task :sdks:java:core:generateGrammarSource FROM-CACHE
> Task :sdks:java:core:processResources
> Task :runners:google-cloud-dataflow-java:processResources
> Task :model:pipeline:extractIncludeProto
> Task :model:pipeline:extractProto
> Task :model:pipeline:generateProto FROM-CACHE
> Task :model:pipeline:compileJava FROM-CACHE
> Task :model:pipeline:processResources
> Task :model:pipeline:classes
> Task :model:pipeline:jar
> Task :model:pipeline:shadowJar FROM-CACHE
> Task :model:fn-execution:extractIncludeProto
> Task :model:job-management:extractIncludeProto
> Task :model:job-management:generateProto FROM-CACHE
> Task :model:fn-execution:generateProto FROM-CACHE
> Task :model:job-management:compileJava FROM-CACHE
> Task :model:job-management:classes
> Task :model:fn-execution:compileJava FROM-CACHE
> Task :model:fn-execution:classes
> Task :model:job-management:shadowJar FROM-CACHE
> Task :model:fn-execution:shadowJar FROM-CACHE
> Task :sdks:java:core:compileJava FROM-CACHE
> Task :sdks:java:core:classes
> Task :sdks:java:core:shadowJar FROM-CACHE
> Task :sdks:java:extensions:arrow:compileJava FROM-CACHE
> Task :sdks:java:extensions:arrow:classes UP-TO-DATE
> Task :sdks:java:extensions:arrow:jar
> Task :sdks:java:extensions:avro:compileJava FROM-CACHE
> Task :sdks:java:extensions:avro:classes UP-TO-DATE
> Task :sdks:java:extensions:avro:jar
> Task :sdks:java:fn-execution:compileJava FROM-CACHE
> Task :sdks:java:fn-execution:classes UP-TO-DATE
> Task :sdks:java:fn-execution:jar
> Task :runners:core-construction-java:compileJava FROM-CACHE
> Task :runners:core-construction-java:classes UP-TO-DATE
> Task :runners:core-construction-java:jar
> Task :sdks:java:extensions:protobuf:extractIncludeProto
> Task :sdks:java:extensions:protobuf:generateProto NO-SOURCE
> Task :sdks:java:extensions:protobuf:compileJava FROM-CACHE
> Task :sdks:java:extensions:protobuf:classes UP-TO-DATE
> Task :sdks:java:extensions:protobuf:jar
> Task :runners:core-java:compileJava FROM-CACHE
> Task :runners:core-java:classes UP-TO-DATE
> Task :runners:core-java:jar
> Task :sdks:java:extensions:google-cloud-platform-core:compileJava FROM-CACHE
> Task :sdks:java:extensions:google-cloud-platform-core:classes UP-TO-DATE
> Task :sdks:java:harness:compileJava FROM-CACHE
> Task :sdks:java:harness:classes UP-TO-DATE
> Task :sdks:java:extensions:google-cloud-platform-core:jar
> Task :sdks:java:harness:jar
> Task :runners:java-fn-execution:compileJava FROM-CACHE
> Task :runners:java-fn-execution:classes UP-TO-DATE
> Task :runners:java-fn-execution:jar
> Task :sdks:java:expansion-service:compileJava FROM-CACHE
> Task :sdks:java:expansion-service:classes UP-TO-DATE
> Task :sdks:java:expansion-service:jar
> Task :sdks:java:io:kafka:compileJava FROM-CACHE
> Task :sdks:java:io:kafka:classes UP-TO-DATE
> Task :sdks:java:testing:jpms-tests:compileJava FROM-CACHE
> Task :sdks:java:testing:jpms-tests:classes UP-TO-DATE
> Task :sdks:java:testing:jpms-tests:jar
> Task :sdks:java:io:kafka:jar
> Task :sdks:java:testing:jpms-tests:compileTestJava FROM-CACHE
> Task :sdks:java:testing:jpms-tests:testClasses UP-TO-DATE
> Task :sdks:java:testing:jpms-tests:testJar
> Task :sdks:java:io:google-cloud-platform:compileJava FROM-CACHE
> Task :sdks:java:io:google-cloud-platform:classes UP-TO-DATE
> Task :sdks:java:io:google-cloud-platform:jar
> Task :runners:google-cloud-dataflow-java:compileJava FROM-CACHE
> Task :runners:google-cloud-dataflow-java:classes
> Task :runners:google-cloud-dataflow-java:jar
> Task :sdks:java:testing:jpms-tests:dataflowRunnerIntegrationTest

org.apache.beam.sdk.jpmstests.JpmsIT > testE2EJpms FAILED
    java.lang.RuntimeException at JpmsIT.java:63

1 test completed, 1 failed

> Task :sdks:java:testing:jpms-tests:dataflowRunnerIntegrationTest FAILED

FAILURE: Build failed with an exception.

* What went wrong:
Execution failed for task ':sdks:java:testing:jpms-tests:dataflowRunnerIntegrationTest'.
> There were failing tests. See the report at: file://<https://ci-beam.apache.org/job/beam_PostCommit_Java_Jpms_Dataflow_Java17/ws/src/sdks/java/testing/jpms-tests/build/reports/tests/dataflowRunnerIntegrationTest/index.html>

* Try:
> Run with --stacktrace option to get the stack trace.
> Run with --info or --debug option to get more log output.

* Get more help at https://help.gradle.org

Deprecated Gradle features were used in this build, making it incompatible with Gradle 8.0.

You can use '--warning-mode all' to show the individual deprecation warnings and determine if they come from your own scripts or plugins.

See https://docs.gradle.org/7.5.1/userguide/command_line_interface.html#sec:command_line_warnings

BUILD FAILED in 3h 40m 6s
67 actionable tasks: 34 executed, 31 from cache, 2 up-to-date
Build scan background action failed.
java.lang.IllegalArgumentException: com.gradle.enterprise.gradleplugin.internal.extension.a is not an interface
	at java.lang.reflect.Proxy$ProxyClassFactory.apply(Proxy.java:590)
	at java.lang.reflect.Proxy$ProxyClassFactory.apply(Proxy.java:557)
	at java.lang.reflect.WeakCache$Factory.get(WeakCache.java:230)
	at java.lang.reflect.WeakCache.get(WeakCache.java:127)
	at java.lang.reflect.Proxy.getProxyClass0(Proxy.java:419)
	at java.lang.reflect.Proxy.newProxyInstance(Proxy.java:719)
	at com.gradle.ProxyFactory$ProxyingInvocationHandler.createLocalProxy(ProxyFactory.java:64)
	at com.gradle.ProxyFactory$ProxyingInvocationHandler.lambda$adaptActionArg$1(ProxyFactory.java:59)
	at com.gradle.enterprise.gradleplugin.internal.extension.b$3.run(SourceFile:100)
	at java.util.concurrent.Executors$RunnableAdapter.call(Executors.java:511)
	at java.util.concurrent.FutureTask.run(FutureTask.java:266)
	at java.util.concurrent.ThreadPoolExecutor.runWorker(ThreadPoolExecutor.java:1149)
	at java.util.concurrent.ThreadPoolExecutor$Worker.run(ThreadPoolExecutor.java:624)
	at java.lang.Thread.run(Thread.java:750)

Publishing build scan...
https://gradle.com/s/flzoumupxns3y

Build step 'Invoke Gradle script' changed build result to FAILURE
Build step 'Invoke Gradle script' marked build as failure

---------------------------------------------------------------------
To unsubscribe, e-mail: builds-unsubscribe@beam.apache.org
For additional commands, e-mail: builds-help@beam.apache.org


beam_PostCommit_Java_Jpms_Dataflow_Java17 - Build # 1769 - Aborted!

Posted by Apache Jenkins Server <je...@builds.apache.org>.
beam_PostCommit_Java_Jpms_Dataflow_Java17 - Build # 1769 - Aborted:

Check console output at https://ci-beam.apache.org/job/beam_PostCommit_Java_Jpms_Dataflow_Java17/1769/ to view the results.

Build failed in Jenkins: beam_PostCommit_Java_Jpms_Dataflow_Java17 #1768

Posted by Apache Jenkins Server <je...@builds.apache.org>.
See <https://ci-beam.apache.org/job/beam_PostCommit_Java_Jpms_Dataflow_Java17/1768/display/redirect>

Changes:


------------------------------------------
Started by timer
Running as SYSTEM
[EnvInject] - Loading node environment variables.
Building remotely on apache-beam-jenkins-8 (beam) in workspace <https://ci-beam.apache.org/job/beam_PostCommit_Java_Jpms_Dataflow_Java17/ws/>
The recommended git tool is: NONE
No credentials specified
Wiping out workspace first.
Cloning the remote Git repository
Using shallow clone with depth 1
Avoid fetching tags
Cloning repository https://github.com/apache/beam.git
 > git init <https://ci-beam.apache.org/job/beam_PostCommit_Java_Jpms_Dataflow_Java17/ws/src> # timeout=10
Fetching upstream changes from https://github.com/apache/beam.git
 > git --version # timeout=10
 > git --version # 'git version 2.25.1'
 > git fetch --no-tags --force --progress --depth=1 -- https://github.com/apache/beam.git +refs/heads/*:refs/remotes/origin/* # timeout=10
 > git config remote.origin.url https://github.com/apache/beam.git # timeout=10
 > git config --add remote.origin.fetch +refs/heads/*:refs/remotes/origin/* # timeout=10
 > git config remote.origin.url https://github.com/apache/beam.git # timeout=10
Using shallow fetch with depth 1
Fetching upstream changes from https://github.com/apache/beam.git
 > git fetch --no-tags --force --progress --depth=1 -- https://github.com/apache/beam.git +refs/heads/*:refs/remotes/origin/* +refs/pull/${ghprbPullId}/*:refs/remotes/origin/pr/${ghprbPullId}/* # timeout=10
 > git rev-parse origin/master^{commit} # timeout=10
Checking out Revision 85d4276016a1e4388cc9dd431e8f0684eb09fd95 (origin/master)
 > git config core.sparsecheckout # timeout=10
 > git checkout -f 85d4276016a1e4388cc9dd431e8f0684eb09fd95 # timeout=10
Commit message: "Update dataflow python to use external containers (#26383)"
 > git rev-list --no-walk 85d4276016a1e4388cc9dd431e8f0684eb09fd95 # timeout=10
No emails were triggered.
[EnvInject] - Executing scripts and injecting environment variables after the SCM step.
[EnvInject] - Injecting as environment variables the properties content 
SETUPTOOLS_USE_DISTUTILS=stdlib
SPARK_LOCAL_IP=127.0.0.1

[EnvInject] - Variables injected successfully.
[Gradle] - Launching build.
[src] $ <https://ci-beam.apache.org/job/beam_PostCommit_Java_Jpms_Dataflow_Java17/ws/src/gradlew> --continue --max-workers=8 -Dorg.gradle.jvmargs=-Xms2g -Dorg.gradle.jvmargs=-Xmx6g -Dorg.gradle.vfs.watch=false -Pdocker-pull-licenses -PskipCheckerFramework -PcompileAndRunTestsWithJava17 -Pjava17Home=/usr/lib/jvm/java-17-openjdk-amd64 -Pmaven_home=/home/jenkins/tools/maven/apache-maven-3.5.4 :sdks:java:testing:jpms-tests:dataflowRunnerIntegrationTest
To honour the JVM settings for this build a single-use Daemon process will be forked. See https://docs.gradle.org/7.5.1/userguide/gradle_daemon.html#sec:disabling_the_daemon.
Daemon will be stopped at the end of the build 
Configuration on demand is an incubating feature.
Gradle Enterprise plugins resolution: https://plugins.gradle.org/m2
Applying com.gradle.CommonCustomUserDataGradlePlugin via init script
> Task :buildSrc:compileJava NO-SOURCE
> Task :buildSrc:compileGroovy FROM-CACHE
> Task :buildSrc:pluginDescriptors
> Task :buildSrc:processResources
> Task :buildSrc:classes
> Task :buildSrc:jar
> Task :buildSrc:assemble
> Task :buildSrc:spotlessGroovy FROM-CACHE
> Task :buildSrc:spotlessGroovyCheck UP-TO-DATE
> Task :buildSrc:spotlessGroovyGradle FROM-CACHE
> Task :buildSrc:spotlessGroovyGradleCheck UP-TO-DATE
> Task :buildSrc:spotlessCheck UP-TO-DATE
> Task :buildSrc:pluginUnderTestMetadata
> Task :buildSrc:compileTestJava NO-SOURCE
> Task :buildSrc:compileTestGroovy NO-SOURCE
> Task :buildSrc:processTestResources NO-SOURCE
> Task :buildSrc:testClasses UP-TO-DATE
> Task :buildSrc:test NO-SOURCE
> Task :buildSrc:validatePlugins FROM-CACHE
> Task :buildSrc:check UP-TO-DATE
> Task :buildSrc:build

> Configure project :sdks:java:container:java8
docker-pull-licenses set, creating go-licenses

> Configure project :sdks:java:container:java11
docker-pull-licenses set, creating go-licenses

> Task :sdks:java:core:generateAvroProtocol NO-SOURCE
> Task :sdks:java:fn-execution:processResources NO-SOURCE
> Task :runners:core-construction-java:processResources NO-SOURCE
> Task :sdks:java:extensions:avro:generateAvroProtocol NO-SOURCE
> Task :runners:core-java:processResources NO-SOURCE
> Task :sdks:java:core:generateAvroJava NO-SOURCE
> Task :sdks:java:testing:jpms-tests:processResources NO-SOURCE
> Task :sdks:java:extensions:avro:generateAvroJava NO-SOURCE
> Task :sdks:java:harness:processResources NO-SOURCE
> Task :model:fn-execution:extractProto
> Task :sdks:java:testing:jpms-tests:processTestResources NO-SOURCE
> Task :model:job-management:extractProto
> Task :sdks:java:extensions:google-cloud-platform-core:processResources NO-SOURCE
> Task :sdks:java:extensions:avro:processResources NO-SOURCE
> Task :runners:java-fn-execution:processResources NO-SOURCE
> Task :sdks:java:extensions:arrow:processResources NO-SOURCE
> Task :sdks:java:expansion-service:processResources NO-SOURCE
> Task :sdks:java:io:kafka:processResources NO-SOURCE
> Task :model:job-management:processResources
> Task :sdks:java:io:google-cloud-platform:processResources NO-SOURCE
> Task :model:fn-execution:processResources
> Task :sdks:java:extensions:protobuf:extractProto
> Task :sdks:java:core:generateGrammarSource FROM-CACHE
> Task :runners:google-cloud-dataflow-java:processResources
> Task :sdks:java:extensions:protobuf:processResources NO-SOURCE
> Task :sdks:java:core:processResources
> Task :model:pipeline:extractIncludeProto
> Task :model:pipeline:extractProto
> Task :model:pipeline:generateProto FROM-CACHE
> Task :model:pipeline:compileJava FROM-CACHE
> Task :model:pipeline:processResources
> Task :model:pipeline:classes
> Task :model:pipeline:jar
> Task :model:pipeline:shadowJar FROM-CACHE
> Task :model:fn-execution:extractIncludeProto
> Task :model:job-management:extractIncludeProto
> Task :model:job-management:generateProto FROM-CACHE
> Task :model:fn-execution:generateProto FROM-CACHE
> Task :model:job-management:compileJava FROM-CACHE
> Task :model:job-management:classes
> Task :model:fn-execution:compileJava FROM-CACHE
> Task :model:fn-execution:classes
> Task :model:job-management:shadowJar FROM-CACHE
> Task :model:fn-execution:shadowJar FROM-CACHE
> Task :sdks:java:core:compileJava FROM-CACHE
> Task :sdks:java:core:classes
> Task :sdks:java:core:shadowJar FROM-CACHE
> Task :sdks:java:extensions:arrow:compileJava FROM-CACHE
> Task :sdks:java:extensions:arrow:classes UP-TO-DATE
> Task :sdks:java:extensions:arrow:jar
> Task :sdks:java:extensions:avro:compileJava FROM-CACHE
> Task :sdks:java:extensions:avro:classes UP-TO-DATE
> Task :sdks:java:fn-execution:compileJava FROM-CACHE
> Task :sdks:java:fn-execution:classes UP-TO-DATE
> Task :sdks:java:extensions:avro:jar
> Task :sdks:java:fn-execution:jar
> Task :runners:core-construction-java:compileJava FROM-CACHE
> Task :runners:core-construction-java:classes UP-TO-DATE
> Task :runners:core-construction-java:jar
> Task :runners:core-java:compileJava FROM-CACHE
> Task :runners:core-java:classes UP-TO-DATE
> Task :sdks:java:extensions:protobuf:extractIncludeProto
> Task :sdks:java:extensions:protobuf:generateProto NO-SOURCE
> Task :sdks:java:extensions:protobuf:compileJava FROM-CACHE
> Task :sdks:java:extensions:protobuf:classes UP-TO-DATE
> Task :runners:core-java:jar
> Task :sdks:java:extensions:protobuf:jar
> Task :sdks:java:harness:compileJava FROM-CACHE
> Task :sdks:java:harness:classes UP-TO-DATE
> Task :sdks:java:extensions:google-cloud-platform-core:compileJava FROM-CACHE
> Task :sdks:java:extensions:google-cloud-platform-core:classes UP-TO-DATE
> Task :sdks:java:extensions:google-cloud-platform-core:jar
> Task :sdks:java:harness:jar
> Task :runners:java-fn-execution:compileJava FROM-CACHE
> Task :runners:java-fn-execution:classes UP-TO-DATE
> Task :runners:java-fn-execution:jar
> Task :sdks:java:expansion-service:compileJava FROM-CACHE
> Task :sdks:java:expansion-service:classes UP-TO-DATE
> Task :sdks:java:expansion-service:jar
> Task :sdks:java:io:kafka:compileJava FROM-CACHE
> Task :sdks:java:io:kafka:classes UP-TO-DATE
> Task :sdks:java:io:kafka:jar
> Task :sdks:java:testing:jpms-tests:compileJava FROM-CACHE
> Task :sdks:java:testing:jpms-tests:classes UP-TO-DATE
> Task :sdks:java:testing:jpms-tests:jar
> Task :sdks:java:testing:jpms-tests:compileTestJava FROM-CACHE
> Task :sdks:java:testing:jpms-tests:testClasses UP-TO-DATE
> Task :sdks:java:testing:jpms-tests:testJar
> Task :sdks:java:io:google-cloud-platform:compileJava FROM-CACHE
> Task :sdks:java:io:google-cloud-platform:classes UP-TO-DATE
> Task :sdks:java:io:google-cloud-platform:jar
> Task :runners:google-cloud-dataflow-java:compileJava FROM-CACHE
> Task :runners:google-cloud-dataflow-java:classes
> Task :runners:google-cloud-dataflow-java:jar
> Task :sdks:java:testing:jpms-tests:dataflowRunnerIntegrationTest

org.apache.beam.sdk.jpmstests.JpmsIT > testE2EJpms FAILED
    java.lang.RuntimeException at JpmsIT.java:63

1 test completed, 1 failed

> Task :sdks:java:testing:jpms-tests:dataflowRunnerIntegrationTest FAILED

FAILURE: Build failed with an exception.

* What went wrong:
Execution failed for task ':sdks:java:testing:jpms-tests:dataflowRunnerIntegrationTest'.
> There were failing tests. See the report at: file://<https://ci-beam.apache.org/job/beam_PostCommit_Java_Jpms_Dataflow_Java17/ws/src/sdks/java/testing/jpms-tests/build/reports/tests/dataflowRunnerIntegrationTest/index.html>

* Try:
> Run with --stacktrace option to get the stack trace.
> Run with --info or --debug option to get more log output.

* Get more help at https://help.gradle.org

Deprecated Gradle features were used in this build, making it incompatible with Gradle 8.0.

You can use '--warning-mode all' to show the individual deprecation warnings and determine if they come from your own scripts or plugins.

See https://docs.gradle.org/7.5.1/userguide/command_line_interface.html#sec:command_line_warnings

BUILD FAILED in 3h 40m 6s
67 actionable tasks: 34 executed, 31 from cache, 2 up-to-date
Build scan background action failed.
java.lang.IllegalArgumentException: com.gradle.enterprise.gradleplugin.internal.extension.a is not an interface
	at java.lang.reflect.Proxy$ProxyClassFactory.apply(Proxy.java:590)
	at java.lang.reflect.Proxy$ProxyClassFactory.apply(Proxy.java:557)
	at java.lang.reflect.WeakCache$Factory.get(WeakCache.java:230)
	at java.lang.reflect.WeakCache.get(WeakCache.java:127)
	at java.lang.reflect.Proxy.getProxyClass0(Proxy.java:419)
	at java.lang.reflect.Proxy.newProxyInstance(Proxy.java:719)
	at com.gradle.ProxyFactory$ProxyingInvocationHandler.createLocalProxy(ProxyFactory.java:64)
	at com.gradle.ProxyFactory$ProxyingInvocationHandler.lambda$adaptActionArg$1(ProxyFactory.java:59)
	at com.gradle.enterprise.gradleplugin.internal.extension.b$3.run(SourceFile:100)
	at java.util.concurrent.Executors$RunnableAdapter.call(Executors.java:511)
	at java.util.concurrent.FutureTask.run(FutureTask.java:266)
	at java.util.concurrent.ThreadPoolExecutor.runWorker(ThreadPoolExecutor.java:1149)
	at java.util.concurrent.ThreadPoolExecutor$Worker.run(ThreadPoolExecutor.java:624)
	at java.lang.Thread.run(Thread.java:750)

Publishing build scan...
https://gradle.com/s/v53exzdnzmnji

Build step 'Invoke Gradle script' changed build result to FAILURE
Build step 'Invoke Gradle script' marked build as failure

---------------------------------------------------------------------
To unsubscribe, e-mail: builds-unsubscribe@beam.apache.org
For additional commands, e-mail: builds-help@beam.apache.org


beam_PostCommit_Java_Jpms_Dataflow_Java17 - Build # 1767 - Aborted!

Posted by Apache Jenkins Server <je...@builds.apache.org>.
beam_PostCommit_Java_Jpms_Dataflow_Java17 - Build # 1767 - Aborted:

Check console output at https://ci-beam.apache.org/job/beam_PostCommit_Java_Jpms_Dataflow_Java17/1767/ to view the results.

Build failed in Jenkins: beam_PostCommit_Java_Jpms_Dataflow_Java17 #1766

Posted by Apache Jenkins Server <je...@builds.apache.org>.
See <https://ci-beam.apache.org/job/beam_PostCommit_Java_Jpms_Dataflow_Java17/1766/display/redirect?page=changes>

Changes:

[noreply] Allow multi_process_shared objects to be called (#26202)


------------------------------------------
Started by timer
Running as SYSTEM
[EnvInject] - Loading node environment variables.
Building remotely on apache-beam-jenkins-7 (beam) in workspace <https://ci-beam.apache.org/job/beam_PostCommit_Java_Jpms_Dataflow_Java17/ws/>
The recommended git tool is: NONE
No credentials specified
Wiping out workspace first.
Cloning the remote Git repository
Using shallow clone with depth 1
Avoid fetching tags
Cloning repository https://github.com/apache/beam.git
 > git init <https://ci-beam.apache.org/job/beam_PostCommit_Java_Jpms_Dataflow_Java17/ws/src> # timeout=10
Fetching upstream changes from https://github.com/apache/beam.git
 > git --version # timeout=10
 > git --version # 'git version 2.25.1'
 > git fetch --no-tags --force --progress --depth=1 -- https://github.com/apache/beam.git +refs/heads/*:refs/remotes/origin/* # timeout=10
 > git config remote.origin.url https://github.com/apache/beam.git # timeout=10
 > git config --add remote.origin.fetch +refs/heads/*:refs/remotes/origin/* # timeout=10
 > git config remote.origin.url https://github.com/apache/beam.git # timeout=10
Using shallow fetch with depth 1
Fetching upstream changes from https://github.com/apache/beam.git
 > git fetch --no-tags --force --progress --depth=1 -- https://github.com/apache/beam.git +refs/heads/*:refs/remotes/origin/* +refs/pull/${ghprbPullId}/*:refs/remotes/origin/pr/${ghprbPullId}/* # timeout=10
 > git rev-parse origin/master^{commit} # timeout=10
Checking out Revision 44a17cbe429699160e689bd88935c32c6c2de6b2 (origin/master)
 > git config core.sparsecheckout # timeout=10
 > git checkout -f 44a17cbe429699160e689bd88935c32c6c2de6b2 # timeout=10
Commit message: "Allow multi_process_shared objects to be called (#26202)"
 > git rev-list --no-walk f549fd33abdc672143ccbe3f0f66104995d30fe6 # timeout=10
No emails were triggered.
[EnvInject] - Executing scripts and injecting environment variables after the SCM step.
[EnvInject] - Injecting as environment variables the properties content 
SETUPTOOLS_USE_DISTUTILS=stdlib
SPARK_LOCAL_IP=127.0.0.1

[EnvInject] - Variables injected successfully.
[Gradle] - Launching build.
[src] $ <https://ci-beam.apache.org/job/beam_PostCommit_Java_Jpms_Dataflow_Java17/ws/src/gradlew> --continue --max-workers=8 -Dorg.gradle.jvmargs=-Xms2g -Dorg.gradle.jvmargs=-Xmx6g -Dorg.gradle.vfs.watch=false -Pdocker-pull-licenses -PskipCheckerFramework -PcompileAndRunTestsWithJava17 -Pjava17Home=/usr/lib/jvm/java-17-openjdk-amd64 -Pmaven_home=/home/jenkins/tools/maven/apache-maven-3.5.4 :sdks:java:testing:jpms-tests:dataflowRunnerIntegrationTest
To honour the JVM settings for this build a single-use Daemon process will be forked. See https://docs.gradle.org/7.5.1/userguide/gradle_daemon.html#sec:disabling_the_daemon.
Daemon will be stopped at the end of the build 
Configuration on demand is an incubating feature.
Gradle Enterprise plugins resolution: https://plugins.gradle.org/m2
Applying com.gradle.CommonCustomUserDataGradlePlugin via init script
> Task :buildSrc:compileJava NO-SOURCE
> Task :buildSrc:compileGroovy FROM-CACHE
> Task :buildSrc:pluginDescriptors
> Task :buildSrc:processResources
> Task :buildSrc:classes
> Task :buildSrc:jar
> Task :buildSrc:assemble
> Task :buildSrc:spotlessGroovy FROM-CACHE
> Task :buildSrc:spotlessGroovyCheck UP-TO-DATE
> Task :buildSrc:spotlessGroovyGradle FROM-CACHE
> Task :buildSrc:spotlessGroovyGradleCheck UP-TO-DATE
> Task :buildSrc:spotlessCheck UP-TO-DATE
> Task :buildSrc:pluginUnderTestMetadata
> Task :buildSrc:compileTestJava NO-SOURCE
> Task :buildSrc:compileTestGroovy NO-SOURCE
> Task :buildSrc:processTestResources NO-SOURCE
> Task :buildSrc:testClasses UP-TO-DATE
> Task :buildSrc:test NO-SOURCE
> Task :buildSrc:validatePlugins FROM-CACHE
> Task :buildSrc:check UP-TO-DATE
> Task :buildSrc:build

> Configure project :sdks:java:container:java8
docker-pull-licenses set, creating go-licenses

> Configure project :sdks:java:container:java11
docker-pull-licenses set, creating go-licenses

> Task :sdks:java:extensions:avro:generateAvroProtocol NO-SOURCE
> Task :runners:core-java:processResources NO-SOURCE
> Task :sdks:java:fn-execution:processResources NO-SOURCE
> Task :sdks:java:core:generateAvroProtocol NO-SOURCE
> Task :runners:core-construction-java:processResources NO-SOURCE
> Task :model:job-management:extractProto
> Task :model:fn-execution:extractProto
> Task :sdks:java:core:generateAvroJava NO-SOURCE
> Task :sdks:java:extensions:avro:generateAvroJava NO-SOURCE
> Task :sdks:java:testing:jpms-tests:processResources NO-SOURCE
> Task :sdks:java:harness:processResources NO-SOURCE
> Task :sdks:java:extensions:google-cloud-platform-core:processResources NO-SOURCE
> Task :sdks:java:extensions:avro:processResources NO-SOURCE
> Task :sdks:java:testing:jpms-tests:processTestResources NO-SOURCE
> Task :runners:java-fn-execution:processResources NO-SOURCE
> Task :sdks:java:expansion-service:processResources NO-SOURCE
> Task :sdks:java:extensions:arrow:processResources NO-SOURCE
> Task :model:job-management:processResources
> Task :sdks:java:io:kafka:processResources NO-SOURCE
> Task :sdks:java:io:google-cloud-platform:processResources NO-SOURCE
> Task :sdks:java:extensions:protobuf:extractProto
> Task :model:fn-execution:processResources
> Task :sdks:java:extensions:protobuf:processResources NO-SOURCE
> Task :sdks:java:core:generateGrammarSource FROM-CACHE
> Task :sdks:java:core:processResources
> Task :runners:google-cloud-dataflow-java:processResources
> Task :model:pipeline:extractIncludeProto
> Task :model:pipeline:extractProto
> Task :model:pipeline:generateProto FROM-CACHE
> Task :model:pipeline:compileJava FROM-CACHE
> Task :model:pipeline:processResources
> Task :model:pipeline:classes
> Task :model:pipeline:jar
> Task :model:pipeline:shadowJar FROM-CACHE
> Task :model:job-management:extractIncludeProto
> Task :model:fn-execution:extractIncludeProto
> Task :model:job-management:generateProto FROM-CACHE
> Task :model:fn-execution:generateProto FROM-CACHE
> Task :model:fn-execution:compileJava FROM-CACHE
> Task :model:fn-execution:classes
> Task :model:job-management:compileJava FROM-CACHE
> Task :model:job-management:classes
> Task :model:job-management:shadowJar FROM-CACHE
> Task :model:fn-execution:shadowJar FROM-CACHE
> Task :sdks:java:core:compileJava FROM-CACHE
> Task :sdks:java:core:classes
> Task :sdks:java:core:shadowJar FROM-CACHE
> Task :sdks:java:extensions:arrow:compileJava FROM-CACHE
> Task :sdks:java:extensions:arrow:classes UP-TO-DATE
> Task :sdks:java:extensions:arrow:jar
> Task :sdks:java:extensions:avro:compileJava FROM-CACHE
> Task :sdks:java:extensions:avro:classes UP-TO-DATE
> Task :sdks:java:extensions:avro:jar
> Task :sdks:java:fn-execution:compileJava FROM-CACHE
> Task :sdks:java:fn-execution:classes UP-TO-DATE
> Task :sdks:java:fn-execution:jar
> Task :runners:core-construction-java:compileJava FROM-CACHE
> Task :runners:core-construction-java:classes UP-TO-DATE
> Task :runners:core-construction-java:jar
> Task :sdks:java:extensions:protobuf:extractIncludeProto
> Task :sdks:java:extensions:protobuf:generateProto NO-SOURCE
> Task :sdks:java:extensions:protobuf:compileJava FROM-CACHE
> Task :sdks:java:extensions:protobuf:classes UP-TO-DATE
> Task :runners:core-java:compileJava FROM-CACHE
> Task :runners:core-java:classes UP-TO-DATE
> Task :sdks:java:extensions:protobuf:jar
> Task :runners:core-java:jar
> Task :sdks:java:extensions:google-cloud-platform-core:compileJava FROM-CACHE
> Task :sdks:java:extensions:google-cloud-platform-core:classes UP-TO-DATE
> Task :sdks:java:harness:compileJava FROM-CACHE
> Task :sdks:java:harness:classes UP-TO-DATE
> Task :sdks:java:extensions:google-cloud-platform-core:jar
> Task :sdks:java:harness:jar
> Task :runners:java-fn-execution:compileJava FROM-CACHE
> Task :runners:java-fn-execution:classes UP-TO-DATE
> Task :runners:java-fn-execution:jar
> Task :sdks:java:expansion-service:compileJava FROM-CACHE
> Task :sdks:java:expansion-service:classes UP-TO-DATE
> Task :sdks:java:expansion-service:jar
> Task :sdks:java:io:kafka:compileJava FROM-CACHE
> Task :sdks:java:io:kafka:classes UP-TO-DATE
> Task :sdks:java:io:kafka:jar
> Task :sdks:java:io:google-cloud-platform:compileJava FROM-CACHE
> Task :sdks:java:io:google-cloud-platform:classes UP-TO-DATE
> Task :sdks:java:testing:jpms-tests:compileJava FROM-CACHE
> Task :sdks:java:testing:jpms-tests:classes UP-TO-DATE
> Task :sdks:java:testing:jpms-tests:jar
> Task :sdks:java:testing:jpms-tests:compileTestJava FROM-CACHE
> Task :sdks:java:testing:jpms-tests:testClasses UP-TO-DATE
> Task :sdks:java:testing:jpms-tests:testJar
> Task :sdks:java:io:google-cloud-platform:jar
> Task :runners:google-cloud-dataflow-java:compileJava FROM-CACHE
> Task :runners:google-cloud-dataflow-java:classes
> Task :runners:google-cloud-dataflow-java:jar
> Task :sdks:java:testing:jpms-tests:dataflowRunnerIntegrationTest

org.apache.beam.sdk.jpmstests.JpmsIT > testE2EJpms FAILED
    java.lang.RuntimeException at JpmsIT.java:63

1 test completed, 1 failed

> Task :sdks:java:testing:jpms-tests:dataflowRunnerIntegrationTest FAILED

FAILURE: Build failed with an exception.

* What went wrong:
Execution failed for task ':sdks:java:testing:jpms-tests:dataflowRunnerIntegrationTest'.
> There were failing tests. See the report at: file://<https://ci-beam.apache.org/job/beam_PostCommit_Java_Jpms_Dataflow_Java17/ws/src/sdks/java/testing/jpms-tests/build/reports/tests/dataflowRunnerIntegrationTest/index.html>

* Try:
> Run with --stacktrace option to get the stack trace.
> Run with --info or --debug option to get more log output.

* Get more help at https://help.gradle.org

Deprecated Gradle features were used in this build, making it incompatible with Gradle 8.0.

You can use '--warning-mode all' to show the individual deprecation warnings and determine if they come from your own scripts or plugins.

See https://docs.gradle.org/7.5.1/userguide/command_line_interface.html#sec:command_line_warnings

BUILD FAILED in 3h 40m 45s
67 actionable tasks: 34 executed, 31 from cache, 2 up-to-date
Build scan background action failed.
java.lang.IllegalArgumentException: com.gradle.enterprise.gradleplugin.internal.extension.a is not an interface
	at java.lang.reflect.Proxy$ProxyClassFactory.apply(Proxy.java:590)
	at java.lang.reflect.Proxy$ProxyClassFactory.apply(Proxy.java:557)
	at java.lang.reflect.WeakCache$Factory.get(WeakCache.java:230)
	at java.lang.reflect.WeakCache.get(WeakCache.java:127)
	at java.lang.reflect.Proxy.getProxyClass0(Proxy.java:419)
	at java.lang.reflect.Proxy.newProxyInstance(Proxy.java:719)
	at com.gradle.ProxyFactory$ProxyingInvocationHandler.createLocalProxy(ProxyFactory.java:64)
	at com.gradle.ProxyFactory$ProxyingInvocationHandler.lambda$adaptActionArg$1(ProxyFactory.java:59)
	at com.gradle.enterprise.gradleplugin.internal.extension.b$3.run(SourceFile:100)
	at java.util.concurrent.Executors$RunnableAdapter.call(Executors.java:511)
	at java.util.concurrent.FutureTask.run(FutureTask.java:266)
	at java.util.concurrent.ThreadPoolExecutor.runWorker(ThreadPoolExecutor.java:1149)
	at java.util.concurrent.ThreadPoolExecutor$Worker.run(ThreadPoolExecutor.java:624)
	at java.lang.Thread.run(Thread.java:750)

Publishing build scan...
https://gradle.com/s/kznqvpwijxtte

Build step 'Invoke Gradle script' changed build result to FAILURE
Build step 'Invoke Gradle script' marked build as failure

---------------------------------------------------------------------
To unsubscribe, e-mail: builds-unsubscribe@beam.apache.org
For additional commands, e-mail: builds-help@beam.apache.org


beam_PostCommit_Java_Jpms_Dataflow_Java17 - Build # 1765 - Aborted!

Posted by Apache Jenkins Server <je...@builds.apache.org>.
beam_PostCommit_Java_Jpms_Dataflow_Java17 - Build # 1765 - Aborted:

Check console output at https://ci-beam.apache.org/job/beam_PostCommit_Java_Jpms_Dataflow_Java17/1765/ to view the results.

Build failed in Jenkins: beam_PostCommit_Java_Jpms_Dataflow_Java17 #1764

Posted by Apache Jenkins Server <je...@builds.apache.org>.
See <https://ci-beam.apache.org/job/beam_PostCommit_Java_Jpms_Dataflow_Java17/1764/display/redirect>

Changes:


------------------------------------------
Started by timer
Running as SYSTEM
[EnvInject] - Loading node environment variables.
Building remotely on apache-beam-jenkins-7 (beam) in workspace <https://ci-beam.apache.org/job/beam_PostCommit_Java_Jpms_Dataflow_Java17/ws/>
The recommended git tool is: NONE
No credentials specified
Wiping out workspace first.
Cloning the remote Git repository
Using shallow clone with depth 1
Avoid fetching tags
Cloning repository https://github.com/apache/beam.git
 > git init <https://ci-beam.apache.org/job/beam_PostCommit_Java_Jpms_Dataflow_Java17/ws/src> # timeout=10
Fetching upstream changes from https://github.com/apache/beam.git
 > git --version # timeout=10
 > git --version # 'git version 2.25.1'
 > git fetch --no-tags --force --progress --depth=1 -- https://github.com/apache/beam.git +refs/heads/*:refs/remotes/origin/* # timeout=10
 > git config remote.origin.url https://github.com/apache/beam.git # timeout=10
 > git config --add remote.origin.fetch +refs/heads/*:refs/remotes/origin/* # timeout=10
 > git config remote.origin.url https://github.com/apache/beam.git # timeout=10
Using shallow fetch with depth 1
Fetching upstream changes from https://github.com/apache/beam.git
 > git fetch --no-tags --force --progress --depth=1 -- https://github.com/apache/beam.git +refs/heads/*:refs/remotes/origin/* +refs/pull/${ghprbPullId}/*:refs/remotes/origin/pr/${ghprbPullId}/* # timeout=10
 > git rev-parse origin/master^{commit} # timeout=10
Checking out Revision f549fd33abdc672143ccbe3f0f66104995d30fe6 (origin/master)
 > git config core.sparsecheckout # timeout=10
 > git checkout -f f549fd33abdc672143ccbe3f0f66104995d30fe6 # timeout=10
Commit message: "Merge pull request #26063: #21431 Pubsub dynamic topic destinations"
 > git rev-list --no-walk f549fd33abdc672143ccbe3f0f66104995d30fe6 # timeout=10
No emails were triggered.
[EnvInject] - Executing scripts and injecting environment variables after the SCM step.
[EnvInject] - Injecting as environment variables the properties content 
SETUPTOOLS_USE_DISTUTILS=stdlib
SPARK_LOCAL_IP=127.0.0.1

[EnvInject] - Variables injected successfully.
[Gradle] - Launching build.
[src] $ <https://ci-beam.apache.org/job/beam_PostCommit_Java_Jpms_Dataflow_Java17/ws/src/gradlew> --continue --max-workers=8 -Dorg.gradle.jvmargs=-Xms2g -Dorg.gradle.jvmargs=-Xmx6g -Dorg.gradle.vfs.watch=false -Pdocker-pull-licenses -PskipCheckerFramework -PcompileAndRunTestsWithJava17 -Pjava17Home=/usr/lib/jvm/java-17-openjdk-amd64 -Pmaven_home=/home/jenkins/tools/maven/apache-maven-3.5.4 :sdks:java:testing:jpms-tests:dataflowRunnerIntegrationTest
To honour the JVM settings for this build a single-use Daemon process will be forked. See https://docs.gradle.org/7.5.1/userguide/gradle_daemon.html#sec:disabling_the_daemon.
Daemon will be stopped at the end of the build 
Configuration on demand is an incubating feature.
Gradle Enterprise plugins resolution: https://plugins.gradle.org/m2
Applying com.gradle.CommonCustomUserDataGradlePlugin via init script
> Task :buildSrc:compileJava NO-SOURCE
> Task :buildSrc:compileGroovy FROM-CACHE
> Task :buildSrc:pluginDescriptors
> Task :buildSrc:processResources
> Task :buildSrc:classes
> Task :buildSrc:jar
> Task :buildSrc:assemble
> Task :buildSrc:spotlessGroovy FROM-CACHE
> Task :buildSrc:spotlessGroovyCheck UP-TO-DATE
> Task :buildSrc:spotlessGroovyGradle FROM-CACHE
> Task :buildSrc:spotlessGroovyGradleCheck UP-TO-DATE
> Task :buildSrc:spotlessCheck UP-TO-DATE
> Task :buildSrc:pluginUnderTestMetadata
> Task :buildSrc:compileTestJava NO-SOURCE
> Task :buildSrc:compileTestGroovy NO-SOURCE
> Task :buildSrc:processTestResources NO-SOURCE
> Task :buildSrc:testClasses UP-TO-DATE
> Task :buildSrc:test NO-SOURCE
> Task :buildSrc:validatePlugins FROM-CACHE
> Task :buildSrc:check UP-TO-DATE
> Task :buildSrc:build

> Configure project :sdks:java:container:java8
docker-pull-licenses set, creating go-licenses

> Configure project :sdks:java:container:java11
docker-pull-licenses set, creating go-licenses

> Task :sdks:java:fn-execution:processResources NO-SOURCE
> Task :runners:core-construction-java:processResources NO-SOURCE
> Task :sdks:java:core:generateAvroProtocol NO-SOURCE
> Task :sdks:java:extensions:avro:generateAvroProtocol NO-SOURCE
> Task :runners:core-java:processResources NO-SOURCE
> Task :sdks:java:extensions:google-cloud-platform-core:processResources NO-SOURCE
> Task :sdks:java:harness:processResources NO-SOURCE
> Task :sdks:java:core:generateAvroJava NO-SOURCE
> Task :sdks:java:testing:jpms-tests:processResources NO-SOURCE
> Task :sdks:java:extensions:avro:generateAvroJava NO-SOURCE
> Task :model:fn-execution:extractProto
> Task :model:job-management:extractProto
> Task :sdks:java:extensions:avro:processResources NO-SOURCE
> Task :sdks:java:testing:jpms-tests:processTestResources NO-SOURCE
> Task :runners:java-fn-execution:processResources NO-SOURCE
> Task :sdks:java:expansion-service:processResources NO-SOURCE
> Task :sdks:java:extensions:protobuf:extractProto
> Task :sdks:java:extensions:protobuf:processResources NO-SOURCE
> Task :sdks:java:io:kafka:processResources NO-SOURCE
> Task :model:job-management:processResources
> Task :model:fn-execution:processResources
> Task :sdks:java:core:generateGrammarSource FROM-CACHE
> Task :sdks:java:io:google-cloud-platform:processResources NO-SOURCE
> Task :sdks:java:extensions:arrow:processResources NO-SOURCE
> Task :runners:google-cloud-dataflow-java:processResources
> Task :sdks:java:core:processResources
> Task :model:pipeline:extractIncludeProto
> Task :model:pipeline:extractProto
> Task :model:pipeline:generateProto FROM-CACHE
> Task :model:pipeline:compileJava FROM-CACHE
> Task :model:pipeline:processResources
> Task :model:pipeline:classes
> Task :model:pipeline:jar
> Task :model:pipeline:shadowJar FROM-CACHE
> Task :model:job-management:extractIncludeProto
> Task :model:fn-execution:extractIncludeProto
> Task :model:job-management:generateProto FROM-CACHE
> Task :model:fn-execution:generateProto FROM-CACHE
> Task :model:fn-execution:compileJava FROM-CACHE
> Task :model:fn-execution:classes
> Task :model:job-management:compileJava FROM-CACHE
> Task :model:job-management:classes
> Task :model:fn-execution:shadowJar FROM-CACHE
> Task :model:job-management:shadowJar FROM-CACHE
> Task :sdks:java:core:compileJava FROM-CACHE
> Task :sdks:java:core:classes
> Task :sdks:java:core:shadowJar FROM-CACHE
> Task :sdks:java:extensions:arrow:compileJava FROM-CACHE
> Task :sdks:java:extensions:arrow:classes UP-TO-DATE
> Task :sdks:java:extensions:avro:compileJava FROM-CACHE
> Task :sdks:java:extensions:avro:classes UP-TO-DATE
> Task :sdks:java:extensions:arrow:jar
> Task :sdks:java:fn-execution:compileJava FROM-CACHE
> Task :sdks:java:fn-execution:classes UP-TO-DATE
> Task :sdks:java:fn-execution:jar
> Task :sdks:java:extensions:avro:jar
> Task :runners:core-construction-java:compileJava FROM-CACHE
> Task :runners:core-construction-java:classes UP-TO-DATE
> Task :runners:core-construction-java:jar
> Task :sdks:java:extensions:protobuf:extractIncludeProto
> Task :sdks:java:extensions:protobuf:generateProto NO-SOURCE
> Task :sdks:java:extensions:protobuf:compileJava FROM-CACHE
> Task :sdks:java:extensions:protobuf:classes UP-TO-DATE
> Task :runners:core-java:compileJava FROM-CACHE
> Task :runners:core-java:classes UP-TO-DATE
> Task :sdks:java:extensions:protobuf:jar
> Task :runners:core-java:jar
> Task :sdks:java:extensions:google-cloud-platform-core:compileJava FROM-CACHE
> Task :sdks:java:harness:compileJava FROM-CACHE
> Task :sdks:java:extensions:google-cloud-platform-core:classes UP-TO-DATE
> Task :sdks:java:harness:classes UP-TO-DATE
> Task :sdks:java:extensions:google-cloud-platform-core:jar
> Task :sdks:java:harness:jar
> Task :runners:java-fn-execution:compileJava FROM-CACHE
> Task :runners:java-fn-execution:classes UP-TO-DATE
> Task :runners:java-fn-execution:jar
> Task :sdks:java:expansion-service:compileJava FROM-CACHE
> Task :sdks:java:expansion-service:classes UP-TO-DATE
> Task :sdks:java:expansion-service:jar
> Task :sdks:java:io:kafka:compileJava FROM-CACHE
> Task :sdks:java:io:kafka:classes UP-TO-DATE
> Task :sdks:java:io:kafka:jar
> Task :sdks:java:io:google-cloud-platform:compileJava FROM-CACHE
> Task :sdks:java:io:google-cloud-platform:classes UP-TO-DATE
> Task :sdks:java:testing:jpms-tests:compileJava FROM-CACHE
> Task :sdks:java:io:google-cloud-platform:jar
> Task :sdks:java:testing:jpms-tests:classes UP-TO-DATE
> Task :sdks:java:testing:jpms-tests:jar
> Task :sdks:java:testing:jpms-tests:compileTestJava FROM-CACHE
> Task :sdks:java:testing:jpms-tests:testClasses UP-TO-DATE
> Task :sdks:java:testing:jpms-tests:testJar
> Task :runners:google-cloud-dataflow-java:compileJava FROM-CACHE
> Task :runners:google-cloud-dataflow-java:classes
> Task :runners:google-cloud-dataflow-java:jar
> Task :sdks:java:testing:jpms-tests:dataflowRunnerIntegrationTest

org.apache.beam.sdk.jpmstests.JpmsIT > testE2EJpms FAILED
    java.lang.RuntimeException at JpmsIT.java:63

1 test completed, 1 failed

> Task :sdks:java:testing:jpms-tests:dataflowRunnerIntegrationTest FAILED

FAILURE: Build failed with an exception.

* What went wrong:
Execution failed for task ':sdks:java:testing:jpms-tests:dataflowRunnerIntegrationTest'.
> There were failing tests. See the report at: file://<https://ci-beam.apache.org/job/beam_PostCommit_Java_Jpms_Dataflow_Java17/ws/src/sdks/java/testing/jpms-tests/build/reports/tests/dataflowRunnerIntegrationTest/index.html>

* Try:
> Run with --stacktrace option to get the stack trace.
> Run with --info or --debug option to get more log output.

* Get more help at https://help.gradle.org

Deprecated Gradle features were used in this build, making it incompatible with Gradle 8.0.

You can use '--warning-mode all' to show the individual deprecation warnings and determine if they come from your own scripts or plugins.

See https://docs.gradle.org/7.5.1/userguide/command_line_interface.html#sec:command_line_warnings

BUILD FAILED in 3h 39m 59s
67 actionable tasks: 34 executed, 31 from cache, 2 up-to-date
Build scan background action failed.
java.lang.IllegalArgumentException: com.gradle.enterprise.gradleplugin.internal.extension.a is not an interface
	at java.lang.reflect.Proxy$ProxyClassFactory.apply(Proxy.java:590)
	at java.lang.reflect.Proxy$ProxyClassFactory.apply(Proxy.java:557)
	at java.lang.reflect.WeakCache$Factory.get(WeakCache.java:230)
	at java.lang.reflect.WeakCache.get(WeakCache.java:127)
	at java.lang.reflect.Proxy.getProxyClass0(Proxy.java:419)
	at java.lang.reflect.Proxy.newProxyInstance(Proxy.java:719)
	at com.gradle.ProxyFactory$ProxyingInvocationHandler.createLocalProxy(ProxyFactory.java:64)
	at com.gradle.ProxyFactory$ProxyingInvocationHandler.lambda$adaptActionArg$1(ProxyFactory.java:59)
	at com.gradle.enterprise.gradleplugin.internal.extension.b$3.run(SourceFile:100)
	at java.util.concurrent.Executors$RunnableAdapter.call(Executors.java:511)
	at java.util.concurrent.FutureTask.run(FutureTask.java:266)
	at java.util.concurrent.ThreadPoolExecutor.runWorker(ThreadPoolExecutor.java:1149)
	at java.util.concurrent.ThreadPoolExecutor$Worker.run(ThreadPoolExecutor.java:624)
	at java.lang.Thread.run(Thread.java:750)

Publishing build scan...
https://gradle.com/s/eib4o544uybpg

Build step 'Invoke Gradle script' changed build result to FAILURE
Build step 'Invoke Gradle script' marked build as failure

---------------------------------------------------------------------
To unsubscribe, e-mail: builds-unsubscribe@beam.apache.org
For additional commands, e-mail: builds-help@beam.apache.org


beam_PostCommit_Java_Jpms_Dataflow_Java17 - Build # 1763 - Aborted!

Posted by Apache Jenkins Server <je...@builds.apache.org>.
beam_PostCommit_Java_Jpms_Dataflow_Java17 - Build # 1763 - Aborted:

Check console output at https://ci-beam.apache.org/job/beam_PostCommit_Java_Jpms_Dataflow_Java17/1763/ to view the results.

Build failed in Jenkins: beam_PostCommit_Java_Jpms_Dataflow_Java17 #1762

Posted by Apache Jenkins Server <je...@builds.apache.org>.
See <https://ci-beam.apache.org/job/beam_PostCommit_Java_Jpms_Dataflow_Java17/1762/display/redirect>

Changes:


------------------------------------------
Started by timer
Running as SYSTEM
[EnvInject] - Loading node environment variables.
Building remotely on apache-beam-jenkins-8 (beam) in workspace <https://ci-beam.apache.org/job/beam_PostCommit_Java_Jpms_Dataflow_Java17/ws/>
The recommended git tool is: NONE
No credentials specified
Wiping out workspace first.
Cloning the remote Git repository
Using shallow clone with depth 1
Avoid fetching tags
Cloning repository https://github.com/apache/beam.git
 > git init <https://ci-beam.apache.org/job/beam_PostCommit_Java_Jpms_Dataflow_Java17/ws/src> # timeout=10
Fetching upstream changes from https://github.com/apache/beam.git
 > git --version # timeout=10
 > git --version # 'git version 2.25.1'
 > git fetch --no-tags --force --progress --depth=1 -- https://github.com/apache/beam.git +refs/heads/*:refs/remotes/origin/* # timeout=10
 > git config remote.origin.url https://github.com/apache/beam.git # timeout=10
 > git config --add remote.origin.fetch +refs/heads/*:refs/remotes/origin/* # timeout=10
 > git config remote.origin.url https://github.com/apache/beam.git # timeout=10
Using shallow fetch with depth 1
Fetching upstream changes from https://github.com/apache/beam.git
 > git fetch --no-tags --force --progress --depth=1 -- https://github.com/apache/beam.git +refs/heads/*:refs/remotes/origin/* +refs/pull/${ghprbPullId}/*:refs/remotes/origin/pr/${ghprbPullId}/* # timeout=10
 > git rev-parse origin/master^{commit} # timeout=10
Checking out Revision f549fd33abdc672143ccbe3f0f66104995d30fe6 (origin/master)
 > git config core.sparsecheckout # timeout=10
 > git checkout -f f549fd33abdc672143ccbe3f0f66104995d30fe6 # timeout=10
Commit message: "Merge pull request #26063: #21431 Pubsub dynamic topic destinations"
 > git rev-list --no-walk f549fd33abdc672143ccbe3f0f66104995d30fe6 # timeout=10
No emails were triggered.
[EnvInject] - Executing scripts and injecting environment variables after the SCM step.
[EnvInject] - Injecting as environment variables the properties content 
SETUPTOOLS_USE_DISTUTILS=stdlib
SPARK_LOCAL_IP=127.0.0.1

[EnvInject] - Variables injected successfully.
[Gradle] - Launching build.
[src] $ <https://ci-beam.apache.org/job/beam_PostCommit_Java_Jpms_Dataflow_Java17/ws/src/gradlew> --continue --max-workers=8 -Dorg.gradle.jvmargs=-Xms2g -Dorg.gradle.jvmargs=-Xmx6g -Dorg.gradle.vfs.watch=false -Pdocker-pull-licenses -PskipCheckerFramework -PcompileAndRunTestsWithJava17 -Pjava17Home=/usr/lib/jvm/java-17-openjdk-amd64 -Pmaven_home=/home/jenkins/tools/maven/apache-maven-3.5.4 :sdks:java:testing:jpms-tests:dataflowRunnerIntegrationTest
To honour the JVM settings for this build a single-use Daemon process will be forked. See https://docs.gradle.org/7.5.1/userguide/gradle_daemon.html#sec:disabling_the_daemon.
Daemon will be stopped at the end of the build 
Configuration on demand is an incubating feature.
Gradle Enterprise plugins resolution: https://plugins.gradle.org/m2
Applying com.gradle.CommonCustomUserDataGradlePlugin via init script
> Task :buildSrc:compileJava NO-SOURCE
> Task :buildSrc:compileGroovy FROM-CACHE
> Task :buildSrc:pluginDescriptors
> Task :buildSrc:processResources
> Task :buildSrc:classes
> Task :buildSrc:jar
> Task :buildSrc:assemble
> Task :buildSrc:spotlessGroovy FROM-CACHE
> Task :buildSrc:spotlessGroovyCheck UP-TO-DATE
> Task :buildSrc:spotlessGroovyGradle FROM-CACHE
> Task :buildSrc:spotlessGroovyGradleCheck UP-TO-DATE
> Task :buildSrc:spotlessCheck UP-TO-DATE
> Task :buildSrc:pluginUnderTestMetadata
> Task :buildSrc:compileTestJava NO-SOURCE
> Task :buildSrc:compileTestGroovy NO-SOURCE
> Task :buildSrc:processTestResources NO-SOURCE
> Task :buildSrc:testClasses UP-TO-DATE
> Task :buildSrc:test NO-SOURCE
> Task :buildSrc:validatePlugins FROM-CACHE
> Task :buildSrc:check UP-TO-DATE
> Task :buildSrc:build

> Configure project :sdks:java:container:java8
docker-pull-licenses set, creating go-licenses

> Configure project :sdks:java:container:java11
docker-pull-licenses set, creating go-licenses

> Task :sdks:java:core:generateAvroProtocol NO-SOURCE
> Task :sdks:java:extensions:avro:generateAvroProtocol NO-SOURCE
> Task :runners:core-java:processResources NO-SOURCE
> Task :sdks:java:fn-execution:processResources NO-SOURCE
> Task :runners:core-construction-java:processResources NO-SOURCE
> Task :model:job-management:extractProto
> Task :model:fn-execution:extractProto
> Task :sdks:java:extensions:avro:generateAvroJava NO-SOURCE
> Task :sdks:java:extensions:google-cloud-platform-core:processResources NO-SOURCE
> Task :sdks:java:core:generateAvroJava NO-SOURCE
> Task :sdks:java:harness:processResources NO-SOURCE
> Task :sdks:java:testing:jpms-tests:processResources NO-SOURCE
> Task :sdks:java:extensions:avro:processResources NO-SOURCE
> Task :runners:java-fn-execution:processResources NO-SOURCE
> Task :sdks:java:expansion-service:processResources NO-SOURCE
> Task :sdks:java:extensions:arrow:processResources NO-SOURCE
> Task :sdks:java:testing:jpms-tests:processTestResources NO-SOURCE
> Task :sdks:java:io:kafka:processResources NO-SOURCE
> Task :model:job-management:processResources
> Task :sdks:java:io:google-cloud-platform:processResources NO-SOURCE
> Task :model:fn-execution:processResources
> Task :sdks:java:extensions:protobuf:extractProto
> Task :sdks:java:extensions:protobuf:processResources NO-SOURCE
> Task :sdks:java:core:generateGrammarSource FROM-CACHE
> Task :sdks:java:core:processResources
> Task :runners:google-cloud-dataflow-java:processResources
> Task :model:pipeline:extractIncludeProto
> Task :model:pipeline:extractProto
> Task :model:pipeline:generateProto FROM-CACHE
> Task :model:pipeline:compileJava FROM-CACHE
> Task :model:pipeline:processResources
> Task :model:pipeline:classes
> Task :model:pipeline:jar
> Task :model:pipeline:shadowJar FROM-CACHE
> Task :model:job-management:extractIncludeProto
> Task :model:fn-execution:extractIncludeProto
> Task :model:job-management:generateProto FROM-CACHE
> Task :model:fn-execution:generateProto FROM-CACHE
> Task :model:job-management:compileJava FROM-CACHE
> Task :model:job-management:classes
> Task :model:fn-execution:compileJava FROM-CACHE
> Task :model:fn-execution:classes
> Task :model:job-management:shadowJar FROM-CACHE
> Task :model:fn-execution:shadowJar FROM-CACHE
> Task :sdks:java:core:compileJava FROM-CACHE
> Task :sdks:java:core:classes
> Task :sdks:java:core:shadowJar FROM-CACHE
> Task :sdks:java:extensions:avro:compileJava FROM-CACHE
> Task :sdks:java:extensions:avro:classes UP-TO-DATE
> Task :sdks:java:extensions:arrow:compileJava FROM-CACHE
> Task :sdks:java:extensions:arrow:classes UP-TO-DATE
> Task :sdks:java:extensions:arrow:jar
> Task :sdks:java:extensions:avro:jar
> Task :sdks:java:fn-execution:compileJava FROM-CACHE
> Task :sdks:java:fn-execution:classes UP-TO-DATE
> Task :sdks:java:fn-execution:jar
> Task :runners:core-construction-java:compileJava FROM-CACHE
> Task :runners:core-construction-java:classes UP-TO-DATE
> Task :sdks:java:extensions:protobuf:extractIncludeProto
> Task :sdks:java:extensions:protobuf:generateProto NO-SOURCE
> Task :sdks:java:extensions:protobuf:compileJava FROM-CACHE
> Task :sdks:java:extensions:protobuf:classes UP-TO-DATE
> Task :runners:core-construction-java:jar
> Task :sdks:java:extensions:protobuf:jar
> Task :runners:core-java:compileJava FROM-CACHE
> Task :runners:core-java:classes UP-TO-DATE
> Task :runners:core-java:jar
> Task :sdks:java:harness:compileJava FROM-CACHE
> Task :sdks:java:harness:classes UP-TO-DATE
> Task :sdks:java:extensions:google-cloud-platform-core:compileJava FROM-CACHE
> Task :sdks:java:extensions:google-cloud-platform-core:classes UP-TO-DATE
> Task :sdks:java:extensions:google-cloud-platform-core:jar
> Task :sdks:java:harness:jar
> Task :runners:java-fn-execution:compileJava FROM-CACHE
> Task :runners:java-fn-execution:classes UP-TO-DATE
> Task :runners:java-fn-execution:jar
> Task :sdks:java:expansion-service:compileJava FROM-CACHE
> Task :sdks:java:expansion-service:classes UP-TO-DATE
> Task :sdks:java:expansion-service:jar
> Task :sdks:java:io:kafka:compileJava FROM-CACHE
> Task :sdks:java:io:kafka:classes UP-TO-DATE
> Task :sdks:java:io:kafka:jar
> Task :sdks:java:io:google-cloud-platform:compileJava FROM-CACHE
> Task :sdks:java:io:google-cloud-platform:classes UP-TO-DATE
> Task :sdks:java:io:google-cloud-platform:jar
> Task :runners:google-cloud-dataflow-java:compileJava FROM-CACHE
> Task :runners:google-cloud-dataflow-java:classes
> Task :runners:google-cloud-dataflow-java:jar
> Task :sdks:java:testing:jpms-tests:compileJava FROM-CACHE
> Task :sdks:java:testing:jpms-tests:classes UP-TO-DATE
> Task :sdks:java:testing:jpms-tests:jar
> Task :sdks:java:testing:jpms-tests:compileTestJava FROM-CACHE
> Task :sdks:java:testing:jpms-tests:testClasses UP-TO-DATE
> Task :sdks:java:testing:jpms-tests:testJar
> Task :sdks:java:testing:jpms-tests:dataflowRunnerIntegrationTest

org.apache.beam.sdk.jpmstests.JpmsIT > testE2EJpms FAILED
    java.lang.RuntimeException at JpmsIT.java:63

1 test completed, 1 failed

> Task :sdks:java:testing:jpms-tests:dataflowRunnerIntegrationTest FAILED

FAILURE: Build failed with an exception.

* What went wrong:
Execution failed for task ':sdks:java:testing:jpms-tests:dataflowRunnerIntegrationTest'.
> There were failing tests. See the report at: file://<https://ci-beam.apache.org/job/beam_PostCommit_Java_Jpms_Dataflow_Java17/ws/src/sdks/java/testing/jpms-tests/build/reports/tests/dataflowRunnerIntegrationTest/index.html>

* Try:
> Run with --stacktrace option to get the stack trace.
> Run with --info or --debug option to get more log output.

* Get more help at https://help.gradle.org

Deprecated Gradle features were used in this build, making it incompatible with Gradle 8.0.

You can use '--warning-mode all' to show the individual deprecation warnings and determine if they come from your own scripts or plugins.

See https://docs.gradle.org/7.5.1/userguide/command_line_interface.html#sec:command_line_warnings

BUILD FAILED in 3h 40m 7s
67 actionable tasks: 34 executed, 31 from cache, 2 up-to-date
Build scan background action failed.
java.lang.IllegalArgumentException: com.gradle.enterprise.gradleplugin.internal.extension.a is not an interface
	at java.lang.reflect.Proxy$ProxyClassFactory.apply(Proxy.java:590)
	at java.lang.reflect.Proxy$ProxyClassFactory.apply(Proxy.java:557)
	at java.lang.reflect.WeakCache$Factory.get(WeakCache.java:230)
	at java.lang.reflect.WeakCache.get(WeakCache.java:127)
	at java.lang.reflect.Proxy.getProxyClass0(Proxy.java:419)
	at java.lang.reflect.Proxy.newProxyInstance(Proxy.java:719)
	at com.gradle.ProxyFactory$ProxyingInvocationHandler.createLocalProxy(ProxyFactory.java:64)
	at com.gradle.ProxyFactory$ProxyingInvocationHandler.lambda$adaptActionArg$1(ProxyFactory.java:59)
	at com.gradle.enterprise.gradleplugin.internal.extension.b$3.run(SourceFile:100)
	at java.util.concurrent.Executors$RunnableAdapter.call(Executors.java:511)
	at java.util.concurrent.FutureTask.run(FutureTask.java:266)
	at java.util.concurrent.ThreadPoolExecutor.runWorker(ThreadPoolExecutor.java:1149)
	at java.util.concurrent.ThreadPoolExecutor$Worker.run(ThreadPoolExecutor.java:624)
	at java.lang.Thread.run(Thread.java:750)

Publishing build scan...
https://gradle.com/s/rehmjasd4rgvq

Build step 'Invoke Gradle script' changed build result to FAILURE
Build step 'Invoke Gradle script' marked build as failure

---------------------------------------------------------------------
To unsubscribe, e-mail: builds-unsubscribe@beam.apache.org
For additional commands, e-mail: builds-help@beam.apache.org


beam_PostCommit_Java_Jpms_Dataflow_Java17 - Build # 1761 - Aborted!

Posted by Apache Jenkins Server <je...@builds.apache.org>.
beam_PostCommit_Java_Jpms_Dataflow_Java17 - Build # 1761 - Aborted:

Check console output at https://ci-beam.apache.org/job/beam_PostCommit_Java_Jpms_Dataflow_Java17/1761/ to view the results.

Build failed in Jenkins: beam_PostCommit_Java_Jpms_Dataflow_Java17 #1760

Posted by Apache Jenkins Server <je...@builds.apache.org>.
See <https://ci-beam.apache.org/job/beam_PostCommit_Java_Jpms_Dataflow_Java17/1760/display/redirect>

Changes:


------------------------------------------
Started by timer
Running as SYSTEM
[EnvInject] - Loading node environment variables.
Building remotely on apache-beam-jenkins-8 (beam) in workspace <https://ci-beam.apache.org/job/beam_PostCommit_Java_Jpms_Dataflow_Java17/ws/>
The recommended git tool is: NONE
No credentials specified
Wiping out workspace first.
Cloning the remote Git repository
Using shallow clone with depth 1
Avoid fetching tags
Cloning repository https://github.com/apache/beam.git
 > git init <https://ci-beam.apache.org/job/beam_PostCommit_Java_Jpms_Dataflow_Java17/ws/src> # timeout=10
Fetching upstream changes from https://github.com/apache/beam.git
 > git --version # timeout=10
 > git --version # 'git version 2.25.1'
 > git fetch --no-tags --force --progress --depth=1 -- https://github.com/apache/beam.git +refs/heads/*:refs/remotes/origin/* # timeout=10
 > git config remote.origin.url https://github.com/apache/beam.git # timeout=10
 > git config --add remote.origin.fetch +refs/heads/*:refs/remotes/origin/* # timeout=10
 > git config remote.origin.url https://github.com/apache/beam.git # timeout=10
Using shallow fetch with depth 1
Fetching upstream changes from https://github.com/apache/beam.git
 > git fetch --no-tags --force --progress --depth=1 -- https://github.com/apache/beam.git +refs/heads/*:refs/remotes/origin/* +refs/pull/${ghprbPullId}/*:refs/remotes/origin/pr/${ghprbPullId}/* # timeout=10
 > git rev-parse origin/master^{commit} # timeout=10
Checking out Revision f549fd33abdc672143ccbe3f0f66104995d30fe6 (origin/master)
 > git config core.sparsecheckout # timeout=10
 > git checkout -f f549fd33abdc672143ccbe3f0f66104995d30fe6 # timeout=10
Commit message: "Merge pull request #26063: #21431 Pubsub dynamic topic destinations"
 > git rev-list --no-walk f549fd33abdc672143ccbe3f0f66104995d30fe6 # timeout=10
No emails were triggered.
[EnvInject] - Executing scripts and injecting environment variables after the SCM step.
[EnvInject] - Injecting as environment variables the properties content 
SETUPTOOLS_USE_DISTUTILS=stdlib
SPARK_LOCAL_IP=127.0.0.1

[EnvInject] - Variables injected successfully.
[Gradle] - Launching build.
[src] $ <https://ci-beam.apache.org/job/beam_PostCommit_Java_Jpms_Dataflow_Java17/ws/src/gradlew> --continue --max-workers=8 -Dorg.gradle.jvmargs=-Xms2g -Dorg.gradle.jvmargs=-Xmx6g -Dorg.gradle.vfs.watch=false -Pdocker-pull-licenses -PskipCheckerFramework -PcompileAndRunTestsWithJava17 -Pjava17Home=/usr/lib/jvm/java-17-openjdk-amd64 -Pmaven_home=/home/jenkins/tools/maven/apache-maven-3.5.4 :sdks:java:testing:jpms-tests:dataflowRunnerIntegrationTest
To honour the JVM settings for this build a single-use Daemon process will be forked. See https://docs.gradle.org/7.5.1/userguide/gradle_daemon.html#sec:disabling_the_daemon.
Daemon will be stopped at the end of the build 
Configuration on demand is an incubating feature.
Gradle Enterprise plugins resolution: https://plugins.gradle.org/m2
Applying com.gradle.CommonCustomUserDataGradlePlugin via init script
> Task :buildSrc:compileJava NO-SOURCE
> Task :buildSrc:compileGroovy FROM-CACHE
> Task :buildSrc:pluginDescriptors
> Task :buildSrc:processResources
> Task :buildSrc:classes
> Task :buildSrc:jar
> Task :buildSrc:assemble
> Task :buildSrc:spotlessGroovy FROM-CACHE
> Task :buildSrc:spotlessGroovyCheck UP-TO-DATE
> Task :buildSrc:spotlessGroovyGradle FROM-CACHE
> Task :buildSrc:spotlessGroovyGradleCheck UP-TO-DATE
> Task :buildSrc:spotlessCheck UP-TO-DATE
> Task :buildSrc:pluginUnderTestMetadata
> Task :buildSrc:compileTestJava NO-SOURCE
> Task :buildSrc:compileTestGroovy NO-SOURCE
> Task :buildSrc:processTestResources NO-SOURCE
> Task :buildSrc:testClasses UP-TO-DATE
> Task :buildSrc:test NO-SOURCE
> Task :buildSrc:validatePlugins FROM-CACHE
> Task :buildSrc:check UP-TO-DATE
> Task :buildSrc:build

> Configure project :sdks:java:container:java8
docker-pull-licenses set, creating go-licenses

> Configure project :sdks:java:container:java11
docker-pull-licenses set, creating go-licenses

> Task :runners:core-java:processResources NO-SOURCE
> Task :runners:core-construction-java:processResources NO-SOURCE
> Task :sdks:java:extensions:avro:generateAvroProtocol NO-SOURCE
> Task :sdks:java:fn-execution:processResources NO-SOURCE
> Task :sdks:java:core:generateAvroProtocol NO-SOURCE
> Task :model:job-management:extractProto
> Task :model:fn-execution:extractProto
> Task :sdks:java:extensions:avro:generateAvroJava NO-SOURCE
> Task :sdks:java:core:generateAvroJava NO-SOURCE
> Task :sdks:java:extensions:google-cloud-platform-core:processResources NO-SOURCE
> Task :sdks:java:harness:processResources NO-SOURCE
> Task :sdks:java:testing:jpms-tests:processResources NO-SOURCE
> Task :sdks:java:extensions:avro:processResources NO-SOURCE
> Task :sdks:java:testing:jpms-tests:processTestResources NO-SOURCE
> Task :runners:java-fn-execution:processResources NO-SOURCE
> Task :sdks:java:expansion-service:processResources NO-SOURCE
> Task :sdks:java:extensions:arrow:processResources NO-SOURCE
> Task :sdks:java:io:google-cloud-platform:processResources NO-SOURCE
> Task :model:job-management:processResources
> Task :sdks:java:io:kafka:processResources NO-SOURCE
> Task :model:fn-execution:processResources
> Task :sdks:java:extensions:protobuf:extractProto
> Task :sdks:java:extensions:protobuf:processResources NO-SOURCE
> Task :sdks:java:core:generateGrammarSource FROM-CACHE
> Task :sdks:java:core:processResources
> Task :runners:google-cloud-dataflow-java:processResources
> Task :model:pipeline:extractIncludeProto
> Task :model:pipeline:extractProto
> Task :model:pipeline:generateProto FROM-CACHE
> Task :model:pipeline:compileJava FROM-CACHE
> Task :model:pipeline:processResources
> Task :model:pipeline:classes
> Task :model:pipeline:jar
> Task :model:pipeline:shadowJar FROM-CACHE
> Task :model:job-management:extractIncludeProto
> Task :model:fn-execution:extractIncludeProto
> Task :model:job-management:generateProto FROM-CACHE
> Task :model:fn-execution:generateProto FROM-CACHE
> Task :model:fn-execution:compileJava FROM-CACHE
> Task :model:fn-execution:classes
> Task :model:job-management:compileJava FROM-CACHE
> Task :model:job-management:classes
> Task :model:job-management:shadowJar FROM-CACHE
> Task :model:fn-execution:shadowJar FROM-CACHE
> Task :sdks:java:core:compileJava FROM-CACHE
> Task :sdks:java:core:classes
> Task :sdks:java:core:shadowJar FROM-CACHE
> Task :sdks:java:extensions:avro:compileJava FROM-CACHE
> Task :sdks:java:extensions:avro:classes UP-TO-DATE
> Task :sdks:java:extensions:avro:jar
> Task :sdks:java:extensions:arrow:compileJava FROM-CACHE
> Task :sdks:java:extensions:arrow:classes UP-TO-DATE
> Task :sdks:java:extensions:arrow:jar
> Task :sdks:java:fn-execution:compileJava FROM-CACHE
> Task :sdks:java:fn-execution:classes UP-TO-DATE
> Task :sdks:java:fn-execution:jar
> Task :runners:core-construction-java:compileJava FROM-CACHE
> Task :runners:core-construction-java:classes UP-TO-DATE
> Task :sdks:java:extensions:protobuf:extractIncludeProto
> Task :sdks:java:extensions:protobuf:generateProto NO-SOURCE
> Task :runners:core-construction-java:jar
> Task :sdks:java:extensions:protobuf:compileJava FROM-CACHE
> Task :sdks:java:extensions:protobuf:classes UP-TO-DATE
> Task :runners:core-java:compileJava FROM-CACHE
> Task :runners:core-java:classes UP-TO-DATE
> Task :sdks:java:extensions:protobuf:jar
> Task :runners:core-java:jar
> Task :sdks:java:extensions:google-cloud-platform-core:compileJava FROM-CACHE
> Task :sdks:java:extensions:google-cloud-platform-core:classes UP-TO-DATE
> Task :sdks:java:harness:compileJava FROM-CACHE
> Task :sdks:java:harness:classes UP-TO-DATE
> Task :sdks:java:extensions:google-cloud-platform-core:jar
> Task :sdks:java:harness:jar
> Task :runners:java-fn-execution:compileJava FROM-CACHE
> Task :runners:java-fn-execution:classes UP-TO-DATE
> Task :sdks:java:testing:jpms-tests:compileJava FROM-CACHE
> Task :sdks:java:testing:jpms-tests:classes UP-TO-DATE
> Task :sdks:java:testing:jpms-tests:jar
> Task :sdks:java:testing:jpms-tests:compileTestJava FROM-CACHE
> Task :sdks:java:testing:jpms-tests:testClasses UP-TO-DATE
> Task :runners:java-fn-execution:jar
> Task :sdks:java:testing:jpms-tests:testJar
> Task :sdks:java:expansion-service:compileJava FROM-CACHE
> Task :sdks:java:expansion-service:classes UP-TO-DATE
> Task :sdks:java:expansion-service:jar
> Task :sdks:java:io:kafka:compileJava FROM-CACHE
> Task :sdks:java:io:kafka:classes UP-TO-DATE
> Task :sdks:java:io:kafka:jar
> Task :sdks:java:io:google-cloud-platform:compileJava FROM-CACHE
> Task :sdks:java:io:google-cloud-platform:classes UP-TO-DATE
> Task :sdks:java:io:google-cloud-platform:jar
> Task :runners:google-cloud-dataflow-java:compileJava FROM-CACHE
> Task :runners:google-cloud-dataflow-java:classes
> Task :runners:google-cloud-dataflow-java:jar
> Task :sdks:java:testing:jpms-tests:dataflowRunnerIntegrationTest

org.apache.beam.sdk.jpmstests.JpmsIT > testE2EJpms FAILED
    java.lang.RuntimeException at JpmsIT.java:63

1 test completed, 1 failed

> Task :sdks:java:testing:jpms-tests:dataflowRunnerIntegrationTest FAILED

FAILURE: Build failed with an exception.

* What went wrong:
Execution failed for task ':sdks:java:testing:jpms-tests:dataflowRunnerIntegrationTest'.
> There were failing tests. See the report at: file://<https://ci-beam.apache.org/job/beam_PostCommit_Java_Jpms_Dataflow_Java17/ws/src/sdks/java/testing/jpms-tests/build/reports/tests/dataflowRunnerIntegrationTest/index.html>

* Try:
> Run with --stacktrace option to get the stack trace.
> Run with --info or --debug option to get more log output.

* Get more help at https://help.gradle.org

Deprecated Gradle features were used in this build, making it incompatible with Gradle 8.0.

You can use '--warning-mode all' to show the individual deprecation warnings and determine if they come from your own scripts or plugins.

See https://docs.gradle.org/7.5.1/userguide/command_line_interface.html#sec:command_line_warnings

BUILD FAILED in 3h 40m 2s
67 actionable tasks: 34 executed, 31 from cache, 2 up-to-date
Build scan background action failed.
java.lang.IllegalArgumentException: com.gradle.enterprise.gradleplugin.internal.extension.a is not an interface
	at java.lang.reflect.Proxy$ProxyClassFactory.apply(Proxy.java:590)
	at java.lang.reflect.Proxy$ProxyClassFactory.apply(Proxy.java:557)
	at java.lang.reflect.WeakCache$Factory.get(WeakCache.java:230)
	at java.lang.reflect.WeakCache.get(WeakCache.java:127)
	at java.lang.reflect.Proxy.getProxyClass0(Proxy.java:419)
	at java.lang.reflect.Proxy.newProxyInstance(Proxy.java:719)
	at com.gradle.ProxyFactory$ProxyingInvocationHandler.createLocalProxy(ProxyFactory.java:64)
	at com.gradle.ProxyFactory$ProxyingInvocationHandler.lambda$adaptActionArg$1(ProxyFactory.java:59)
	at com.gradle.enterprise.gradleplugin.internal.extension.b$3.run(SourceFile:100)
	at java.util.concurrent.Executors$RunnableAdapter.call(Executors.java:511)
	at java.util.concurrent.FutureTask.run(FutureTask.java:266)
	at java.util.concurrent.ThreadPoolExecutor.runWorker(ThreadPoolExecutor.java:1149)
	at java.util.concurrent.ThreadPoolExecutor$Worker.run(ThreadPoolExecutor.java:624)
	at java.lang.Thread.run(Thread.java:750)

Publishing build scan...
https://gradle.com/s/zf45vbpwxuef2

Build step 'Invoke Gradle script' changed build result to FAILURE
Build step 'Invoke Gradle script' marked build as failure

---------------------------------------------------------------------
To unsubscribe, e-mail: builds-unsubscribe@beam.apache.org
For additional commands, e-mail: builds-help@beam.apache.org


beam_PostCommit_Java_Jpms_Dataflow_Java17 - Build # 1759 - Aborted!

Posted by Apache Jenkins Server <je...@builds.apache.org>.
beam_PostCommit_Java_Jpms_Dataflow_Java17 - Build # 1759 - Aborted:

Check console output at https://ci-beam.apache.org/job/beam_PostCommit_Java_Jpms_Dataflow_Java17/1759/ to view the results.

Build failed in Jenkins: beam_PostCommit_Java_Jpms_Dataflow_Java17 #1758

Posted by Apache Jenkins Server <je...@builds.apache.org>.
See <https://ci-beam.apache.org/job/beam_PostCommit_Java_Jpms_Dataflow_Java17/1758/display/redirect>

Changes:


------------------------------------------
Started by timer
Running as SYSTEM
[EnvInject] - Loading node environment variables.
Building remotely on apache-beam-jenkins-8 (beam) in workspace <https://ci-beam.apache.org/job/beam_PostCommit_Java_Jpms_Dataflow_Java17/ws/>
The recommended git tool is: NONE
No credentials specified
Wiping out workspace first.
Cloning the remote Git repository
Using shallow clone with depth 1
Avoid fetching tags
Cloning repository https://github.com/apache/beam.git
 > git init <https://ci-beam.apache.org/job/beam_PostCommit_Java_Jpms_Dataflow_Java17/ws/src> # timeout=10
Fetching upstream changes from https://github.com/apache/beam.git
 > git --version # timeout=10
 > git --version # 'git version 2.25.1'
 > git fetch --no-tags --force --progress --depth=1 -- https://github.com/apache/beam.git +refs/heads/*:refs/remotes/origin/* # timeout=10
 > git config remote.origin.url https://github.com/apache/beam.git # timeout=10
 > git config --add remote.origin.fetch +refs/heads/*:refs/remotes/origin/* # timeout=10
 > git config remote.origin.url https://github.com/apache/beam.git # timeout=10
Using shallow fetch with depth 1
Fetching upstream changes from https://github.com/apache/beam.git
 > git fetch --no-tags --force --progress --depth=1 -- https://github.com/apache/beam.git +refs/heads/*:refs/remotes/origin/* +refs/pull/${ghprbPullId}/*:refs/remotes/origin/pr/${ghprbPullId}/* # timeout=10
 > git rev-parse origin/master^{commit} # timeout=10
Checking out Revision f549fd33abdc672143ccbe3f0f66104995d30fe6 (origin/master)
 > git config core.sparsecheckout # timeout=10
 > git checkout -f f549fd33abdc672143ccbe3f0f66104995d30fe6 # timeout=10
Commit message: "Merge pull request #26063: #21431 Pubsub dynamic topic destinations"
 > git rev-list --no-walk f549fd33abdc672143ccbe3f0f66104995d30fe6 # timeout=10
No emails were triggered.
[EnvInject] - Executing scripts and injecting environment variables after the SCM step.
[EnvInject] - Injecting as environment variables the properties content 
SETUPTOOLS_USE_DISTUTILS=stdlib
SPARK_LOCAL_IP=127.0.0.1

[EnvInject] - Variables injected successfully.
[Gradle] - Launching build.
[src] $ <https://ci-beam.apache.org/job/beam_PostCommit_Java_Jpms_Dataflow_Java17/ws/src/gradlew> --continue --max-workers=8 -Dorg.gradle.jvmargs=-Xms2g -Dorg.gradle.jvmargs=-Xmx6g -Dorg.gradle.vfs.watch=false -Pdocker-pull-licenses -PskipCheckerFramework -PcompileAndRunTestsWithJava17 -Pjava17Home=/usr/lib/jvm/java-17-openjdk-amd64 -Pmaven_home=/home/jenkins/tools/maven/apache-maven-3.5.4 :sdks:java:testing:jpms-tests:dataflowRunnerIntegrationTest
To honour the JVM settings for this build a single-use Daemon process will be forked. See https://docs.gradle.org/7.5.1/userguide/gradle_daemon.html#sec:disabling_the_daemon.
Daemon will be stopped at the end of the build 
Configuration on demand is an incubating feature.
Gradle Enterprise plugins resolution: https://plugins.gradle.org/m2
Applying com.gradle.CommonCustomUserDataGradlePlugin via init script
> Task :buildSrc:compileJava NO-SOURCE
> Task :buildSrc:compileGroovy FROM-CACHE
> Task :buildSrc:pluginDescriptors
> Task :buildSrc:processResources
> Task :buildSrc:classes
> Task :buildSrc:jar
> Task :buildSrc:assemble
> Task :buildSrc:spotlessGroovy FROM-CACHE
> Task :buildSrc:spotlessGroovyCheck UP-TO-DATE
> Task :buildSrc:spotlessGroovyGradle FROM-CACHE
> Task :buildSrc:spotlessGroovyGradleCheck UP-TO-DATE
> Task :buildSrc:spotlessCheck UP-TO-DATE
> Task :buildSrc:pluginUnderTestMetadata
> Task :buildSrc:compileTestJava NO-SOURCE
> Task :buildSrc:compileTestGroovy NO-SOURCE
> Task :buildSrc:processTestResources NO-SOURCE
> Task :buildSrc:testClasses UP-TO-DATE
> Task :buildSrc:test NO-SOURCE
> Task :buildSrc:validatePlugins FROM-CACHE
> Task :buildSrc:check UP-TO-DATE
> Task :buildSrc:build

> Configure project :sdks:java:container:java8
docker-pull-licenses set, creating go-licenses

> Configure project :sdks:java:container:java11
docker-pull-licenses set, creating go-licenses

> Task :sdks:java:core:generateAvroProtocol NO-SOURCE
> Task :runners:core-java:processResources NO-SOURCE
> Task :sdks:java:extensions:avro:generateAvroProtocol NO-SOURCE
> Task :sdks:java:fn-execution:processResources NO-SOURCE
> Task :runners:core-construction-java:processResources NO-SOURCE
> Task :sdks:java:extensions:avro:generateAvroJava NO-SOURCE
> Task :sdks:java:core:generateAvroJava NO-SOURCE
> Task :sdks:java:extensions:google-cloud-platform-core:processResources NO-SOURCE
> Task :model:job-management:extractProto
> Task :sdks:java:testing:jpms-tests:processResources NO-SOURCE
> Task :sdks:java:harness:processResources NO-SOURCE
> Task :sdks:java:extensions:avro:processResources NO-SOURCE
> Task :model:fn-execution:extractProto
> Task :sdks:java:testing:jpms-tests:processTestResources NO-SOURCE
> Task :runners:java-fn-execution:processResources NO-SOURCE
> Task :sdks:java:expansion-service:processResources NO-SOURCE
> Task :sdks:java:extensions:arrow:processResources NO-SOURCE
> Task :sdks:java:io:google-cloud-platform:processResources NO-SOURCE
> Task :sdks:java:io:kafka:processResources NO-SOURCE
> Task :model:job-management:processResources
> Task :sdks:java:extensions:protobuf:extractProto
> Task :sdks:java:extensions:protobuf:processResources NO-SOURCE
> Task :model:fn-execution:processResources
> Task :sdks:java:core:generateGrammarSource FROM-CACHE
> Task :sdks:java:core:processResources
> Task :runners:google-cloud-dataflow-java:processResources
> Task :model:pipeline:extractIncludeProto
> Task :model:pipeline:extractProto
> Task :model:pipeline:generateProto FROM-CACHE
> Task :model:pipeline:compileJava FROM-CACHE
> Task :model:pipeline:processResources
> Task :model:pipeline:classes
> Task :model:pipeline:jar
> Task :model:pipeline:shadowJar FROM-CACHE
> Task :model:fn-execution:extractIncludeProto
> Task :model:job-management:extractIncludeProto
> Task :model:job-management:generateProto FROM-CACHE
> Task :model:fn-execution:generateProto FROM-CACHE
> Task :model:job-management:compileJava FROM-CACHE
> Task :model:job-management:classes
> Task :model:fn-execution:compileJava FROM-CACHE
> Task :model:fn-execution:classes
> Task :model:job-management:shadowJar FROM-CACHE
> Task :model:fn-execution:shadowJar FROM-CACHE
> Task :sdks:java:core:compileJava FROM-CACHE
> Task :sdks:java:core:classes
> Task :sdks:java:core:shadowJar FROM-CACHE
> Task :sdks:java:extensions:avro:compileJava FROM-CACHE
> Task :sdks:java:extensions:avro:classes UP-TO-DATE
> Task :sdks:java:extensions:avro:jar
> Task :sdks:java:extensions:arrow:compileJava FROM-CACHE
> Task :sdks:java:extensions:arrow:classes UP-TO-DATE
> Task :sdks:java:extensions:arrow:jar
> Task :sdks:java:fn-execution:compileJava FROM-CACHE
> Task :sdks:java:fn-execution:classes UP-TO-DATE
> Task :sdks:java:fn-execution:jar
> Task :runners:core-construction-java:compileJava FROM-CACHE
> Task :runners:core-construction-java:classes UP-TO-DATE
> Task :runners:core-construction-java:jar
> Task :sdks:java:extensions:protobuf:extractIncludeProto
> Task :sdks:java:extensions:protobuf:generateProto NO-SOURCE
> Task :sdks:java:extensions:protobuf:compileJava FROM-CACHE
> Task :sdks:java:extensions:protobuf:classes UP-TO-DATE
> Task :sdks:java:extensions:protobuf:jar
> Task :runners:core-java:compileJava FROM-CACHE
> Task :runners:core-java:classes UP-TO-DATE
> Task :runners:core-java:jar
> Task :sdks:java:harness:compileJava FROM-CACHE
> Task :sdks:java:harness:classes UP-TO-DATE
> Task :sdks:java:extensions:google-cloud-platform-core:compileJava FROM-CACHE
> Task :sdks:java:extensions:google-cloud-platform-core:classes UP-TO-DATE
> Task :sdks:java:extensions:google-cloud-platform-core:jar
> Task :sdks:java:harness:jar
> Task :runners:java-fn-execution:compileJava FROM-CACHE
> Task :runners:java-fn-execution:classes UP-TO-DATE
> Task :runners:java-fn-execution:jar
> Task :sdks:java:expansion-service:compileJava FROM-CACHE
> Task :sdks:java:expansion-service:classes UP-TO-DATE
> Task :sdks:java:expansion-service:jar
> Task :sdks:java:io:kafka:compileJava FROM-CACHE
> Task :sdks:java:io:kafka:classes UP-TO-DATE
> Task :sdks:java:io:kafka:jar
> Task :sdks:java:io:google-cloud-platform:compileJava FROM-CACHE
> Task :sdks:java:io:google-cloud-platform:classes UP-TO-DATE
> Task :sdks:java:io:google-cloud-platform:jar
> Task :runners:google-cloud-dataflow-java:compileJava FROM-CACHE
> Task :runners:google-cloud-dataflow-java:classes
> Task :runners:google-cloud-dataflow-java:jar
> Task :sdks:java:testing:jpms-tests:compileJava FROM-CACHE
> Task :sdks:java:testing:jpms-tests:classes UP-TO-DATE
> Task :sdks:java:testing:jpms-tests:jar
> Task :sdks:java:testing:jpms-tests:compileTestJava FROM-CACHE
> Task :sdks:java:testing:jpms-tests:testClasses UP-TO-DATE
> Task :sdks:java:testing:jpms-tests:testJar
> Task :sdks:java:testing:jpms-tests:dataflowRunnerIntegrationTest

org.apache.beam.sdk.jpmstests.JpmsIT > testE2EJpms FAILED
    java.lang.RuntimeException at JpmsIT.java:63

1 test completed, 1 failed

> Task :sdks:java:testing:jpms-tests:dataflowRunnerIntegrationTest FAILED

FAILURE: Build failed with an exception.

* What went wrong:
Execution failed for task ':sdks:java:testing:jpms-tests:dataflowRunnerIntegrationTest'.
> There were failing tests. See the report at: file://<https://ci-beam.apache.org/job/beam_PostCommit_Java_Jpms_Dataflow_Java17/ws/src/sdks/java/testing/jpms-tests/build/reports/tests/dataflowRunnerIntegrationTest/index.html>

* Try:
> Run with --stacktrace option to get the stack trace.
> Run with --info or --debug option to get more log output.

* Get more help at https://help.gradle.org

Deprecated Gradle features were used in this build, making it incompatible with Gradle 8.0.

You can use '--warning-mode all' to show the individual deprecation warnings and determine if they come from your own scripts or plugins.

See https://docs.gradle.org/7.5.1/userguide/command_line_interface.html#sec:command_line_warnings

BUILD FAILED in 3h 39m 59s
67 actionable tasks: 34 executed, 31 from cache, 2 up-to-date
Build scan background action failed.
java.lang.IllegalArgumentException: com.gradle.enterprise.gradleplugin.internal.extension.a is not an interface
	at java.lang.reflect.Proxy$ProxyClassFactory.apply(Proxy.java:590)
	at java.lang.reflect.Proxy$ProxyClassFactory.apply(Proxy.java:557)
	at java.lang.reflect.WeakCache$Factory.get(WeakCache.java:230)
	at java.lang.reflect.WeakCache.get(WeakCache.java:127)
	at java.lang.reflect.Proxy.getProxyClass0(Proxy.java:419)
	at java.lang.reflect.Proxy.newProxyInstance(Proxy.java:719)
	at com.gradle.ProxyFactory$ProxyingInvocationHandler.createLocalProxy(ProxyFactory.java:64)
	at com.gradle.ProxyFactory$ProxyingInvocationHandler.lambda$adaptActionArg$1(ProxyFactory.java:59)
	at com.gradle.enterprise.gradleplugin.internal.extension.b$3.run(SourceFile:100)
	at java.util.concurrent.Executors$RunnableAdapter.call(Executors.java:511)
	at java.util.concurrent.FutureTask.run(FutureTask.java:266)
	at java.util.concurrent.ThreadPoolExecutor.runWorker(ThreadPoolExecutor.java:1149)
	at java.util.concurrent.ThreadPoolExecutor$Worker.run(ThreadPoolExecutor.java:624)
	at java.lang.Thread.run(Thread.java:750)

Publishing build scan...
https://gradle.com/s/cqibcfm5fi7wa

Build step 'Invoke Gradle script' changed build result to FAILURE
Build step 'Invoke Gradle script' marked build as failure

---------------------------------------------------------------------
To unsubscribe, e-mail: builds-unsubscribe@beam.apache.org
For additional commands, e-mail: builds-help@beam.apache.org