You are viewing a plain text version of this content. The canonical link for it is here.
Posted to issues@flink.apache.org by "Xintong Song (Jira)" <ji...@apache.org> on 2021/08/12 03:16:00 UTC

[jira] [Commented] (FLINK-20558) ParquetAvroStreamingFileSinkITCase.testWriteParquetAvroSpecific test failure

    [ https://issues.apache.org/jira/browse/FLINK-20558?page=com.atlassian.jira.plugin.system.issuetabpanels:comment-tabpanel&focusedCommentId=17397780#comment-17397780 ] 

Xintong Song commented on FLINK-20558:
--------------------------------------

https://dev.azure.com/apache-flink/apache-flink/_build/results?buildId=21934&view=logs&j=e1276d0f-df12-55ec-86b5-c0ad597d83c9&t=906e9244-f3be-5604-1979-e767c8a6f6d9&l=12891

> ParquetAvroStreamingFileSinkITCase.testWriteParquetAvroSpecific test failure
> ----------------------------------------------------------------------------
>
>                 Key: FLINK-20558
>                 URL: https://issues.apache.org/jira/browse/FLINK-20558
>             Project: Flink
>          Issue Type: Bug
>          Components: Formats (JSON, Avro, Parquet, ORC, SequenceFile)
>    Affects Versions: 1.13.0
>            Reporter: Matthias
>            Priority: Minor
>              Labels: auto-deprioritized-major, test-stability, testability
>
> [Build|https://dev.azure.com/mapohl/flink/_build/results?buildId=135&view=results] failed due to failing test \{{ParquetAvroStreamingFileSinkITCase.testWriteParquetAvroSpecific}}.
> {code:java}
> [ERROR] Tests run: 3, Failures: 1, Errors: 0, Skipped: 0, Time elapsed: 10.193 s <<< FAILURE! - in org.apache.flink.formats.parquet.avro.ParquetAvroStreamingFileSinkITCase
> [ERROR] testWriteParquetAvroSpecific(org.apache.flink.formats.parquet.avro.ParquetAvroStreamingFileSinkITCase)  Time elapsed: 0.561 s  <<< FAILURE!
> java.lang.AssertionError: expected:<1> but was:<2>
> 	at org.junit.Assert.fail(Assert.java:88)
> 	at org.junit.Assert.failNotEquals(Assert.java:834)
> 	at org.junit.Assert.assertEquals(Assert.java:645)
> 	at org.junit.Assert.assertEquals(Assert.java:631)
> 	at org.apache.flink.formats.parquet.avro.ParquetAvroStreamingFileSinkITCase.validateResults(ParquetAvroStreamingFileSinkITCase.java:160)
> 	at org.apache.flink.formats.parquet.avro.ParquetAvroStreamingFileSinkITCase.testWriteParquetAvroSpecific(ParquetAvroStreamingFileSinkITCase.java:95)
> 	at sun.reflect.NativeMethodAccessorImpl.invoke0(Native Method)
> 	at sun.reflect.NativeMethodAccessorImpl.invoke(NativeMethodAccessorImpl.java:62)
> 	at sun.reflect.DelegatingMethodAccessorImpl.invoke(DelegatingMethodAccessorImpl.java:43)
> 	at java.lang.reflect.Method.invoke(Method.java:498)
> 	at org.junit.runners.model.FrameworkMethod$1.runReflectiveCall(FrameworkMethod.java:50)
> 	at org.junit.internal.runners.model.ReflectiveCallable.run(ReflectiveCallable.java:12)
> 	at org.junit.runners.model.FrameworkMethod.invokeExplosively(FrameworkMethod.java:47)
> 	at org.junit.internal.runners.statements.InvokeMethod.evaluate(InvokeMethod.java:17)
> 	at org.junit.internal.runners.statements.FailOnTimeout$CallableStatement.call(FailOnTimeout.java:298)
> 	at org.junit.internal.runners.statements.FailOnTimeout$CallableStatement.call(FailOnTimeout.java:292)
> 	at java.util.concurrent.FutureTask.run(FutureTask.java:266)
> 	at java.lang.Thread.run(Thread.java:748) {code}
> The assertion was caused by [this assert call checking the number of files in the bucket|https://github.com/apache/flink/blob/fdea3cdc47052d59fc20611e1be019d223d77501/flink-formats/flink-parquet/src/test/java/org/apache/flink/formats/parquet/avro/ParquetAvroStreamingFileSinkITCase.java#L160].



--
This message was sent by Atlassian Jira
(v8.3.4#803005)