You are viewing a plain text version of this content. The canonical link for it is here.
Posted to dev@lucene.apache.org by Policeman Jenkins Server <je...@thetaphi.de> on 2019/02/25 10:16:35 UTC

[JENKINS-EA] Lucene-Solr-master-Linux (64bit/jdk-12-ea+shipilev-fastdebug) - Build # 23719 - Still Unstable!

Build: https://jenkins.thetaphi.de/job/Lucene-Solr-master-Linux/23719/
Java: 64bit/jdk-12-ea+shipilev-fastdebug -XX:-UseCompressedOops -XX:+UseParallelGC

12 tests failed.
FAILED:  org.apache.solr.cloud.BasicDistributedZkTest.test

Error Message:
Error from server at http://127.0.0.1:33747: ADDREPLICA failed to create replica

Stack Trace:
org.apache.solr.client.solrj.impl.HttpSolrClient$RemoteSolrException: Error from server at http://127.0.0.1:33747: ADDREPLICA failed to create replica
	at __randomizedtesting.SeedInfo.seed([A96B68EE79AFC9C2:213F5734D753A43A]:0)
	at org.apache.solr.client.solrj.impl.HttpSolrClient.executeMethod(HttpSolrClient.java:650)
	at org.apache.solr.client.solrj.impl.HttpSolrClient.request(HttpSolrClient.java:256)
	at org.apache.solr.client.solrj.impl.HttpSolrClient.request(HttpSolrClient.java:245)
	at org.apache.solr.client.solrj.impl.LBSolrClient.doRequest(LBSolrClient.java:368)
	at org.apache.solr.client.solrj.impl.LBSolrClient.request(LBSolrClient.java:296)
	at org.apache.solr.client.solrj.impl.LBHttpSolrClient.request(LBHttpSolrClient.java:213)
	at org.apache.solr.client.solrj.impl.CloudSolrClient.sendRequest(CloudSolrClient.java:1110)
	at org.apache.solr.client.solrj.impl.CloudSolrClient.requestWithRetryOnStaleState(CloudSolrClient.java:884)
	at org.apache.solr.client.solrj.impl.CloudSolrClient.request(CloudSolrClient.java:817)
	at org.apache.solr.client.solrj.SolrRequest.process(SolrRequest.java:207)
	at org.apache.solr.client.solrj.SolrRequest.process(SolrRequest.java:224)
	at org.apache.solr.cloud.BasicDistributedZkTest.testANewCollectionInOneInstanceWithManualShardAssignement(BasicDistributedZkTest.java:862)
	at org.apache.solr.cloud.BasicDistributedZkTest.test(BasicDistributedZkTest.java:422)
	at java.base/jdk.internal.reflect.NativeMethodAccessorImpl.invoke0(Native Method)
	at java.base/jdk.internal.reflect.NativeMethodAccessorImpl.invoke(NativeMethodAccessorImpl.java:62)
	at java.base/jdk.internal.reflect.DelegatingMethodAccessorImpl.invoke(DelegatingMethodAccessorImpl.java:43)
	at java.base/java.lang.reflect.Method.invoke(Method.java:567)
	at com.carrotsearch.randomizedtesting.RandomizedRunner.invoke(RandomizedRunner.java:1750)
	at com.carrotsearch.randomizedtesting.RandomizedRunner$8.evaluate(RandomizedRunner.java:938)
	at com.carrotsearch.randomizedtesting.RandomizedRunner$9.evaluate(RandomizedRunner.java:974)
	at com.carrotsearch.randomizedtesting.RandomizedRunner$10.evaluate(RandomizedRunner.java:988)
	at org.apache.solr.BaseDistributedSearchTestCase$ShardsRepeatRule$ShardsFixedStatement.callStatement(BaseDistributedSearchTestCase.java:1082)
	at org.apache.solr.BaseDistributedSearchTestCase$ShardsRepeatRule$ShardsStatement.evaluate(BaseDistributedSearchTestCase.java:1054)
	at com.carrotsearch.randomizedtesting.rules.SystemPropertiesRestoreRule$1.evaluate(SystemPropertiesRestoreRule.java:57)
	at org.apache.lucene.util.TestRuleSetupTeardownChained$1.evaluate(TestRuleSetupTeardownChained.java:49)
	at org.apache.lucene.util.AbstractBeforeAfterRule$1.evaluate(AbstractBeforeAfterRule.java:45)
	at org.apache.lucene.util.TestRuleThreadAndTestName$1.evaluate(TestRuleThreadAndTestName.java:48)
	at org.apache.lucene.util.TestRuleIgnoreAfterMaxFailures$1.evaluate(TestRuleIgnoreAfterMaxFailures.java:64)
	at org.apache.lucene.util.TestRuleMarkFailure$1.evaluate(TestRuleMarkFailure.java:47)
	at com.carrotsearch.randomizedtesting.rules.StatementAdapter.evaluate(StatementAdapter.java:36)
	at com.carrotsearch.randomizedtesting.ThreadLeakControl$StatementRunner.run(ThreadLeakControl.java:368)
	at com.carrotsearch.randomizedtesting.ThreadLeakControl.forkTimeoutingTask(ThreadLeakControl.java:817)
	at com.carrotsearch.randomizedtesting.ThreadLeakControl$3.evaluate(ThreadLeakControl.java:468)
	at com.carrotsearch.randomizedtesting.RandomizedRunner.runSingleTest(RandomizedRunner.java:947)
	at com.carrotsearch.randomizedtesting.RandomizedRunner$5.evaluate(RandomizedRunner.java:832)
	at com.carrotsearch.randomizedtesting.RandomizedRunner$6.evaluate(RandomizedRunner.java:883)
	at com.carrotsearch.randomizedtesting.RandomizedRunner$7.evaluate(RandomizedRunner.java:894)
	at com.carrotsearch.randomizedtesting.rules.StatementAdapter.evaluate(StatementAdapter.java:36)
	at com.carrotsearch.randomizedtesting.rules.SystemPropertiesRestoreRule$1.evaluate(SystemPropertiesRestoreRule.java:57)
	at org.apache.lucene.util.AbstractBeforeAfterRule$1.evaluate(AbstractBeforeAfterRule.java:45)
	at com.carrotsearch.randomizedtesting.rules.StatementAdapter.evaluate(StatementAdapter.java:36)
	at org.apache.lucene.util.TestRuleStoreClassName$1.evaluate(TestRuleStoreClassName.java:41)
	at com.carrotsearch.randomizedtesting.rules.NoShadowingOrOverridesOnMethodsRule$1.evaluate(NoShadowingOrOverridesOnMethodsRule.java:40)
	at com.carrotsearch.randomizedtesting.rules.NoShadowingOrOverridesOnMethodsRule$1.evaluate(NoShadowingOrOverridesOnMethodsRule.java:40)
	at com.carrotsearch.randomizedtesting.rules.StatementAdapter.evaluate(StatementAdapter.java:36)
	at com.carrotsearch.randomizedtesting.rules.StatementAdapter.evaluate(StatementAdapter.java:36)
	at org.apache.lucene.util.TestRuleAssertionsRequired$1.evaluate(TestRuleAssertionsRequired.java:53)
	at org.apache.lucene.util.TestRuleMarkFailure$1.evaluate(TestRuleMarkFailure.java:47)
	at org.apache.lucene.util.TestRuleIgnoreAfterMaxFailures$1.evaluate(TestRuleIgnoreAfterMaxFailures.java:64)
	at org.apache.lucene.util.TestRuleIgnoreTestSuites$1.evaluate(TestRuleIgnoreTestSuites.java:54)
	at com.carrotsearch.randomizedtesting.rules.StatementAdapter.evaluate(StatementAdapter.java:36)
	at com.carrotsearch.randomizedtesting.ThreadLeakControl$StatementRunner.run(ThreadLeakControl.java:368)
	at java.base/java.lang.Thread.run(Thread.java:835)


FAILED:  org.apache.solr.cloud.UnloadDistributedZkTest.test

Error Message:
Captured an uncaught exception in thread: Thread[id=28474, name=testExecutor-8438-thread-12, state=RUNNABLE, group=TGRP-UnloadDistributedZkTest]

Stack Trace:
com.carrotsearch.randomizedtesting.UncaughtExceptionError: Captured an uncaught exception in thread: Thread[id=28474, name=testExecutor-8438-thread-12, state=RUNNABLE, group=TGRP-UnloadDistributedZkTest]
Caused by: org.apache.solr.client.solrj.impl.HttpSolrClient$RemoteSolrException: Error from server at http://127.0.0.1:34319/_: ADDREPLICA failed to create replica
	at __randomizedtesting.SeedInfo.seed([A96B68EE79AFC9C2]:0)
	at org.apache.solr.client.solrj.impl.HttpSolrClient.executeMethod(HttpSolrClient.java:650)
	at org.apache.solr.client.solrj.impl.HttpSolrClient.request(HttpSolrClient.java:256)
	at org.apache.solr.client.solrj.impl.HttpSolrClient.request(HttpSolrClient.java:245)
	at org.apache.solr.client.solrj.SolrRequest.process(SolrRequest.java:207)
	at org.apache.solr.client.solrj.SolrRequest.process(SolrRequest.java:224)
	at org.apache.solr.cloud.BasicDistributedZkTest.lambda$createCollectionInOneInstance$1(BasicDistributedZkTest.java:657)
	at org.apache.solr.common.util.ExecutorUtil$MDCAwareThreadPoolExecutor.lambda$execute$0(ExecutorUtil.java:209)
	at java.base/java.util.concurrent.ThreadPoolExecutor.runWorker(ThreadPoolExecutor.java:1128)
	at java.base/java.util.concurrent.ThreadPoolExecutor$Worker.run(ThreadPoolExecutor.java:628)
	at java.base/java.lang.Thread.run(Thread.java:835)


FAILED:  org.apache.solr.cloud.autoscaling.sim.TestSimTriggerIntegration.testSearchRate

Error Message:
The trigger did not start in time

Stack Trace:
java.lang.AssertionError: The trigger did not start in time
	at __randomizedtesting.SeedInfo.seed([A96B68EE79AFC9C2:F4237667B6696F8D]:0)
	at org.junit.Assert.fail(Assert.java:88)
	at org.junit.Assert.assertTrue(Assert.java:41)
	at org.apache.solr.cloud.autoscaling.sim.TestSimTriggerIntegration.testSearchRate(TestSimTriggerIntegration.java:1369)
	at java.base/jdk.internal.reflect.NativeMethodAccessorImpl.invoke0(Native Method)
	at java.base/jdk.internal.reflect.NativeMethodAccessorImpl.invoke(NativeMethodAccessorImpl.java:62)
	at java.base/jdk.internal.reflect.DelegatingMethodAccessorImpl.invoke(DelegatingMethodAccessorImpl.java:43)
	at java.base/java.lang.reflect.Method.invoke(Method.java:567)
	at com.carrotsearch.randomizedtesting.RandomizedRunner.invoke(RandomizedRunner.java:1750)
	at com.carrotsearch.randomizedtesting.RandomizedRunner$8.evaluate(RandomizedRunner.java:938)
	at com.carrotsearch.randomizedtesting.RandomizedRunner$9.evaluate(RandomizedRunner.java:974)
	at com.carrotsearch.randomizedtesting.RandomizedRunner$10.evaluate(RandomizedRunner.java:988)
	at com.carrotsearch.randomizedtesting.rules.SystemPropertiesRestoreRule$1.evaluate(SystemPropertiesRestoreRule.java:57)
	at org.apache.lucene.util.TestRuleSetupTeardownChained$1.evaluate(TestRuleSetupTeardownChained.java:49)
	at org.apache.lucene.util.AbstractBeforeAfterRule$1.evaluate(AbstractBeforeAfterRule.java:45)
	at org.apache.lucene.util.TestRuleThreadAndTestName$1.evaluate(TestRuleThreadAndTestName.java:48)
	at org.apache.lucene.util.TestRuleIgnoreAfterMaxFailures$1.evaluate(TestRuleIgnoreAfterMaxFailures.java:64)
	at org.apache.lucene.util.TestRuleMarkFailure$1.evaluate(TestRuleMarkFailure.java:47)
	at com.carrotsearch.randomizedtesting.rules.StatementAdapter.evaluate(StatementAdapter.java:36)
	at com.carrotsearch.randomizedtesting.ThreadLeakControl$StatementRunner.run(ThreadLeakControl.java:368)
	at com.carrotsearch.randomizedtesting.ThreadLeakControl.forkTimeoutingTask(ThreadLeakControl.java:817)
	at com.carrotsearch.randomizedtesting.ThreadLeakControl$3.evaluate(ThreadLeakControl.java:468)
	at com.carrotsearch.randomizedtesting.RandomizedRunner.runSingleTest(RandomizedRunner.java:947)
	at com.carrotsearch.randomizedtesting.RandomizedRunner$5.evaluate(RandomizedRunner.java:832)
	at com.carrotsearch.randomizedtesting.RandomizedRunner$6.evaluate(RandomizedRunner.java:883)
	at com.carrotsearch.randomizedtesting.RandomizedRunner$7.evaluate(RandomizedRunner.java:894)
	at com.carrotsearch.randomizedtesting.rules.StatementAdapter.evaluate(StatementAdapter.java:36)
	at com.carrotsearch.randomizedtesting.rules.SystemPropertiesRestoreRule$1.evaluate(SystemPropertiesRestoreRule.java:57)
	at org.apache.lucene.util.AbstractBeforeAfterRule$1.evaluate(AbstractBeforeAfterRule.java:45)
	at com.carrotsearch.randomizedtesting.rules.StatementAdapter.evaluate(StatementAdapter.java:36)
	at org.apache.lucene.util.TestRuleStoreClassName$1.evaluate(TestRuleStoreClassName.java:41)
	at com.carrotsearch.randomizedtesting.rules.NoShadowingOrOverridesOnMethodsRule$1.evaluate(NoShadowingOrOverridesOnMethodsRule.java:40)
	at com.carrotsearch.randomizedtesting.rules.NoShadowingOrOverridesOnMethodsRule$1.evaluate(NoShadowingOrOverridesOnMethodsRule.java:40)
	at com.carrotsearch.randomizedtesting.rules.StatementAdapter.evaluate(StatementAdapter.java:36)
	at com.carrotsearch.randomizedtesting.rules.StatementAdapter.evaluate(StatementAdapter.java:36)
	at org.apache.lucene.util.TestRuleAssertionsRequired$1.evaluate(TestRuleAssertionsRequired.java:53)
	at org.apache.lucene.util.TestRuleMarkFailure$1.evaluate(TestRuleMarkFailure.java:47)
	at org.apache.lucene.util.TestRuleIgnoreAfterMaxFailures$1.evaluate(TestRuleIgnoreAfterMaxFailures.java:64)
	at org.apache.lucene.util.TestRuleIgnoreTestSuites$1.evaluate(TestRuleIgnoreTestSuites.java:54)
	at com.carrotsearch.randomizedtesting.rules.StatementAdapter.evaluate(StatementAdapter.java:36)
	at com.carrotsearch.randomizedtesting.ThreadLeakControl$StatementRunner.run(ThreadLeakControl.java:368)
	at java.base/java.lang.Thread.run(Thread.java:835)


FAILED:  org.apache.solr.cloud.autoscaling.sim.TestSimTriggerIntegration.testSearchRate

Error Message:
The trigger did not start in time

Stack Trace:
java.lang.AssertionError: The trigger did not start in time
	at __randomizedtesting.SeedInfo.seed([A96B68EE79AFC9C2:F4237667B6696F8D]:0)
	at org.junit.Assert.fail(Assert.java:88)
	at org.junit.Assert.assertTrue(Assert.java:41)
	at org.apache.solr.cloud.autoscaling.sim.TestSimTriggerIntegration.testSearchRate(TestSimTriggerIntegration.java:1369)
	at java.base/jdk.internal.reflect.NativeMethodAccessorImpl.invoke0(Native Method)
	at java.base/jdk.internal.reflect.NativeMethodAccessorImpl.invoke(NativeMethodAccessorImpl.java:62)
	at java.base/jdk.internal.reflect.DelegatingMethodAccessorImpl.invoke(DelegatingMethodAccessorImpl.java:43)
	at java.base/java.lang.reflect.Method.invoke(Method.java:567)
	at com.carrotsearch.randomizedtesting.RandomizedRunner.invoke(RandomizedRunner.java:1750)
	at com.carrotsearch.randomizedtesting.RandomizedRunner$8.evaluate(RandomizedRunner.java:938)
	at com.carrotsearch.randomizedtesting.RandomizedRunner$9.evaluate(RandomizedRunner.java:974)
	at com.carrotsearch.randomizedtesting.RandomizedRunner$10.evaluate(RandomizedRunner.java:988)
	at com.carrotsearch.randomizedtesting.rules.SystemPropertiesRestoreRule$1.evaluate(SystemPropertiesRestoreRule.java:57)
	at org.apache.lucene.util.TestRuleSetupTeardownChained$1.evaluate(TestRuleSetupTeardownChained.java:49)
	at org.apache.lucene.util.AbstractBeforeAfterRule$1.evaluate(AbstractBeforeAfterRule.java:45)
	at org.apache.lucene.util.TestRuleThreadAndTestName$1.evaluate(TestRuleThreadAndTestName.java:48)
	at org.apache.lucene.util.TestRuleIgnoreAfterMaxFailures$1.evaluate(TestRuleIgnoreAfterMaxFailures.java:64)
	at org.apache.lucene.util.TestRuleMarkFailure$1.evaluate(TestRuleMarkFailure.java:47)
	at com.carrotsearch.randomizedtesting.rules.StatementAdapter.evaluate(StatementAdapter.java:36)
	at com.carrotsearch.randomizedtesting.ThreadLeakControl$StatementRunner.run(ThreadLeakControl.java:368)
	at com.carrotsearch.randomizedtesting.ThreadLeakControl.forkTimeoutingTask(ThreadLeakControl.java:817)
	at com.carrotsearch.randomizedtesting.ThreadLeakControl$3.evaluate(ThreadLeakControl.java:468)
	at com.carrotsearch.randomizedtesting.RandomizedRunner.runSingleTest(RandomizedRunner.java:947)
	at com.carrotsearch.randomizedtesting.RandomizedRunner$5.evaluate(RandomizedRunner.java:832)
	at com.carrotsearch.randomizedtesting.RandomizedRunner$6.evaluate(RandomizedRunner.java:883)
	at com.carrotsearch.randomizedtesting.RandomizedRunner$7.evaluate(RandomizedRunner.java:894)
	at com.carrotsearch.randomizedtesting.rules.StatementAdapter.evaluate(StatementAdapter.java:36)
	at com.carrotsearch.randomizedtesting.rules.SystemPropertiesRestoreRule$1.evaluate(SystemPropertiesRestoreRule.java:57)
	at org.apache.lucene.util.AbstractBeforeAfterRule$1.evaluate(AbstractBeforeAfterRule.java:45)
	at com.carrotsearch.randomizedtesting.rules.StatementAdapter.evaluate(StatementAdapter.java:36)
	at org.apache.lucene.util.TestRuleStoreClassName$1.evaluate(TestRuleStoreClassName.java:41)
	at com.carrotsearch.randomizedtesting.rules.NoShadowingOrOverridesOnMethodsRule$1.evaluate(NoShadowingOrOverridesOnMethodsRule.java:40)
	at com.carrotsearch.randomizedtesting.rules.NoShadowingOrOverridesOnMethodsRule$1.evaluate(NoShadowingOrOverridesOnMethodsRule.java:40)
	at com.carrotsearch.randomizedtesting.rules.StatementAdapter.evaluate(StatementAdapter.java:36)
	at com.carrotsearch.randomizedtesting.rules.StatementAdapter.evaluate(StatementAdapter.java:36)
	at org.apache.lucene.util.TestRuleAssertionsRequired$1.evaluate(TestRuleAssertionsRequired.java:53)
	at org.apache.lucene.util.TestRuleMarkFailure$1.evaluate(TestRuleMarkFailure.java:47)
	at org.apache.lucene.util.TestRuleIgnoreAfterMaxFailures$1.evaluate(TestRuleIgnoreAfterMaxFailures.java:64)
	at org.apache.lucene.util.TestRuleIgnoreTestSuites$1.evaluate(TestRuleIgnoreTestSuites.java:54)
	at com.carrotsearch.randomizedtesting.rules.StatementAdapter.evaluate(StatementAdapter.java:36)
	at com.carrotsearch.randomizedtesting.ThreadLeakControl$StatementRunner.run(ThreadLeakControl.java:368)
	at java.base/java.lang.Thread.run(Thread.java:835)


FAILED:  org.apache.solr.metrics.rrd.SolrRrdBackendFactoryTest.testBasic

Error Message:
{} expected:<1> but was:<0>

Stack Trace:
java.lang.AssertionError: {} expected:<1> but was:<0>
	at __randomizedtesting.SeedInfo.seed([A96B68EE79AFC9C2:29175FBA6734FEC]:0)
	at org.junit.Assert.fail(Assert.java:88)
	at org.junit.Assert.failNotEquals(Assert.java:834)
	at org.junit.Assert.assertEquals(Assert.java:645)
	at org.apache.solr.metrics.rrd.SolrRrdBackendFactoryTest.testBasic(SolrRrdBackendFactoryTest.java:92)
	at java.base/jdk.internal.reflect.NativeMethodAccessorImpl.invoke0(Native Method)
	at java.base/jdk.internal.reflect.NativeMethodAccessorImpl.invoke(NativeMethodAccessorImpl.java:62)
	at java.base/jdk.internal.reflect.DelegatingMethodAccessorImpl.invoke(DelegatingMethodAccessorImpl.java:43)
	at java.base/java.lang.reflect.Method.invoke(Method.java:567)
	at com.carrotsearch.randomizedtesting.RandomizedRunner.invoke(RandomizedRunner.java:1750)
	at com.carrotsearch.randomizedtesting.RandomizedRunner$8.evaluate(RandomizedRunner.java:938)
	at com.carrotsearch.randomizedtesting.RandomizedRunner$9.evaluate(RandomizedRunner.java:974)
	at com.carrotsearch.randomizedtesting.RandomizedRunner$10.evaluate(RandomizedRunner.java:988)
	at com.carrotsearch.randomizedtesting.rules.SystemPropertiesRestoreRule$1.evaluate(SystemPropertiesRestoreRule.java:57)
	at org.apache.lucene.util.TestRuleSetupTeardownChained$1.evaluate(TestRuleSetupTeardownChained.java:49)
	at org.apache.lucene.util.AbstractBeforeAfterRule$1.evaluate(AbstractBeforeAfterRule.java:45)
	at org.apache.lucene.util.TestRuleThreadAndTestName$1.evaluate(TestRuleThreadAndTestName.java:48)
	at org.apache.lucene.util.TestRuleIgnoreAfterMaxFailures$1.evaluate(TestRuleIgnoreAfterMaxFailures.java:64)
	at org.apache.lucene.util.TestRuleMarkFailure$1.evaluate(TestRuleMarkFailure.java:47)
	at com.carrotsearch.randomizedtesting.rules.StatementAdapter.evaluate(StatementAdapter.java:36)
	at com.carrotsearch.randomizedtesting.ThreadLeakControl$StatementRunner.run(ThreadLeakControl.java:368)
	at com.carrotsearch.randomizedtesting.ThreadLeakControl.forkTimeoutingTask(ThreadLeakControl.java:817)
	at com.carrotsearch.randomizedtesting.ThreadLeakControl$3.evaluate(ThreadLeakControl.java:468)
	at com.carrotsearch.randomizedtesting.RandomizedRunner.runSingleTest(RandomizedRunner.java:947)
	at com.carrotsearch.randomizedtesting.RandomizedRunner$5.evaluate(RandomizedRunner.java:832)
	at com.carrotsearch.randomizedtesting.RandomizedRunner$6.evaluate(RandomizedRunner.java:883)
	at com.carrotsearch.randomizedtesting.RandomizedRunner$7.evaluate(RandomizedRunner.java:894)
	at com.carrotsearch.randomizedtesting.rules.StatementAdapter.evaluate(StatementAdapter.java:36)
	at com.carrotsearch.randomizedtesting.rules.SystemPropertiesRestoreRule$1.evaluate(SystemPropertiesRestoreRule.java:57)
	at org.apache.lucene.util.AbstractBeforeAfterRule$1.evaluate(AbstractBeforeAfterRule.java:45)
	at com.carrotsearch.randomizedtesting.rules.StatementAdapter.evaluate(StatementAdapter.java:36)
	at org.apache.lucene.util.TestRuleStoreClassName$1.evaluate(TestRuleStoreClassName.java:41)
	at com.carrotsearch.randomizedtesting.rules.NoShadowingOrOverridesOnMethodsRule$1.evaluate(NoShadowingOrOverridesOnMethodsRule.java:40)
	at com.carrotsearch.randomizedtesting.rules.NoShadowingOrOverridesOnMethodsRule$1.evaluate(NoShadowingOrOverridesOnMethodsRule.java:40)
	at com.carrotsearch.randomizedtesting.rules.StatementAdapter.evaluate(StatementAdapter.java:36)
	at com.carrotsearch.randomizedtesting.rules.StatementAdapter.evaluate(StatementAdapter.java:36)
	at org.apache.lucene.util.TestRuleAssertionsRequired$1.evaluate(TestRuleAssertionsRequired.java:53)
	at org.apache.lucene.util.TestRuleMarkFailure$1.evaluate(TestRuleMarkFailure.java:47)
	at org.apache.lucene.util.TestRuleIgnoreAfterMaxFailures$1.evaluate(TestRuleIgnoreAfterMaxFailures.java:64)
	at org.apache.lucene.util.TestRuleIgnoreTestSuites$1.evaluate(TestRuleIgnoreTestSuites.java:54)
	at com.carrotsearch.randomizedtesting.rules.StatementAdapter.evaluate(StatementAdapter.java:36)
	at com.carrotsearch.randomizedtesting.ThreadLeakControl$StatementRunner.run(ThreadLeakControl.java:368)
	at java.base/java.lang.Thread.run(Thread.java:835)


FAILED:  org.apache.solr.schema.TestCloudSchemaless.test

Error Message:
Timeout occurred while waiting response from server at: http://127.0.0.1:40037/collection1

Stack Trace:
org.apache.solr.client.solrj.SolrServerException: Timeout occurred while waiting response from server at: http://127.0.0.1:40037/collection1
	at __randomizedtesting.SeedInfo.seed([A96B68EE79AFC9C2:213F5734D753A43A]:0)
	at org.apache.solr.client.solrj.impl.HttpSolrClient.executeMethod(HttpSolrClient.java:661)
	at org.apache.solr.client.solrj.impl.HttpSolrClient.request(HttpSolrClient.java:256)
	at org.apache.solr.client.solrj.impl.HttpSolrClient.request(HttpSolrClient.java:245)
	at org.apache.solr.client.solrj.SolrRequest.process(SolrRequest.java:207)
	at org.apache.solr.client.solrj.SolrClient.commit(SolrClient.java:504)
	at org.apache.solr.client.solrj.SolrClient.commit(SolrClient.java:479)
	at org.apache.solr.schema.TestCloudSchemaless.test(TestCloudSchemaless.java:116)
	at java.base/jdk.internal.reflect.NativeMethodAccessorImpl.invoke0(Native Method)
	at java.base/jdk.internal.reflect.NativeMethodAccessorImpl.invoke(NativeMethodAccessorImpl.java:62)
	at java.base/jdk.internal.reflect.DelegatingMethodAccessorImpl.invoke(DelegatingMethodAccessorImpl.java:43)
	at java.base/java.lang.reflect.Method.invoke(Method.java:567)
	at com.carrotsearch.randomizedtesting.RandomizedRunner.invoke(RandomizedRunner.java:1750)
	at com.carrotsearch.randomizedtesting.RandomizedRunner$8.evaluate(RandomizedRunner.java:938)
	at com.carrotsearch.randomizedtesting.RandomizedRunner$9.evaluate(RandomizedRunner.java:974)
	at com.carrotsearch.randomizedtesting.RandomizedRunner$10.evaluate(RandomizedRunner.java:988)
	at org.apache.solr.BaseDistributedSearchTestCase$ShardsRepeatRule$ShardsFixedStatement.callStatement(BaseDistributedSearchTestCase.java:1082)
	at org.apache.solr.BaseDistributedSearchTestCase$ShardsRepeatRule$ShardsStatement.evaluate(BaseDistributedSearchTestCase.java:1054)
	at com.carrotsearch.randomizedtesting.rules.SystemPropertiesRestoreRule$1.evaluate(SystemPropertiesRestoreRule.java:57)
	at org.apache.lucene.util.TestRuleSetupTeardownChained$1.evaluate(TestRuleSetupTeardownChained.java:49)
	at org.apache.lucene.util.AbstractBeforeAfterRule$1.evaluate(AbstractBeforeAfterRule.java:45)
	at org.apache.lucene.util.TestRuleThreadAndTestName$1.evaluate(TestRuleThreadAndTestName.java:48)
	at org.apache.lucene.util.TestRuleIgnoreAfterMaxFailures$1.evaluate(TestRuleIgnoreAfterMaxFailures.java:64)
	at org.apache.lucene.util.TestRuleMarkFailure$1.evaluate(TestRuleMarkFailure.java:47)
	at com.carrotsearch.randomizedtesting.rules.StatementAdapter.evaluate(StatementAdapter.java:36)
	at com.carrotsearch.randomizedtesting.ThreadLeakControl$StatementRunner.run(ThreadLeakControl.java:368)
	at com.carrotsearch.randomizedtesting.ThreadLeakControl.forkTimeoutingTask(ThreadLeakControl.java:817)
	at com.carrotsearch.randomizedtesting.ThreadLeakControl$3.evaluate(ThreadLeakControl.java:468)
	at com.carrotsearch.randomizedtesting.RandomizedRunner.runSingleTest(RandomizedRunner.java:947)
	at com.carrotsearch.randomizedtesting.RandomizedRunner$5.evaluate(RandomizedRunner.java:832)
	at com.carrotsearch.randomizedtesting.RandomizedRunner$6.evaluate(RandomizedRunner.java:883)
	at com.carrotsearch.randomizedtesting.RandomizedRunner$7.evaluate(RandomizedRunner.java:894)
	at com.carrotsearch.randomizedtesting.rules.StatementAdapter.evaluate(StatementAdapter.java:36)
	at com.carrotsearch.randomizedtesting.rules.SystemPropertiesRestoreRule$1.evaluate(SystemPropertiesRestoreRule.java:57)
	at org.apache.lucene.util.AbstractBeforeAfterRule$1.evaluate(AbstractBeforeAfterRule.java:45)
	at com.carrotsearch.randomizedtesting.rules.StatementAdapter.evaluate(StatementAdapter.java:36)
	at org.apache.lucene.util.TestRuleStoreClassName$1.evaluate(TestRuleStoreClassName.java:41)
	at com.carrotsearch.randomizedtesting.rules.NoShadowingOrOverridesOnMethodsRule$1.evaluate(NoShadowingOrOverridesOnMethodsRule.java:40)
	at com.carrotsearch.randomizedtesting.rules.NoShadowingOrOverridesOnMethodsRule$1.evaluate(NoShadowingOrOverridesOnMethodsRule.java:40)
	at com.carrotsearch.randomizedtesting.rules.StatementAdapter.evaluate(StatementAdapter.java:36)
	at com.carrotsearch.randomizedtesting.rules.StatementAdapter.evaluate(StatementAdapter.java:36)
	at org.apache.lucene.util.TestRuleAssertionsRequired$1.evaluate(TestRuleAssertionsRequired.java:53)
	at org.apache.lucene.util.TestRuleMarkFailure$1.evaluate(TestRuleMarkFailure.java:47)
	at org.apache.lucene.util.TestRuleIgnoreAfterMaxFailures$1.evaluate(TestRuleIgnoreAfterMaxFailures.java:64)
	at org.apache.lucene.util.TestRuleIgnoreTestSuites$1.evaluate(TestRuleIgnoreTestSuites.java:54)
	at com.carrotsearch.randomizedtesting.rules.StatementAdapter.evaluate(StatementAdapter.java:36)
	at com.carrotsearch.randomizedtesting.ThreadLeakControl$StatementRunner.run(ThreadLeakControl.java:368)
	at java.base/java.lang.Thread.run(Thread.java:835)
Caused by: java.net.SocketTimeoutException: Read timed out
	at java.base/java.net.SocketInputStream.socketRead0(Native Method)
	at java.base/java.net.SocketInputStream.socketRead(SocketInputStream.java:115)
	at java.base/java.net.SocketInputStream.read(SocketInputStream.java:168)
	at java.base/java.net.SocketInputStream.read(SocketInputStream.java:140)
	at org.apache.http.impl.io.SessionInputBufferImpl.streamRead(SessionInputBufferImpl.java:137)
	at org.apache.http.impl.io.SessionInputBufferImpl.fillBuffer(SessionInputBufferImpl.java:153)
	at org.apache.http.impl.io.SessionInputBufferImpl.readLine(SessionInputBufferImpl.java:282)
	at org.apache.http.impl.conn.DefaultHttpResponseParser.parseHead(DefaultHttpResponseParser.java:138)
	at org.apache.http.impl.conn.DefaultHttpResponseParser.parseHead(DefaultHttpResponseParser.java:56)
	at org.apache.http.impl.io.AbstractMessageParser.parse(AbstractMessageParser.java:259)
	at org.apache.http.impl.DefaultBHttpClientConnection.receiveResponseHeader(DefaultBHttpClientConnection.java:163)
	at org.apache.http.impl.conn.CPoolProxy.receiveResponseHeader(CPoolProxy.java:165)
	at org.apache.http.protocol.HttpRequestExecutor.doReceiveResponse(HttpRequestExecutor.java:273)
	at org.apache.http.protocol.HttpRequestExecutor.execute(HttpRequestExecutor.java:125)
	at org.apache.http.impl.execchain.MainClientExec.execute(MainClientExec.java:272)
	at org.apache.http.impl.execchain.ProtocolExec.execute(ProtocolExec.java:185)
	at org.apache.http.impl.execchain.RetryExec.execute(RetryExec.java:89)
	at org.apache.http.impl.execchain.RedirectExec.execute(RedirectExec.java:110)
	at org.apache.http.impl.client.InternalHttpClient.doExecute(InternalHttpClient.java:185)
	at org.apache.http.impl.client.CloseableHttpClient.execute(CloseableHttpClient.java:83)
	at org.apache.http.impl.client.CloseableHttpClient.execute(CloseableHttpClient.java:56)
	at org.apache.solr.client.solrj.impl.HttpSolrClient.executeMethod(HttpSolrClient.java:549)
	... 46 more


FAILED:  org.apache.solr.schema.TestCloudSchemaless.test

Error Message:
Timeout occurred while waiting response from server at: http://127.0.0.1:39027/collection1

Stack Trace:
org.apache.solr.client.solrj.SolrServerException: Timeout occurred while waiting response from server at: http://127.0.0.1:39027/collection1
	at __randomizedtesting.SeedInfo.seed([A96B68EE79AFC9C2:213F5734D753A43A]:0)
	at org.apache.solr.client.solrj.impl.HttpSolrClient.executeMethod(HttpSolrClient.java:661)
	at org.apache.solr.client.solrj.impl.HttpSolrClient.request(HttpSolrClient.java:256)
	at org.apache.solr.client.solrj.impl.HttpSolrClient.request(HttpSolrClient.java:245)
	at org.apache.solr.client.solrj.SolrRequest.process(SolrRequest.java:207)
	at org.apache.solr.client.solrj.SolrClient.commit(SolrClient.java:504)
	at org.apache.solr.client.solrj.SolrClient.commit(SolrClient.java:479)
	at org.apache.solr.schema.TestCloudSchemaless.test(TestCloudSchemaless.java:116)
	at java.base/jdk.internal.reflect.NativeMethodAccessorImpl.invoke0(Native Method)
	at java.base/jdk.internal.reflect.NativeMethodAccessorImpl.invoke(NativeMethodAccessorImpl.java:62)
	at java.base/jdk.internal.reflect.DelegatingMethodAccessorImpl.invoke(DelegatingMethodAccessorImpl.java:43)
	at java.base/java.lang.reflect.Method.invoke(Method.java:567)
	at com.carrotsearch.randomizedtesting.RandomizedRunner.invoke(RandomizedRunner.java:1750)
	at com.carrotsearch.randomizedtesting.RandomizedRunner$8.evaluate(RandomizedRunner.java:938)
	at com.carrotsearch.randomizedtesting.RandomizedRunner$9.evaluate(RandomizedRunner.java:974)
	at com.carrotsearch.randomizedtesting.RandomizedRunner$10.evaluate(RandomizedRunner.java:988)
	at org.apache.solr.BaseDistributedSearchTestCase$ShardsRepeatRule$ShardsFixedStatement.callStatement(BaseDistributedSearchTestCase.java:1082)
	at org.apache.solr.BaseDistributedSearchTestCase$ShardsRepeatRule$ShardsStatement.evaluate(BaseDistributedSearchTestCase.java:1054)
	at com.carrotsearch.randomizedtesting.rules.SystemPropertiesRestoreRule$1.evaluate(SystemPropertiesRestoreRule.java:57)
	at org.apache.lucene.util.TestRuleSetupTeardownChained$1.evaluate(TestRuleSetupTeardownChained.java:49)
	at org.apache.lucene.util.AbstractBeforeAfterRule$1.evaluate(AbstractBeforeAfterRule.java:45)
	at org.apache.lucene.util.TestRuleThreadAndTestName$1.evaluate(TestRuleThreadAndTestName.java:48)
	at org.apache.lucene.util.TestRuleIgnoreAfterMaxFailures$1.evaluate(TestRuleIgnoreAfterMaxFailures.java:64)
	at org.apache.lucene.util.TestRuleMarkFailure$1.evaluate(TestRuleMarkFailure.java:47)
	at com.carrotsearch.randomizedtesting.rules.StatementAdapter.evaluate(StatementAdapter.java:36)
	at com.carrotsearch.randomizedtesting.ThreadLeakControl$StatementRunner.run(ThreadLeakControl.java:368)
	at com.carrotsearch.randomizedtesting.ThreadLeakControl.forkTimeoutingTask(ThreadLeakControl.java:817)
	at com.carrotsearch.randomizedtesting.ThreadLeakControl$3.evaluate(ThreadLeakControl.java:468)
	at com.carrotsearch.randomizedtesting.RandomizedRunner.runSingleTest(RandomizedRunner.java:947)
	at com.carrotsearch.randomizedtesting.RandomizedRunner$5.evaluate(RandomizedRunner.java:832)
	at com.carrotsearch.randomizedtesting.RandomizedRunner$6.evaluate(RandomizedRunner.java:883)
	at com.carrotsearch.randomizedtesting.RandomizedRunner$7.evaluate(RandomizedRunner.java:894)
	at com.carrotsearch.randomizedtesting.rules.StatementAdapter.evaluate(StatementAdapter.java:36)
	at com.carrotsearch.randomizedtesting.rules.SystemPropertiesRestoreRule$1.evaluate(SystemPropertiesRestoreRule.java:57)
	at org.apache.lucene.util.AbstractBeforeAfterRule$1.evaluate(AbstractBeforeAfterRule.java:45)
	at com.carrotsearch.randomizedtesting.rules.StatementAdapter.evaluate(StatementAdapter.java:36)
	at org.apache.lucene.util.TestRuleStoreClassName$1.evaluate(TestRuleStoreClassName.java:41)
	at com.carrotsearch.randomizedtesting.rules.NoShadowingOrOverridesOnMethodsRule$1.evaluate(NoShadowingOrOverridesOnMethodsRule.java:40)
	at com.carrotsearch.randomizedtesting.rules.NoShadowingOrOverridesOnMethodsRule$1.evaluate(NoShadowingOrOverridesOnMethodsRule.java:40)
	at com.carrotsearch.randomizedtesting.rules.StatementAdapter.evaluate(StatementAdapter.java:36)
	at com.carrotsearch.randomizedtesting.rules.StatementAdapter.evaluate(StatementAdapter.java:36)
	at org.apache.lucene.util.TestRuleAssertionsRequired$1.evaluate(TestRuleAssertionsRequired.java:53)
	at org.apache.lucene.util.TestRuleMarkFailure$1.evaluate(TestRuleMarkFailure.java:47)
	at org.apache.lucene.util.TestRuleIgnoreAfterMaxFailures$1.evaluate(TestRuleIgnoreAfterMaxFailures.java:64)
	at org.apache.lucene.util.TestRuleIgnoreTestSuites$1.evaluate(TestRuleIgnoreTestSuites.java:54)
	at com.carrotsearch.randomizedtesting.rules.StatementAdapter.evaluate(StatementAdapter.java:36)
	at com.carrotsearch.randomizedtesting.ThreadLeakControl$StatementRunner.run(ThreadLeakControl.java:368)
	at java.base/java.lang.Thread.run(Thread.java:835)
Caused by: java.net.SocketTimeoutException: Read timed out
	at java.base/java.net.SocketInputStream.socketRead0(Native Method)
	at java.base/java.net.SocketInputStream.socketRead(SocketInputStream.java:115)
	at java.base/java.net.SocketInputStream.read(SocketInputStream.java:168)
	at java.base/java.net.SocketInputStream.read(SocketInputStream.java:140)
	at org.apache.http.impl.io.SessionInputBufferImpl.streamRead(SessionInputBufferImpl.java:137)
	at org.apache.http.impl.io.SessionInputBufferImpl.fillBuffer(SessionInputBufferImpl.java:153)
	at org.apache.http.impl.io.SessionInputBufferImpl.readLine(SessionInputBufferImpl.java:282)
	at org.apache.http.impl.conn.DefaultHttpResponseParser.parseHead(DefaultHttpResponseParser.java:138)
	at org.apache.http.impl.conn.DefaultHttpResponseParser.parseHead(DefaultHttpResponseParser.java:56)
	at org.apache.http.impl.io.AbstractMessageParser.parse(AbstractMessageParser.java:259)
	at org.apache.http.impl.DefaultBHttpClientConnection.receiveResponseHeader(DefaultBHttpClientConnection.java:163)
	at org.apache.http.impl.conn.CPoolProxy.receiveResponseHeader(CPoolProxy.java:165)
	at org.apache.http.protocol.HttpRequestExecutor.doReceiveResponse(HttpRequestExecutor.java:273)
	at org.apache.http.protocol.HttpRequestExecutor.execute(HttpRequestExecutor.java:125)
	at org.apache.http.impl.execchain.MainClientExec.execute(MainClientExec.java:272)
	at org.apache.http.impl.execchain.ProtocolExec.execute(ProtocolExec.java:185)
	at org.apache.http.impl.execchain.RetryExec.execute(RetryExec.java:89)
	at org.apache.http.impl.execchain.RedirectExec.execute(RedirectExec.java:110)
	at org.apache.http.impl.client.InternalHttpClient.doExecute(InternalHttpClient.java:185)
	at org.apache.http.impl.client.CloseableHttpClient.execute(CloseableHttpClient.java:83)
	at org.apache.http.impl.client.CloseableHttpClient.execute(CloseableHttpClient.java:56)
	at org.apache.solr.client.solrj.impl.HttpSolrClient.executeMethod(HttpSolrClient.java:549)
	... 46 more


FAILED:  org.apache.solr.schema.TestCloudSchemaless.test

Error Message:
Timeout occurred while waiting response from server at: http://127.0.0.1:42189/collection1

Stack Trace:
org.apache.solr.client.solrj.SolrServerException: Timeout occurred while waiting response from server at: http://127.0.0.1:42189/collection1
	at __randomizedtesting.SeedInfo.seed([A96B68EE79AFC9C2:213F5734D753A43A]:0)
	at org.apache.solr.client.solrj.impl.HttpSolrClient.executeMethod(HttpSolrClient.java:661)
	at org.apache.solr.client.solrj.impl.HttpSolrClient.request(HttpSolrClient.java:256)
	at org.apache.solr.client.solrj.impl.HttpSolrClient.request(HttpSolrClient.java:245)
	at org.apache.solr.client.solrj.SolrRequest.process(SolrRequest.java:207)
	at org.apache.solr.client.solrj.SolrClient.commit(SolrClient.java:504)
	at org.apache.solr.client.solrj.SolrClient.commit(SolrClient.java:479)
	at org.apache.solr.schema.TestCloudSchemaless.test(TestCloudSchemaless.java:116)
	at java.base/jdk.internal.reflect.NativeMethodAccessorImpl.invoke0(Native Method)
	at java.base/jdk.internal.reflect.NativeMethodAccessorImpl.invoke(NativeMethodAccessorImpl.java:62)
	at java.base/jdk.internal.reflect.DelegatingMethodAccessorImpl.invoke(DelegatingMethodAccessorImpl.java:43)
	at java.base/java.lang.reflect.Method.invoke(Method.java:567)
	at com.carrotsearch.randomizedtesting.RandomizedRunner.invoke(RandomizedRunner.java:1750)
	at com.carrotsearch.randomizedtesting.RandomizedRunner$8.evaluate(RandomizedRunner.java:938)
	at com.carrotsearch.randomizedtesting.RandomizedRunner$9.evaluate(RandomizedRunner.java:974)
	at com.carrotsearch.randomizedtesting.RandomizedRunner$10.evaluate(RandomizedRunner.java:988)
	at org.apache.solr.BaseDistributedSearchTestCase$ShardsRepeatRule$ShardsFixedStatement.callStatement(BaseDistributedSearchTestCase.java:1082)
	at org.apache.solr.BaseDistributedSearchTestCase$ShardsRepeatRule$ShardsStatement.evaluate(BaseDistributedSearchTestCase.java:1054)
	at com.carrotsearch.randomizedtesting.rules.SystemPropertiesRestoreRule$1.evaluate(SystemPropertiesRestoreRule.java:57)
	at org.apache.lucene.util.TestRuleSetupTeardownChained$1.evaluate(TestRuleSetupTeardownChained.java:49)
	at org.apache.lucene.util.AbstractBeforeAfterRule$1.evaluate(AbstractBeforeAfterRule.java:45)
	at org.apache.lucene.util.TestRuleThreadAndTestName$1.evaluate(TestRuleThreadAndTestName.java:48)
	at org.apache.lucene.util.TestRuleIgnoreAfterMaxFailures$1.evaluate(TestRuleIgnoreAfterMaxFailures.java:64)
	at org.apache.lucene.util.TestRuleMarkFailure$1.evaluate(TestRuleMarkFailure.java:47)
	at com.carrotsearch.randomizedtesting.rules.StatementAdapter.evaluate(StatementAdapter.java:36)
	at com.carrotsearch.randomizedtesting.ThreadLeakControl$StatementRunner.run(ThreadLeakControl.java:368)
	at com.carrotsearch.randomizedtesting.ThreadLeakControl.forkTimeoutingTask(ThreadLeakControl.java:817)
	at com.carrotsearch.randomizedtesting.ThreadLeakControl$3.evaluate(ThreadLeakControl.java:468)
	at com.carrotsearch.randomizedtesting.RandomizedRunner.runSingleTest(RandomizedRunner.java:947)
	at com.carrotsearch.randomizedtesting.RandomizedRunner$5.evaluate(RandomizedRunner.java:832)
	at com.carrotsearch.randomizedtesting.RandomizedRunner$6.evaluate(RandomizedRunner.java:883)
	at com.carrotsearch.randomizedtesting.RandomizedRunner$7.evaluate(RandomizedRunner.java:894)
	at com.carrotsearch.randomizedtesting.rules.StatementAdapter.evaluate(StatementAdapter.java:36)
	at com.carrotsearch.randomizedtesting.rules.SystemPropertiesRestoreRule$1.evaluate(SystemPropertiesRestoreRule.java:57)
	at org.apache.lucene.util.AbstractBeforeAfterRule$1.evaluate(AbstractBeforeAfterRule.java:45)
	at com.carrotsearch.randomizedtesting.rules.StatementAdapter.evaluate(StatementAdapter.java:36)
	at org.apache.lucene.util.TestRuleStoreClassName$1.evaluate(TestRuleStoreClassName.java:41)
	at com.carrotsearch.randomizedtesting.rules.NoShadowingOrOverridesOnMethodsRule$1.evaluate(NoShadowingOrOverridesOnMethodsRule.java:40)
	at com.carrotsearch.randomizedtesting.rules.NoShadowingOrOverridesOnMethodsRule$1.evaluate(NoShadowingOrOverridesOnMethodsRule.java:40)
	at com.carrotsearch.randomizedtesting.rules.StatementAdapter.evaluate(StatementAdapter.java:36)
	at com.carrotsearch.randomizedtesting.rules.StatementAdapter.evaluate(StatementAdapter.java:36)
	at org.apache.lucene.util.TestRuleAssertionsRequired$1.evaluate(TestRuleAssertionsRequired.java:53)
	at org.apache.lucene.util.TestRuleMarkFailure$1.evaluate(TestRuleMarkFailure.java:47)
	at org.apache.lucene.util.TestRuleIgnoreAfterMaxFailures$1.evaluate(TestRuleIgnoreAfterMaxFailures.java:64)
	at org.apache.lucene.util.TestRuleIgnoreTestSuites$1.evaluate(TestRuleIgnoreTestSuites.java:54)
	at com.carrotsearch.randomizedtesting.rules.StatementAdapter.evaluate(StatementAdapter.java:36)
	at com.carrotsearch.randomizedtesting.ThreadLeakControl$StatementRunner.run(ThreadLeakControl.java:368)
	at java.base/java.lang.Thread.run(Thread.java:835)
Caused by: java.net.SocketTimeoutException: Read timed out
	at java.base/java.net.SocketInputStream.socketRead0(Native Method)
	at java.base/java.net.SocketInputStream.socketRead(SocketInputStream.java:115)
	at java.base/java.net.SocketInputStream.read(SocketInputStream.java:168)
	at java.base/java.net.SocketInputStream.read(SocketInputStream.java:140)
	at org.apache.http.impl.io.SessionInputBufferImpl.streamRead(SessionInputBufferImpl.java:137)
	at org.apache.http.impl.io.SessionInputBufferImpl.fillBuffer(SessionInputBufferImpl.java:153)
	at org.apache.http.impl.io.SessionInputBufferImpl.readLine(SessionInputBufferImpl.java:282)
	at org.apache.http.impl.conn.DefaultHttpResponseParser.parseHead(DefaultHttpResponseParser.java:138)
	at org.apache.http.impl.conn.DefaultHttpResponseParser.parseHead(DefaultHttpResponseParser.java:56)
	at org.apache.http.impl.io.AbstractMessageParser.parse(AbstractMessageParser.java:259)
	at org.apache.http.impl.DefaultBHttpClientConnection.receiveResponseHeader(DefaultBHttpClientConnection.java:163)
	at org.apache.http.impl.conn.CPoolProxy.receiveResponseHeader(CPoolProxy.java:165)
	at org.apache.http.protocol.HttpRequestExecutor.doReceiveResponse(HttpRequestExecutor.java:273)
	at org.apache.http.protocol.HttpRequestExecutor.execute(HttpRequestExecutor.java:125)
	at org.apache.http.impl.execchain.MainClientExec.execute(MainClientExec.java:272)
	at org.apache.http.impl.execchain.ProtocolExec.execute(ProtocolExec.java:185)
	at org.apache.http.impl.execchain.RetryExec.execute(RetryExec.java:89)
	at org.apache.http.impl.execchain.RedirectExec.execute(RedirectExec.java:110)
	at org.apache.http.impl.client.InternalHttpClient.doExecute(InternalHttpClient.java:185)
	at org.apache.http.impl.client.CloseableHttpClient.execute(CloseableHttpClient.java:83)
	at org.apache.http.impl.client.CloseableHttpClient.execute(CloseableHttpClient.java:56)
	at org.apache.solr.client.solrj.impl.HttpSolrClient.executeMethod(HttpSolrClient.java:549)
	... 46 more


FAILED:  org.apache.solr.schema.TestCloudSchemaless.test

Error Message:
Timeout occurred while waiting response from server at: http://127.0.0.1:38431/collection1

Stack Trace:
org.apache.solr.client.solrj.SolrServerException: Timeout occurred while waiting response from server at: http://127.0.0.1:38431/collection1
	at __randomizedtesting.SeedInfo.seed([A96B68EE79AFC9C2:213F5734D753A43A]:0)
	at org.apache.solr.client.solrj.impl.HttpSolrClient.executeMethod(HttpSolrClient.java:661)
	at org.apache.solr.client.solrj.impl.HttpSolrClient.request(HttpSolrClient.java:256)
	at org.apache.solr.client.solrj.impl.HttpSolrClient.request(HttpSolrClient.java:245)
	at org.apache.solr.client.solrj.SolrRequest.process(SolrRequest.java:207)
	at org.apache.solr.client.solrj.SolrClient.commit(SolrClient.java:504)
	at org.apache.solr.client.solrj.SolrClient.commit(SolrClient.java:479)
	at org.apache.solr.schema.TestCloudSchemaless.test(TestCloudSchemaless.java:116)
	at java.base/jdk.internal.reflect.NativeMethodAccessorImpl.invoke0(Native Method)
	at java.base/jdk.internal.reflect.NativeMethodAccessorImpl.invoke(NativeMethodAccessorImpl.java:62)
	at java.base/jdk.internal.reflect.DelegatingMethodAccessorImpl.invoke(DelegatingMethodAccessorImpl.java:43)
	at java.base/java.lang.reflect.Method.invoke(Method.java:567)
	at com.carrotsearch.randomizedtesting.RandomizedRunner.invoke(RandomizedRunner.java:1750)
	at com.carrotsearch.randomizedtesting.RandomizedRunner$8.evaluate(RandomizedRunner.java:938)
	at com.carrotsearch.randomizedtesting.RandomizedRunner$9.evaluate(RandomizedRunner.java:974)
	at com.carrotsearch.randomizedtesting.RandomizedRunner$10.evaluate(RandomizedRunner.java:988)
	at org.apache.solr.BaseDistributedSearchTestCase$ShardsRepeatRule$ShardsFixedStatement.callStatement(BaseDistributedSearchTestCase.java:1082)
	at org.apache.solr.BaseDistributedSearchTestCase$ShardsRepeatRule$ShardsStatement.evaluate(BaseDistributedSearchTestCase.java:1054)
	at com.carrotsearch.randomizedtesting.rules.SystemPropertiesRestoreRule$1.evaluate(SystemPropertiesRestoreRule.java:57)
	at org.apache.lucene.util.TestRuleSetupTeardownChained$1.evaluate(TestRuleSetupTeardownChained.java:49)
	at org.apache.lucene.util.AbstractBeforeAfterRule$1.evaluate(AbstractBeforeAfterRule.java:45)
	at org.apache.lucene.util.TestRuleThreadAndTestName$1.evaluate(TestRuleThreadAndTestName.java:48)
	at org.apache.lucene.util.TestRuleIgnoreAfterMaxFailures$1.evaluate(TestRuleIgnoreAfterMaxFailures.java:64)
	at org.apache.lucene.util.TestRuleMarkFailure$1.evaluate(TestRuleMarkFailure.java:47)
	at com.carrotsearch.randomizedtesting.rules.StatementAdapter.evaluate(StatementAdapter.java:36)
	at com.carrotsearch.randomizedtesting.ThreadLeakControl$StatementRunner.run(ThreadLeakControl.java:368)
	at com.carrotsearch.randomizedtesting.ThreadLeakControl.forkTimeoutingTask(ThreadLeakControl.java:817)
	at com.carrotsearch.randomizedtesting.ThreadLeakControl$3.evaluate(ThreadLeakControl.java:468)
	at com.carrotsearch.randomizedtesting.RandomizedRunner.runSingleTest(RandomizedRunner.java:947)
	at com.carrotsearch.randomizedtesting.RandomizedRunner$5.evaluate(RandomizedRunner.java:832)
	at com.carrotsearch.randomizedtesting.RandomizedRunner$6.evaluate(RandomizedRunner.java:883)
	at com.carrotsearch.randomizedtesting.RandomizedRunner$7.evaluate(RandomizedRunner.java:894)
	at com.carrotsearch.randomizedtesting.rules.StatementAdapter.evaluate(StatementAdapter.java:36)
	at com.carrotsearch.randomizedtesting.rules.SystemPropertiesRestoreRule$1.evaluate(SystemPropertiesRestoreRule.java:57)
	at org.apache.lucene.util.AbstractBeforeAfterRule$1.evaluate(AbstractBeforeAfterRule.java:45)
	at com.carrotsearch.randomizedtesting.rules.StatementAdapter.evaluate(StatementAdapter.java:36)
	at org.apache.lucene.util.TestRuleStoreClassName$1.evaluate(TestRuleStoreClassName.java:41)
	at com.carrotsearch.randomizedtesting.rules.NoShadowingOrOverridesOnMethodsRule$1.evaluate(NoShadowingOrOverridesOnMethodsRule.java:40)
	at com.carrotsearch.randomizedtesting.rules.NoShadowingOrOverridesOnMethodsRule$1.evaluate(NoShadowingOrOverridesOnMethodsRule.java:40)
	at com.carrotsearch.randomizedtesting.rules.StatementAdapter.evaluate(StatementAdapter.java:36)
	at com.carrotsearch.randomizedtesting.rules.StatementAdapter.evaluate(StatementAdapter.java:36)
	at org.apache.lucene.util.TestRuleAssertionsRequired$1.evaluate(TestRuleAssertionsRequired.java:53)
	at org.apache.lucene.util.TestRuleMarkFailure$1.evaluate(TestRuleMarkFailure.java:47)
	at org.apache.lucene.util.TestRuleIgnoreAfterMaxFailures$1.evaluate(TestRuleIgnoreAfterMaxFailures.java:64)
	at org.apache.lucene.util.TestRuleIgnoreTestSuites$1.evaluate(TestRuleIgnoreTestSuites.java:54)
	at com.carrotsearch.randomizedtesting.rules.StatementAdapter.evaluate(StatementAdapter.java:36)
	at com.carrotsearch.randomizedtesting.ThreadLeakControl$StatementRunner.run(ThreadLeakControl.java:368)
	at java.base/java.lang.Thread.run(Thread.java:835)
Caused by: java.net.SocketTimeoutException: Read timed out
	at java.base/java.net.SocketInputStream.socketRead0(Native Method)
	at java.base/java.net.SocketInputStream.socketRead(SocketInputStream.java:115)
	at java.base/java.net.SocketInputStream.read(SocketInputStream.java:168)
	at java.base/java.net.SocketInputStream.read(SocketInputStream.java:140)
	at org.apache.http.impl.io.SessionInputBufferImpl.streamRead(SessionInputBufferImpl.java:137)
	at org.apache.http.impl.io.SessionInputBufferImpl.fillBuffer(SessionInputBufferImpl.java:153)
	at org.apache.http.impl.io.SessionInputBufferImpl.readLine(SessionInputBufferImpl.java:282)
	at org.apache.http.impl.conn.DefaultHttpResponseParser.parseHead(DefaultHttpResponseParser.java:138)
	at org.apache.http.impl.conn.DefaultHttpResponseParser.parseHead(DefaultHttpResponseParser.java:56)
	at org.apache.http.impl.io.AbstractMessageParser.parse(AbstractMessageParser.java:259)
	at org.apache.http.impl.DefaultBHttpClientConnection.receiveResponseHeader(DefaultBHttpClientConnection.java:163)
	at org.apache.http.impl.conn.CPoolProxy.receiveResponseHeader(CPoolProxy.java:165)
	at org.apache.http.protocol.HttpRequestExecutor.doReceiveResponse(HttpRequestExecutor.java:273)
	at org.apache.http.protocol.HttpRequestExecutor.execute(HttpRequestExecutor.java:125)
	at org.apache.http.impl.execchain.MainClientExec.execute(MainClientExec.java:272)
	at org.apache.http.impl.execchain.ProtocolExec.execute(ProtocolExec.java:185)
	at org.apache.http.impl.execchain.RetryExec.execute(RetryExec.java:89)
	at org.apache.http.impl.execchain.RedirectExec.execute(RedirectExec.java:110)
	at org.apache.http.impl.client.InternalHttpClient.doExecute(InternalHttpClient.java:185)
	at org.apache.http.impl.client.CloseableHttpClient.execute(CloseableHttpClient.java:83)
	at org.apache.http.impl.client.CloseableHttpClient.execute(CloseableHttpClient.java:56)
	at org.apache.solr.client.solrj.impl.HttpSolrClient.executeMethod(HttpSolrClient.java:549)
	... 46 more


FAILED:  org.apache.solr.schema.TestCloudSchemaless.test

Error Message:
Timeout occurred while waiting response from server at: http://127.0.0.1:43793/collection1

Stack Trace:
org.apache.solr.client.solrj.SolrServerException: Timeout occurred while waiting response from server at: http://127.0.0.1:43793/collection1
	at __randomizedtesting.SeedInfo.seed([A96B68EE79AFC9C2:213F5734D753A43A]:0)
	at org.apache.solr.client.solrj.impl.HttpSolrClient.executeMethod(HttpSolrClient.java:661)
	at org.apache.solr.client.solrj.impl.HttpSolrClient.request(HttpSolrClient.java:256)
	at org.apache.solr.client.solrj.impl.HttpSolrClient.request(HttpSolrClient.java:245)
	at org.apache.solr.client.solrj.SolrRequest.process(SolrRequest.java:207)
	at org.apache.solr.client.solrj.SolrClient.commit(SolrClient.java:504)
	at org.apache.solr.client.solrj.SolrClient.commit(SolrClient.java:479)
	at org.apache.solr.schema.TestCloudSchemaless.test(TestCloudSchemaless.java:116)
	at java.base/jdk.internal.reflect.NativeMethodAccessorImpl.invoke0(Native Method)
	at java.base/jdk.internal.reflect.NativeMethodAccessorImpl.invoke(NativeMethodAccessorImpl.java:62)
	at java.base/jdk.internal.reflect.DelegatingMethodAccessorImpl.invoke(DelegatingMethodAccessorImpl.java:43)
	at java.base/java.lang.reflect.Method.invoke(Method.java:567)
	at com.carrotsearch.randomizedtesting.RandomizedRunner.invoke(RandomizedRunner.java:1750)
	at com.carrotsearch.randomizedtesting.RandomizedRunner$8.evaluate(RandomizedRunner.java:938)
	at com.carrotsearch.randomizedtesting.RandomizedRunner$9.evaluate(RandomizedRunner.java:974)
	at com.carrotsearch.randomizedtesting.RandomizedRunner$10.evaluate(RandomizedRunner.java:988)
	at org.apache.solr.BaseDistributedSearchTestCase$ShardsRepeatRule$ShardsFixedStatement.callStatement(BaseDistributedSearchTestCase.java:1082)
	at org.apache.solr.BaseDistributedSearchTestCase$ShardsRepeatRule$ShardsStatement.evaluate(BaseDistributedSearchTestCase.java:1054)
	at com.carrotsearch.randomizedtesting.rules.SystemPropertiesRestoreRule$1.evaluate(SystemPropertiesRestoreRule.java:57)
	at org.apache.lucene.util.TestRuleSetupTeardownChained$1.evaluate(TestRuleSetupTeardownChained.java:49)
	at org.apache.lucene.util.AbstractBeforeAfterRule$1.evaluate(AbstractBeforeAfterRule.java:45)
	at org.apache.lucene.util.TestRuleThreadAndTestName$1.evaluate(TestRuleThreadAndTestName.java:48)
	at org.apache.lucene.util.TestRuleIgnoreAfterMaxFailures$1.evaluate(TestRuleIgnoreAfterMaxFailures.java:64)
	at org.apache.lucene.util.TestRuleMarkFailure$1.evaluate(TestRuleMarkFailure.java:47)
	at com.carrotsearch.randomizedtesting.rules.StatementAdapter.evaluate(StatementAdapter.java:36)
	at com.carrotsearch.randomizedtesting.ThreadLeakControl$StatementRunner.run(ThreadLeakControl.java:368)
	at com.carrotsearch.randomizedtesting.ThreadLeakControl.forkTimeoutingTask(ThreadLeakControl.java:817)
	at com.carrotsearch.randomizedtesting.ThreadLeakControl$3.evaluate(ThreadLeakControl.java:468)
	at com.carrotsearch.randomizedtesting.RandomizedRunner.runSingleTest(RandomizedRunner.java:947)
	at com.carrotsearch.randomizedtesting.RandomizedRunner$5.evaluate(RandomizedRunner.java:832)
	at com.carrotsearch.randomizedtesting.RandomizedRunner$6.evaluate(RandomizedRunner.java:883)
	at com.carrotsearch.randomizedtesting.RandomizedRunner$7.evaluate(RandomizedRunner.java:894)
	at com.carrotsearch.randomizedtesting.rules.StatementAdapter.evaluate(StatementAdapter.java:36)
	at com.carrotsearch.randomizedtesting.rules.SystemPropertiesRestoreRule$1.evaluate(SystemPropertiesRestoreRule.java:57)
	at org.apache.lucene.util.AbstractBeforeAfterRule$1.evaluate(AbstractBeforeAfterRule.java:45)
	at com.carrotsearch.randomizedtesting.rules.StatementAdapter.evaluate(StatementAdapter.java:36)
	at org.apache.lucene.util.TestRuleStoreClassName$1.evaluate(TestRuleStoreClassName.java:41)
	at com.carrotsearch.randomizedtesting.rules.NoShadowingOrOverridesOnMethodsRule$1.evaluate(NoShadowingOrOverridesOnMethodsRule.java:40)
	at com.carrotsearch.randomizedtesting.rules.NoShadowingOrOverridesOnMethodsRule$1.evaluate(NoShadowingOrOverridesOnMethodsRule.java:40)
	at com.carrotsearch.randomizedtesting.rules.StatementAdapter.evaluate(StatementAdapter.java:36)
	at com.carrotsearch.randomizedtesting.rules.StatementAdapter.evaluate(StatementAdapter.java:36)
	at org.apache.lucene.util.TestRuleAssertionsRequired$1.evaluate(TestRuleAssertionsRequired.java:53)
	at org.apache.lucene.util.TestRuleMarkFailure$1.evaluate(TestRuleMarkFailure.java:47)
	at org.apache.lucene.util.TestRuleIgnoreAfterMaxFailures$1.evaluate(TestRuleIgnoreAfterMaxFailures.java:64)
	at org.apache.lucene.util.TestRuleIgnoreTestSuites$1.evaluate(TestRuleIgnoreTestSuites.java:54)
	at com.carrotsearch.randomizedtesting.rules.StatementAdapter.evaluate(StatementAdapter.java:36)
	at com.carrotsearch.randomizedtesting.ThreadLeakControl$StatementRunner.run(ThreadLeakControl.java:368)
	at java.base/java.lang.Thread.run(Thread.java:835)
Caused by: java.net.SocketTimeoutException: Read timed out
	at java.base/java.net.SocketInputStream.socketRead0(Native Method)
	at java.base/java.net.SocketInputStream.socketRead(SocketInputStream.java:115)
	at java.base/java.net.SocketInputStream.read(SocketInputStream.java:168)
	at java.base/java.net.SocketInputStream.read(SocketInputStream.java:140)
	at org.apache.http.impl.io.SessionInputBufferImpl.streamRead(SessionInputBufferImpl.java:137)
	at org.apache.http.impl.io.SessionInputBufferImpl.fillBuffer(SessionInputBufferImpl.java:153)
	at org.apache.http.impl.io.SessionInputBufferImpl.readLine(SessionInputBufferImpl.java:282)
	at org.apache.http.impl.conn.DefaultHttpResponseParser.parseHead(DefaultHttpResponseParser.java:138)
	at org.apache.http.impl.conn.DefaultHttpResponseParser.parseHead(DefaultHttpResponseParser.java:56)
	at org.apache.http.impl.io.AbstractMessageParser.parse(AbstractMessageParser.java:259)
	at org.apache.http.impl.DefaultBHttpClientConnection.receiveResponseHeader(DefaultBHttpClientConnection.java:163)
	at org.apache.http.impl.conn.CPoolProxy.receiveResponseHeader(CPoolProxy.java:165)
	at org.apache.http.protocol.HttpRequestExecutor.doReceiveResponse(HttpRequestExecutor.java:273)
	at org.apache.http.protocol.HttpRequestExecutor.execute(HttpRequestExecutor.java:125)
	at org.apache.http.impl.execchain.MainClientExec.execute(MainClientExec.java:272)
	at org.apache.http.impl.execchain.ProtocolExec.execute(ProtocolExec.java:185)
	at org.apache.http.impl.execchain.RetryExec.execute(RetryExec.java:89)
	at org.apache.http.impl.execchain.RedirectExec.execute(RedirectExec.java:110)
	at org.apache.http.impl.client.InternalHttpClient.doExecute(InternalHttpClient.java:185)
	at org.apache.http.impl.client.CloseableHttpClient.execute(CloseableHttpClient.java:83)
	at org.apache.http.impl.client.CloseableHttpClient.execute(CloseableHttpClient.java:56)
	at org.apache.solr.client.solrj.impl.HttpSolrClient.executeMethod(HttpSolrClient.java:549)
	... 46 more


FAILED:  org.apache.solr.security.JWTAuthPluginIntegrationTest.testMetrics

Error Message:
Server returned HTTP response code: 401 for URL: http://127.0.0.1:32915/solr/jwtColl/query?q=*:*

Stack Trace:
java.io.IOException: Server returned HTTP response code: 401 for URL: http://127.0.0.1:32915/solr/jwtColl/query?q=*:*
	at __randomizedtesting.SeedInfo.seed([A96B68EE79AFC9C2:5779BA4C65A5BE71]:0)
	at java.base/sun.net.www.protocol.http.HttpURLConnection.getInputStream0(HttpURLConnection.java:1913)
	at java.base/sun.net.www.protocol.http.HttpURLConnection.getInputStream(HttpURLConnection.java:1509)
	at java.base/java.net.URLConnection.getContent(URLConnection.java:749)
	at org.apache.solr.security.JWTAuthPluginIntegrationTest.get(JWTAuthPluginIntegrationTest.java:207)
	at org.apache.solr.security.JWTAuthPluginIntegrationTest.testMetrics(JWTAuthPluginIntegrationTest.java:149)
	at java.base/jdk.internal.reflect.NativeMethodAccessorImpl.invoke0(Native Method)
	at java.base/jdk.internal.reflect.NativeMethodAccessorImpl.invoke(NativeMethodAccessorImpl.java:62)
	at java.base/jdk.internal.reflect.DelegatingMethodAccessorImpl.invoke(DelegatingMethodAccessorImpl.java:43)
	at java.base/java.lang.reflect.Method.invoke(Method.java:567)
	at com.carrotsearch.randomizedtesting.RandomizedRunner.invoke(RandomizedRunner.java:1750)
	at com.carrotsearch.randomizedtesting.RandomizedRunner$8.evaluate(RandomizedRunner.java:938)
	at com.carrotsearch.randomizedtesting.RandomizedRunner$9.evaluate(RandomizedRunner.java:974)
	at com.carrotsearch.randomizedtesting.RandomizedRunner$10.evaluate(RandomizedRunner.java:988)
	at com.carrotsearch.randomizedtesting.rules.SystemPropertiesRestoreRule$1.evaluate(SystemPropertiesRestoreRule.java:57)
	at org.apache.lucene.util.TestRuleSetupTeardownChained$1.evaluate(TestRuleSetupTeardownChained.java:49)
	at org.apache.lucene.util.AbstractBeforeAfterRule$1.evaluate(AbstractBeforeAfterRule.java:45)
	at org.apache.lucene.util.TestRuleThreadAndTestName$1.evaluate(TestRuleThreadAndTestName.java:48)
	at org.apache.lucene.util.TestRuleIgnoreAfterMaxFailures$1.evaluate(TestRuleIgnoreAfterMaxFailures.java:64)
	at org.apache.lucene.util.TestRuleMarkFailure$1.evaluate(TestRuleMarkFailure.java:47)
	at com.carrotsearch.randomizedtesting.rules.StatementAdapter.evaluate(StatementAdapter.java:36)
	at com.carrotsearch.randomizedtesting.ThreadLeakControl$StatementRunner.run(ThreadLeakControl.java:368)
	at com.carrotsearch.randomizedtesting.ThreadLeakControl.forkTimeoutingTask(ThreadLeakControl.java:817)
	at com.carrotsearch.randomizedtesting.ThreadLeakControl$3.evaluate(ThreadLeakControl.java:468)
	at com.carrotsearch.randomizedtesting.RandomizedRunner.runSingleTest(RandomizedRunner.java:947)
	at com.carrotsearch.randomizedtesting.RandomizedRunner$5.evaluate(RandomizedRunner.java:832)
	at com.carrotsearch.randomizedtesting.RandomizedRunner$6.evaluate(RandomizedRunner.java:883)
	at com.carrotsearch.randomizedtesting.RandomizedRunner$7.evaluate(RandomizedRunner.java:894)
	at com.carrotsearch.randomizedtesting.rules.StatementAdapter.evaluate(StatementAdapter.java:36)
	at com.carrotsearch.randomizedtesting.rules.SystemPropertiesRestoreRule$1.evaluate(SystemPropertiesRestoreRule.java:57)
	at org.apache.lucene.util.AbstractBeforeAfterRule$1.evaluate(AbstractBeforeAfterRule.java:45)
	at com.carrotsearch.randomizedtesting.rules.StatementAdapter.evaluate(StatementAdapter.java:36)
	at org.apache.lucene.util.TestRuleStoreClassName$1.evaluate(TestRuleStoreClassName.java:41)
	at com.carrotsearch.randomizedtesting.rules.NoShadowingOrOverridesOnMethodsRule$1.evaluate(NoShadowingOrOverridesOnMethodsRule.java:40)
	at com.carrotsearch.randomizedtesting.rules.NoShadowingOrOverridesOnMethodsRule$1.evaluate(NoShadowingOrOverridesOnMethodsRule.java:40)
	at com.carrotsearch.randomizedtesting.rules.StatementAdapter.evaluate(StatementAdapter.java:36)
	at com.carrotsearch.randomizedtesting.rules.StatementAdapter.evaluate(StatementAdapter.java:36)
	at org.apache.lucene.util.TestRuleAssertionsRequired$1.evaluate(TestRuleAssertionsRequired.java:53)
	at org.apache.lucene.util.TestRuleMarkFailure$1.evaluate(TestRuleMarkFailure.java:47)
	at org.apache.lucene.util.TestRuleIgnoreAfterMaxFailures$1.evaluate(TestRuleIgnoreAfterMaxFailures.java:64)
	at org.apache.lucene.util.TestRuleIgnoreTestSuites$1.evaluate(TestRuleIgnoreTestSuites.java:54)
	at com.carrotsearch.randomizedtesting.rules.StatementAdapter.evaluate(StatementAdapter.java:36)
	at com.carrotsearch.randomizedtesting.ThreadLeakControl$StatementRunner.run(ThreadLeakControl.java:368)
	at java.base/java.lang.Thread.run(Thread.java:835)


FAILED:  org.apache.solr.security.JWTAuthPluginIntegrationTest.testMetrics

Error Message:
Server returned HTTP response code: 401 for URL: http://127.0.0.1:43045/solr/jwtColl/query?q=*:*

Stack Trace:
java.io.IOException: Server returned HTTP response code: 401 for URL: http://127.0.0.1:43045/solr/jwtColl/query?q=*:*
	at __randomizedtesting.SeedInfo.seed([A96B68EE79AFC9C2:5779BA4C65A5BE71]:0)
	at java.base/sun.net.www.protocol.http.HttpURLConnection.getInputStream0(HttpURLConnection.java:1913)
	at java.base/sun.net.www.protocol.http.HttpURLConnection.getInputStream(HttpURLConnection.java:1509)
	at java.base/java.net.URLConnection.getContent(URLConnection.java:749)
	at org.apache.solr.security.JWTAuthPluginIntegrationTest.get(JWTAuthPluginIntegrationTest.java:207)
	at org.apache.solr.security.JWTAuthPluginIntegrationTest.testMetrics(JWTAuthPluginIntegrationTest.java:149)
	at java.base/jdk.internal.reflect.NativeMethodAccessorImpl.invoke0(Native Method)
	at java.base/jdk.internal.reflect.NativeMethodAccessorImpl.invoke(NativeMethodAccessorImpl.java:62)
	at java.base/jdk.internal.reflect.DelegatingMethodAccessorImpl.invoke(DelegatingMethodAccessorImpl.java:43)
	at java.base/java.lang.reflect.Method.invoke(Method.java:567)
	at com.carrotsearch.randomizedtesting.RandomizedRunner.invoke(RandomizedRunner.java:1750)
	at com.carrotsearch.randomizedtesting.RandomizedRunner$8.evaluate(RandomizedRunner.java:938)
	at com.carrotsearch.randomizedtesting.RandomizedRunner$9.evaluate(RandomizedRunner.java:974)
	at com.carrotsearch.randomizedtesting.RandomizedRunner$10.evaluate(RandomizedRunner.java:988)
	at com.carrotsearch.randomizedtesting.rules.SystemPropertiesRestoreRule$1.evaluate(SystemPropertiesRestoreRule.java:57)
	at org.apache.lucene.util.TestRuleSetupTeardownChained$1.evaluate(TestRuleSetupTeardownChained.java:49)
	at org.apache.lucene.util.AbstractBeforeAfterRule$1.evaluate(AbstractBeforeAfterRule.java:45)
	at org.apache.lucene.util.TestRuleThreadAndTestName$1.evaluate(TestRuleThreadAndTestName.java:48)
	at org.apache.lucene.util.TestRuleIgnoreAfterMaxFailures$1.evaluate(TestRuleIgnoreAfterMaxFailures.java:64)
	at org.apache.lucene.util.TestRuleMarkFailure$1.evaluate(TestRuleMarkFailure.java:47)
	at com.carrotsearch.randomizedtesting.rules.StatementAdapter.evaluate(StatementAdapter.java:36)
	at com.carrotsearch.randomizedtesting.ThreadLeakControl$StatementRunner.run(ThreadLeakControl.java:368)
	at com.carrotsearch.randomizedtesting.ThreadLeakControl.forkTimeoutingTask(ThreadLeakControl.java:817)
	at com.carrotsearch.randomizedtesting.ThreadLeakControl$3.evaluate(ThreadLeakControl.java:468)
	at com.carrotsearch.randomizedtesting.RandomizedRunner.runSingleTest(RandomizedRunner.java:947)
	at com.carrotsearch.randomizedtesting.RandomizedRunner$5.evaluate(RandomizedRunner.java:832)
	at com.carrotsearch.randomizedtesting.RandomizedRunner$6.evaluate(RandomizedRunner.java:883)
	at com.carrotsearch.randomizedtesting.RandomizedRunner$7.evaluate(RandomizedRunner.java:894)
	at com.carrotsearch.randomizedtesting.rules.StatementAdapter.evaluate(StatementAdapter.java:36)
	at com.carrotsearch.randomizedtesting.rules.SystemPropertiesRestoreRule$1.evaluate(SystemPropertiesRestoreRule.java:57)
	at org.apache.lucene.util.AbstractBeforeAfterRule$1.evaluate(AbstractBeforeAfterRule.java:45)
	at com.carrotsearch.randomizedtesting.rules.StatementAdapter.evaluate(StatementAdapter.java:36)
	at org.apache.lucene.util.TestRuleStoreClassName$1.evaluate(TestRuleStoreClassName.java:41)
	at com.carrotsearch.randomizedtesting.rules.NoShadowingOrOverridesOnMethodsRule$1.evaluate(NoShadowingOrOverridesOnMethodsRule.java:40)
	at com.carrotsearch.randomizedtesting.rules.NoShadowingOrOverridesOnMethodsRule$1.evaluate(NoShadowingOrOverridesOnMethodsRule.java:40)
	at com.carrotsearch.randomizedtesting.rules.StatementAdapter.evaluate(StatementAdapter.java:36)
	at com.carrotsearch.randomizedtesting.rules.StatementAdapter.evaluate(StatementAdapter.java:36)
	at org.apache.lucene.util.TestRuleAssertionsRequired$1.evaluate(TestRuleAssertionsRequired.java:53)
	at org.apache.lucene.util.TestRuleMarkFailure$1.evaluate(TestRuleMarkFailure.java:47)
	at org.apache.lucene.util.TestRuleIgnoreAfterMaxFailures$1.evaluate(TestRuleIgnoreAfterMaxFailures.java:64)
	at org.apache.lucene.util.TestRuleIgnoreTestSuites$1.evaluate(TestRuleIgnoreTestSuites.java:54)
	at com.carrotsearch.randomizedtesting.rules.StatementAdapter.evaluate(StatementAdapter.java:36)
	at com.carrotsearch.randomizedtesting.ThreadLeakControl$StatementRunner.run(ThreadLeakControl.java:368)
	at java.base/java.lang.Thread.run(Thread.java:835)




Build Log:
[...truncated 12673 lines...]
   [junit4] Suite: org.apache.solr.cloud.autoscaling.sim.TestSimTriggerIntegration
   [junit4]   2> Creating dataDir: /home/jenkins/workspace/Lucene-Solr-master-Linux/solr/build/solr-core/test/J2/temp/solr.cloud.autoscaling.sim.TestSimTriggerIntegration_A96B68EE79AFC9C2-001/init-core-data-001
   [junit4]   2> 96185 WARN  (SUITE-TestSimTriggerIntegration-seed#[A96B68EE79AFC9C2]-worker) [    ] o.a.s.SolrTestCaseJ4 startTrackingSearchers: numOpens=1 numCloses=1
   [junit4]   2> 96185 INFO  (SUITE-TestSimTriggerIntegration-seed#[A96B68EE79AFC9C2]-worker) [    ] o.a.s.SolrTestCaseJ4 Using TrieFields (NUMERIC_POINTS_SYSPROP=false) w/NUMERIC_DOCVALUES_SYSPROP=false
   [junit4]   2> 96186 INFO  (SUITE-TestSimTriggerIntegration-seed#[A96B68EE79AFC9C2]-worker) [    ] o.a.s.SolrTestCaseJ4 Randomized ssl (false) and clientAuth (false) via: @org.apache.solr.util.RandomizeSSL(reason="", ssl=0.0/0.0, value=0.0/0.0, clientAuth=0.0/0.0)
   [junit4]   2> 96186 INFO  (SUITE-TestSimTriggerIntegration-seed#[A96B68EE79AFC9C2]-worker) [    ] o.a.s.SolrTestCaseJ4 SecureRandom sanity checks: test.solr.allowed.securerandom=null & java.security.egd=file:/dev/./urandom
   [junit4]   2> 96191 INFO  (TEST-TestSimTriggerIntegration.testNodeMarkersRegistration-seed#[A96B68EE79AFC9C2]) [    ] o.a.s.SolrTestCaseJ4 ###Starting testNodeMarkersRegistration
   [junit4]   2> 97595 DEBUG (TEST-TestSimTriggerIntegration.testNodeMarkersRegistration-seed#[A96B68EE79AFC9C2]) [    ] o.a.s.c.a.s.SimClusterStateProvider --- new Overseer leader: 127.0.0.1:10000_solr
   [junit4]   2> 97695 DEBUG (TEST-TestSimTriggerIntegration.testNodeMarkersRegistration-seed#[A96B68EE79AFC9C2]) [    ] o.a.s.c.a.s.SimClusterStateProvider ** creating new collection states, currentVersion=0
   [junit4]   2> 98124 DEBUG (TEST-TestSimTriggerIntegration.testNodeMarkersRegistration-seed#[A96B68EE79AFC9C2]) [    ] o.a.s.c.a.s.SimClusterStateProvider ** saved cluster state version 0
   [junit4]   2> 98139 INFO  (TEST-TestSimTriggerIntegration.testNodeMarkersRegistration-seed#[A96B68EE79AFC9C2]) [    ] o.a.s.h.a.MetricsHistoryHandler No .system collection, keeping metrics history in memory.
   [junit4]   2> 98734 DEBUG (Simulated OverseerAutoScalingTriggerThread) [    ] o.a.s.c.a.OverseerTriggerThread Adding .auto_add_replicas and .scheduled_maintenance triggers
   [junit4]   2> 98821 DEBUG (Simulated OverseerAutoScalingTriggerThread) [    ] o.a.s.c.a.OverseerTriggerThread Refreshing /autoscaling.json with znode version 1
   [junit4]   2> 99408 DEBUG (simCloudManagerPool-179-thread-4) [    ] o.a.s.c.a.AutoScalingHandler Verified autoscaling configuration
   [junit4]   2> 99691 DEBUG (Simulated OverseerAutoScalingTriggerThread) [    ] o.a.s.c.a.OverseerTriggerThread Current znodeVersion 1, lastZnodeVersion 0
   [junit4]   2> 99691 DEBUG (Simulated OverseerAutoScalingTriggerThread) [    ] o.a.s.c.a.OverseerTriggerThread Processed trigger updates upto znodeVersion 1
   [junit4]   2> 99693 DEBUG (simCloudManagerPool-179-thread-4) [    ] o.a.s.c.a.OverseerTriggerThread Refreshing /autoscaling.json with znode version 2
   [junit4]   2> 99714 INFO  (TEST-TestSimTriggerIntegration.testNodeMarkersRegistration-seed#[A96B68EE79AFC9C2]) [    ] o.a.s.c.a.s.TestSimTriggerIntegration ====== KILL OVERSEER 1
   [junit4]   2> 99714 INFO  (TEST-TestSimTriggerIntegration.testNodeMarkersRegistration-seed#[A96B68EE79AFC9C2]) [    ] o.a.s.c.a.s.SimCloudManager === Restarting OverseerTriggerThread and clearing object cache...
   [junit4]   2> 99714 DEBUG (TEST-TestSimTriggerIntegration.testNodeMarkersRegistration-seed#[A96B68EE79AFC9C2]) [    ] o.a.s.c.a.ScheduledTriggers Shutting down scheduled thread pool executor now
   [junit4]   2> 99715 DEBUG (TEST-TestSimTriggerIntegration.testNodeMarkersRegistration-seed#[A96B68EE79AFC9C2]) [    ] o.a.s.c.a.ScheduledTriggers Shutting down action executor now
   [junit4]   2> 99770 DEBUG (TEST-TestSimTriggerIntegration.testNodeMarkersRegistration-seed#[A96B68EE79AFC9C2]) [    ] o.a.s.c.a.ScheduledTriggers Awaiting termination for action executor
   [junit4]   2> 99770 DEBUG (TEST-TestSimTriggerIntegration.testNodeMarkersRegistration-seed#[A96B68EE79AFC9C2]) [    ] o.a.s.c.a.ScheduledTriggers Awaiting termination for scheduled thread pool executor
   [junit4]   2> 99770 DEBUG (TEST-TestSimTriggerIntegration.testNodeMarkersRegistration-seed#[A96B68EE79AFC9C2]) [    ] o.a.s.c.a.ScheduledTriggers ScheduledTriggers closed completely
   [junit4]   2> 99770 DEBUG (TEST-TestSimTriggerIntegration.testNodeMarkersRegistration-seed#[A96B68EE79AFC9C2]) [    ] o.a.s.c.a.OverseerTriggerThread OverseerTriggerThread has been closed explicitly
   [junit4]   2> 99770 INFO  (TEST-TestSimTriggerIntegration.testNodeMarkersRegistration-seed#[A96B68EE79AFC9C2]) [    ] o.a.s.c.a.s.SimCloudManager   = killing node 127.0.0.1:10000_solr
   [junit4]   2> 99772 DEBUG (Simulated OverseerAutoScalingTriggerThread) [    ] o.a.s.c.a.OverseerTriggerThread -- cleaning old nodeLost / nodeAdded markers
   [junit4]   2> 99811 DEBUG (TEST-TestSimTriggerIntegration.testNodeMarkersRegistration-seed#[A96B68EE79AFC9C2]) [    ] o.a.s.c.a.s.SimClusterStateProvider  -- created marker: /autoscaling/nodeLost/127.0.0.1:10000_solr
   [junit4]   2> 99811 DEBUG (TEST-TestSimTriggerIntegration.testNodeMarkersRegistration-seed#[A96B68EE79AFC9C2]) [    ] o.a.s.c.a.s.SimClusterStateProvider --- new Overseer leader: 127.0.0.1:10001_solr
   [junit4]   2> 99813 DEBUG (Simulated OverseerAutoScalingTriggerThread) [    ] o.a.s.c.a.OverseerTriggerThread Refreshing /autoscaling.json with znode version 2
   [junit4]   2> 99813 DEBUG (Simulated OverseerAutoScalingTriggerThread) [    ] o.a.s.c.a.OverseerTriggerThread Current znodeVersion 2, lastZnodeVersion 0
   [junit4]   2> 99813 DEBUG (Simulated OverseerAutoScalingTriggerThread) [    ] o.a.s.c.a.OverseerTriggerThread Processed trigger updates upto znodeVersion 2
   [junit4]   2> 100021 DEBUG (Simulated OverseerAutoScalingTriggerThread) [    ] o.a.s.c.a.NodeLostTrigger NodeLostTrigger .auto_add_replicas - Initial livenodes: [127.0.0.1:10001_solr, 127.0.0.1:10002_solr]
   [junit4]   2> 100055 DEBUG (Simulated OverseerAutoScalingTriggerThread) [    ] o.a.s.c.a.NodeLostTrigger Adding lost node from marker path: 127.0.0.1:10000_solr
   [junit4]   2> 100083 DEBUG (Simulated OverseerAutoScalingTriggerThread) [    ] o.a.s.c.a.OverseerTriggerThread -- cleaning old nodeLost / nodeAdded markers
   [junit4]   2> 100083 DEBUG (Simulated OverseerAutoScalingTriggerThread) [    ] o.a.s.c.a.OverseerTriggerThread Current znodeVersion 2, lastZnodeVersion 2
   [junit4]   2> 100197 INFO  (TEST-TestSimTriggerIntegration.testNodeMarkersRegistration-seed#[A96B68EE79AFC9C2]) [    ] o.a.s.c.a.s.TestSimTriggerIntegration ====== ADD TRIGGERS
   [junit4]   2> 100198 DEBUG (ScheduledTrigger-185-thread-1) [    ] o.a.s.c.a.NodeLostTrigger Running NodeLostTrigger: .auto_add_replicas with currently live nodes: 2 and last live nodes: 2
   [junit4]   2> 100298 DEBUG (ScheduledTrigger-185-thread-1) [    ] o.a.s.c.a.NodeLostTrigger Running NodeLostTrigger: .auto_add_replicas with currently live nodes: 2 and last live nodes: 2
   [junit4]   2> 100341 DEBUG (ScheduledTrigger-185-thread-2) [    ] o.a.s.c.a.NodeLostTrigger Running NodeLostTrigger: .auto_add_replicas with currently live nodes: 2 and last live nodes: 2
   [junit4]   2> 100350 INFO  (simCloudManagerPool-184-thread-1) [    ] o.a.s.c.a.s.TestSimTriggerIntegration TestEventMarkerAction init
   [junit4]   2> 100361 DEBUG (ScheduledTrigger-185-thread-1) [    ] o.a.s.c.a.NodeLostTrigger Running NodeLostTrigger: .auto_add_replicas with currently live nodes: 2 and last live nodes: 2
   [junit4]   2> 100371 DEBUG (simCloudManagerPool-184-thread-1) [    ] o.a.s.c.a.AutoScalingHandler Verified autoscaling configuration
   [junit4]   2> 100372 DEBUG (simCloudManagerPool-184-thread-1) [    ] o.a.s.c.a.OverseerTriggerThread Refreshing /autoscaling.json with znode version 3
   [junit4]   2> 100383 DEBUG (ScheduledTrigger-185-thread-1) [    ] o.a.s.c.a.NodeLostTrigger Running NodeLostTrigger: .auto_add_replicas with currently live nodes: 2 and last live nodes: 2
   [junit4]   2> 100383 INFO  (simCloudManagerPool-184-thread-1) [    ] o.a.s.c.a.s.TestSimTriggerIntegration TestEventMarkerAction init
   [junit4]   2> 100383 DEBUG (Simulated OverseerAutoScalingTriggerThread) [    ] o.a.s.c.a.OverseerTriggerThread Processed trigger updates upto znodeVersion 3
   [junit4]   2> 100384 DEBUG (Simulated OverseerAutoScalingTriggerThread) [    ] o.a.s.c.a.NodeAddedTrigger NodeAddedTrigger node_added_trigger - Initial livenodes: [127.0.0.1:10001_solr, 127.0.0.1:10002_solr]
   [junit4]   2> 100384 DEBUG (Simulated OverseerAutoScalingTriggerThread) [    ] o.a.s.c.a.NodeAddedTrigger NodeAddedTrigger node_added_trigger instantiated with properties: {event=nodeAdded, waitFor=1, actions=[{name=test, class=org.apache.solr.cloud.autoscaling.sim.TestSimTriggerIntegration$TestEventMarkerAction}], enabled=true}
   [junit4]   2> 100397 DEBUG (ScheduledTrigger-185-thread-4) [    ] o.a.s.c.a.NodeAddedTrigger Running NodeAddedTrigger node_added_trigger
   [junit4]   2> 100397 DEBUG (ScheduledTrigger-185-thread-4) [    ] o.a.s.c.a.NodeAddedTrigger Found livenodes: 2
   [junit4]   2> 100409 INFO  (simCloudManagerPool-184-thread-2) [    ] o.a.s.c.a.s.TestSimTriggerIntegration TestEventMarkerAction init
   [junit4]   2> 100410 DEBUG (simCloudManagerPool-184-thread-2) [    ] o.a.s.c.a.AutoScalingHandler Verified autoscaling configuration
   [junit4]   2> 100411 DEBUG (simCloudManagerPool-184-thread-2) [    ] o.a.s.c.a.OverseerTriggerThread Refreshing /autoscaling.json with znode version 4
   [junit4]   2> 100412 INFO  (simCloudManagerPool-184-thread-2) [    ] o.a.s.c.a.s.TestSimTriggerIntegration TestEventMarkerAction init
   [junit4]   2> 100412 INFO  (simCloudManagerPool-184-thread-2) [    ] o.a.s.c.a.s.TestSimTriggerIntegration TestEventMarkerAction init
   [junit4]   2> 100421 DEBUG (ScheduledTrigger-185-thread-3) [    ] o.a.s.c.a.NodeLostTrigger Running NodeLostTrigger: .auto_add_replicas with currently live nodes: 2 and last live nodes: 2
   [junit4]   2> 100397 DEBUG (Simulated OverseerAutoScalingTriggerThread) [    ] o.a.s.c.a.OverseerTriggerThread -- cleaning old nodeLost / nodeAdded markers
   [junit4]   2> 100421 DEBUG (Simulated OverseerAutoScalingTriggerThread) [    ] o.a.s.c.a.OverseerTriggerThread Current znodeVersion 4, lastZnodeVersion 3
   [junit4]   2> 100421 DEBUG (Simulated OverseerAutoScalingTriggerThread) [    ] o.a.s.c.a.OverseerTriggerThread Processed trigger updates upto znodeVersion 4
   [junit4]   2> 100422 DEBUG (Simulated OverseerAutoScalingTriggerThread) [    ] o.a.s.c.a.NodeLostTrigger NodeLostTrigger node_lost_trigger - Initial livenodes: [127.0.0.1:10001_solr, 127.0.0.1:10002_solr]
   [junit4]   2> 100422 DEBUG (Simulated OverseerAutoScalingTriggerThread) [    ] o.a.s.c.a.OverseerTriggerThread -- cleaning old nodeLost / nodeAdded markers
   [junit4]   2> 100422 DEBUG (Simulated OverseerAutoScalingTriggerThread) [    ] o.a.s.c.a.OverseerTriggerThread Current znodeVersion 4, lastZnodeVersion 4
   [junit4]   2> 100422 DEBUG (ScheduledTrigger-185-thread-2) [    ] o.a.s.c.a.NodeLostTrigger Running NodeLostTrigger: node_lost_trigger with currently live nodes: 2 and last live nodes: 2
   [junit4]   2> 100423 INFO  (TEST-TestSimTriggerIntegration.testNodeMarkersRegistration-seed#[A96B68EE79AFC9C2]) [    ] o.a.s.c.a.s.TestSimTriggerIntegration ====== ADD NODE 1
   [junit4]   2> 100423 DEBUG (TEST-TestSimTriggerIntegration.testNodeMarkersRegistration-seed#[A96B68EE79AFC9C2]) [    ] o.a.s.c.a.s.SimClusterStateProvider -- creating marker: /autoscaling/nodeAdded/127.0.0.1:10003_solr
   [junit4]   2> 100424 INFO  (TEST-TestSimTriggerIntegration.testNodeMarkersRegistration-seed#[A96B68EE79AFC9C2]) [    ] o.a.s.c.a.s.TestSimTriggerIntegration ====== KILL OVERSEER 2
   [junit4]   2> 100424 INFO  (TEST-TestSimTriggerIntegration.testNodeMarkersRegistration-seed#[A96B68EE79AFC9C2]) [    ] o.a.s.c.a.s.SimCloudManager === Restarting OverseerTriggerThread and clearing object cache...
   [junit4]   2> 100433 INFO  (Simulated OverseerAutoScalingTriggerThread) [    ] o.a.s.c.a.OverseerTriggerThread OverseerTriggerThread woken up but we are closed, exiting.
   [junit4]   2> 100436 DEBUG (TEST-TestSimTriggerIntegration.testNodeMarkersRegistration-seed#[A96B68EE79AFC9C2]) [    ] o.a.s.c.a.ScheduledTriggers Shutting down scheduled thread pool executor now
   [junit4]   2> 100436 DEBUG (TEST-TestSimTriggerIntegration.testNodeMarkersRegistration-seed#[A96B68EE79AFC9C2]) [    ] o.a.s.c.a.ScheduledTriggers Shutting down action executor now
   [junit4]   2> 100437 DEBUG (TEST-TestSimTriggerIntegration.testNodeMarkersRegistration-seed#[A96B68EE79AFC9C2]) [    ] o.a.s.c.a.ScheduledTriggers Awaiting termination for action executor
   [junit4]   2> 100437 DEBUG (TEST-TestSimTriggerIntegration.testNodeMarkersRegistration-seed#[A96B68EE79AFC9C2]) [    ] o.a.s.c.a.ScheduledTriggers Awaiting termination for scheduled thread pool executor
   [junit4]   2> 100441 DEBUG (TEST-TestSimTriggerIntegration.testNodeMarkersRegistration-seed#[A96B68EE79AFC9C2]) [    ] o.a.s.c.a.ScheduledTriggers ScheduledTriggers closed completely
   [junit4]   2> 100441 DEBUG (TEST-TestSimTriggerIntegration.testNodeMarkersRegistration-seed#[A96B68EE79AFC9C2]) [    ] o.a.s.c.a.OverseerTriggerThread OverseerTriggerThread has been closed explicitly
   [junit4]   2> 100441 INFO  (TEST-TestSimTriggerIntegration.testNodeMarkersRegistration-seed#[A96B68EE79AFC9C2]) [    ] o.a.s.c.a.s.SimCloudManager   = killing node 127.0.0.1:10001_solr
   [junit4]   2> 100441 DEBUG (TEST-TestSimTriggerIntegration.testNodeMarkersRegistration-seed#[A96B68EE79AFC9C2]) [    ] o.a.s.c.a.s.SimClusterStateProvider  -- created marker: /autoscaling/nodeLost/127.0.0.1:10001_solr
   [junit4]   2> 100441 DEBUG (TEST-TestSimTriggerIntegration.testNodeMarkersRegistration-seed#[A96B68EE79AFC9C2]) [    ] o.a.s.c.a.s.SimClusterStateProvider --- new Overseer leader: 127.0.0.1:10002_solr
   [junit4]   2> 100454 DEBUG (Simulated OverseerAutoScalingTriggerThread) [    ] o.a.s.c.a.OverseerTriggerThread Refreshing /autoscaling.json with znode version 4
   [junit4]   2> 100455 INFO  (Simulated OverseerAutoScalingTriggerThread) [    ] o.a.s.c.a.s.TestSimTriggerIntegration TestEventMarkerAction init
   [junit4]   2> 100455 INFO  (Simulated OverseerAutoScalingTriggerThread) [    ] o.a.s.c.a.s.TestSimTriggerIntegration TestEventMarkerAction init
   [junit4]   2> 100455 DEBUG (Simulated OverseerAutoScalingTriggerThread) [    ] o.a.s.c.a.OverseerTriggerThread Current znodeVersion 4, lastZnodeVersion 0
   [junit4]   2> 100455 DEBUG (Simulated OverseerAutoScalingTriggerThread) [    ] o.a.s.c.a.OverseerTriggerThread Processed trigger updates upto znodeVersion 4
   [junit4]   2> 100455 DEBUG (Simulated OverseerAutoScalingTriggerThread) [    ] o.a.s.c.a.NodeLostTrigger NodeLostTrigger node_lost_trigger - Initial livenodes: [127.0.0.1:10002_solr, 127.0.0.1:10003_solr]
   [junit4]   2> 100455 DEBUG (Simulated OverseerAutoScalingTriggerThread) [    ] o.a.s.c.a.NodeLostTrigger Adding lost node from marker path: 127.0.0.1:10001_solr
   [junit4]   2> 100456 DEBUG (Simulated OverseerAutoScalingTriggerThread) [    ] o.a.s.c.a.NodeAddedTrigger NodeAddedTrigger node_added_trigger - Initial livenodes: [127.0.0.1:10002_solr, 127.0.0.1:10003_solr]
   [junit4]   2> 100456 DEBUG (Simulated OverseerAutoScalingTriggerThread) [    ] o.a.s.c.a.NodeAddedTrigger NodeAddedTrigger node_added_trigger instantiated with properties: {event=nodeAdded, waitFor=1, actions=[{name=test, class=org.apache.solr.cloud.autoscaling.sim.TestSimTriggerIntegration$TestEventMarkerAction}], enabled=true}
   [junit4]   2> 100456 DEBUG (Simulated OverseerAutoScalingTriggerThread) [    ] o.a.s.c.a.NodeAddedTrigger Adding node from marker path: 127.0.0.1:10003_solr
   [junit4]   2> 100456 DEBUG (ScheduledTrigger-188-thread-1) [    ] o.a.s.c.a.NodeLostTrigger Running NodeLostTrigger: node_lost_trigger with currently live nodes: 2 and last live nodes: 2
   [junit4]   2> 100456 DEBUG (ScheduledTrigger-188-thread-1) [    ] o.a.s.c.a.NodeLostTrigger Tracking lost node: 127.0.0.1:10001_solr
   [junit4]   2> 100469 DEBUG (Simulated OverseerAutoScalingTriggerThread) [    ] o.a.s.c.a.NodeLostTrigger NodeLostTrigger .auto_add_replicas - Initial livenodes: [127.0.0.1:10002_solr, 127.0.0.1:10003_solr]
   [junit4]   2> 100470 DEBUG (Simulated OverseerAutoScalingTriggerThread) [    ] o.a.s.c.a.NodeLostTrigger Adding lost node from marker path: 127.0.0.1:10001_solr
   [junit4]   2> 100477 DEBUG (ScheduledTrigger-188-thread-2) [    ] o.a.s.c.a.NodeAddedTrigger Running NodeAddedTrigger node_added_trigger
   [junit4]   2> 100477 DEBUG (ScheduledTrigger-188-thread-2) [    ] o.a.s.c.a.NodeAddedTrigger Found livenodes: 2
   [junit4]   2> 100477 DEBUG (ScheduledTrigger-188-thread-2) [    ] o.a.s.c.a.NodeAddedTrigger Tracking new node: 127.0.0.1:10003_solr at time 658362295213224
   [junit4]   2> 100477 DEBUG (ScheduledTrigger-188-thread-2) [    ] o.a.s.c.a.NodeLostTrigger Running NodeLostTrigger: .auto_add_replicas with currently live nodes: 2 and last live nodes: 2
   [junit4]   2> 100477 DEBUG (ScheduledTrigger-188-thread-2) [    ] o.a.s.c.a.NodeLostTrigger Tracking lost node: 127.0.0.1:10001_solr
   [junit4]   2> 100519 DEBUG (ScheduledTrigger-188-thread-2) [    ] o.a.s.c.a.NodeLostTrigger Running NodeLostTrigger: node_lost_trigger with currently live nodes: 2 and last live nodes: 2
   [junit4]   2> 100520 DEBUG (ScheduledTrigger-188-thread-2) [    ] o.a.s.c.a.NodeLostTrigger NodeLostTrigger firing registered processor for lost nodes: [127.0.0.1:10001_solr]
   [junit4]   2> 100532 DEBUG (ScheduledTrigger-188-thread-1) [    ] o.a.s.c.a.NodeAddedTrigger Running NodeAddedTrigger node_added_trigger
   [junit4]   2> 100532 DEBUG (ScheduledTrigger-188-thread-1) [    ] o.a.s.c.a.NodeAddedTrigger Found livenodes: 2
   [junit4]   2> 100532 DEBUG (ScheduledTrigger-188-thread-1) [    ] o.a.s.c.a.NodeAddedTrigger NodeAddedTrigger node_added_trigger firing registered processor for nodes: [127.0.0.1:10003_solr] added at times [658362295213224], now=658365031439674
   [junit4]   2> 100533 DEBUG (Simulated OverseerAutoScalingTriggerThread) [    ] o.a.s.c.a.OverseerTriggerThread -- cleaning old nodeLost / nodeAdded markers
   [junit4]   2> 100533 DEBUG (Simulated OverseerAutoScalingTriggerThread) [    ] o.a.s.c.a.OverseerTriggerThread Current znodeVersion 4, lastZnodeVersion 4
   [junit4]   2> 100575 DEBUG (ScheduledTrigger-188-thread-4) [    ] o.a.s.c.a.NodeLostTrigger Running NodeLostTrigger: .auto_add_replicas with currently live nodes: 2 and last live nodes: 2
   [junit4]   2> 100596 DEBUG (ScheduledTrigger-188-thread-4) [    ] o.a.s.c.a.NodeLostTrigger Running NodeLostTrigger: .auto_add_replicas with currently live nodes: 2 and last live nodes: 2
   [junit4]   2> 100616 DEBUG (ScheduledTrigger-188-thread-4) [    ] o.a.s.c.a.NodeLostTrigger Running NodeLostTrigger: .auto_add_replicas with currently live nodes: 2 and last live nodes: 2
   [junit4]   2> 100636 DEBUG (ScheduledTrigger-188-thread-4) [    ] o.a.s.c.a.NodeLostTrigger Running NodeLostTrigger: .auto_add_replicas with currently live nodes: 2 and last live nodes: 2
   [junit4]   2> 100640 DEBUG (ScheduledTrigger-188-thread-1) [    ] o.a.s.c.a.ScheduledTriggers ++++++++ Cooldown inactive - processing event: {
   [junit4]   2>   "id":"256c6eabd5ca8T3pxj1s2u7ab9pplw4q0da5lug",
   [junit4]   2>   "source":"node_added_trigger",
   [junit4]   2>   "eventTime":658362295213224,
   [junit4]   2>   "eventType":"NODEADDED",
   [junit4]   2>   "properties":{
   [junit4]   2>     "eventTimes":[658362295213224],
   [junit4]   2>     "preferredOperation":"movereplica",
   [junit4]   2>     "nodeNames":["127.0.0.1:10003_solr"]}}
   [junit4]   2> 100649 DEBUG (ScheduledTrigger-188-thread-1) [    ] o.a.s.c.a.ScheduledTriggers Pausing all triggers: [.auto_add_replicas, node_lost_trigger, node_added_trigger]
   [junit4]   2> 100650 DEBUG (ScheduledTrigger-188-thread-2) [    ] o.a.s.c.a.ScheduledTriggers -------- Cooldown period - rejecting event: {
   [junit4]   2>   "id":"256c6ad591708T3pxj1s2u7ab9pplw4q0da5luf",
   [junit4]   2>   "source":"node_lost_trigger",
   [junit4]   2>   "eventTime":658361265231624,
   [junit4]   2>   "eventType":"NODELOST",
   [junit4]   2>   "properties":{
   [junit4]   2>     "eventTimes":[658361265231624],
   [junit4]   2>     "preferredOperation":"movereplica",
   [junit4]   2>     "nodeNames":["127.0.0.1:10001_solr"]}}
   [junit4]   2> 100650 DEBUG (ScheduledTrigger-188-thread-2) [    ] o.a.s.c.a.SystemLogListener Collection .system missing, skip sending event {
   [junit4]   2>   "id":"256c6ad591708T3pxj1s2u7ab9pplw4q0da5luf",
   [junit4]   2>   "source":"node_lost_trigger",
   [junit4]   2>   "eventTime":658361265231624,
   [junit4]   2>   "eventType":"NODELOST",
   [junit4]   2>   "properties":{
   [junit4]   2>     "eventTimes":[658361265231624],
   [junit4]   2>     "cooldown":true,
   [junit4]   2>     "preferredOperation":"movereplica",
   [junit4]   2>     "nodeNames":["127.0.0.1:10001_solr"]}}
   [junit4]   2> 100650 DEBUG (ScheduledTrigger-188-thread-2) [    ] o.a.s.c.a.NodeLostTrigger NodeLostTrigger processor for lost nodes: [127.0.0.1:10001_solr] is not ready, will try later
   [junit4]   2> 100667 DEBUG (ScheduledTrigger-188-thread-1) [    ] o.a.s.c.a.SystemLogListener Collection .system missing, skip sending event {
   [junit4]   2>   "id":"256c6eabd5ca8T3pxj1s2u7ab9pplw4q0da5lug",
   [junit4]   2>   "source":"node_added_trigger",
   [junit4]   2>   "eventTime":658362295213224,
   [junit4]   2>   "eventType":"NODEADDED",
   [junit4]   2>   "properties":{
   [junit4]   2>     "eventTimes":[658362295213224],
   [junit4]   2>     "preferredOperation":"movereplica",
   [junit4]   2>     "_enqueue_time_":658371744032074,
   [junit4]   2>     "nodeNames":["127.0.0.1:10003_solr"]}}
   [junit4]   2> 100862 DEBUG (AutoscalingActionExecutor-189-thread-1) [    ] o.a.s.c.a.ScheduledTriggers -- processing actions for {
   [junit4]   2>   "id":"256c6eabd5ca8T3pxj1s2u7ab9pplw4q0da5lug",
   [junit4]   2>   "source":"node_added_trigger",
   [junit4]   2>   "eventTime":658362295213224,
   [junit4]   2>   "eventType":"NODEADDED",
   [junit4]   2>   "properties":{
   [junit4]   2>     "eventTimes":[658362295213224],
   [junit4]   2>     "preferredOperation":"movereplica",
   [junit4]   2>     "_enqueue_time_":658371744032074,
   [junit4]   2>     "nodeNames":["127.0.0.1:10003_solr"]}}
   [junit4]   2> 100912 DEBUG (ScheduledTrigger-188-thread-1) [    ] o.a.s.c.a.NodeAddedTrigger Removing new node from tracking: 127.0.0.1:10003_solr
   [junit4]   2> 101049 DEBUG (AutoscalingActionExecutor-189-thread-1) [    ] o.a.s.c.a.SystemLogListener Collection .system missing, skip sending event {
   [junit4]   2>   "id":"256c6eabd5ca8T3pxj1s2u7ab9pplw4q0da5lug",
   [junit4]   2>   "source":"node_added_trigger",
   [junit4]   2>   "eventTime":658362295213224,
   [junit4]   2>   "eventType":"NODEADDED",
   [junit4]   2>   "properties":{
   [junit4]   2>     "eventTimes":[658362295213224],
   [junit4]   2>     "preferredOperation":"movereplica",
   [junit4]   2>     "_enqueue_time_":658371744032074,
   [junit4]   2>     "nodeNames":["127.0.0.1:10003_solr"]}}
   [junit4]   2> 101173 DEBUG (AutoscalingActionExecutor-189-thread-1) [    ] o.a.s.c.a.ScheduledTriggers Resuming trigger: .auto_add_replicas after 100ms
   [junit4]   2> 101173 DEBUG (AutoscalingActionExecutor-189-thread-1) [    ] o.a.s.c.a.ScheduledTriggers Resuming trigger: node_lost_trigger after 100ms
   [junit4]   2> 101173 DEBUG (AutoscalingActionExecutor-189-thread-1) [    ] o.a.s.c.a.ScheduledTriggers Resuming trigger: node_added_trigger after 100ms
   [junit4]   2> 101173 DEBUG (AutoscalingActionExecutor-189-thread-1) [    ] o.a.s.c.a.ScheduledTriggers -- processing took 15551 ms for event id=256c6eabd5ca8T3pxj1s2u7ab9pplw4q0da5lug
   [junit4]   2> 101273 DEBUG (ScheduledTrigger-188-thread-2) [    ] o.a.s.c.a.NodeLostTrigger Running NodeLostTrigger: .auto_add_replicas with currently live nodes: 2 and last live nodes: 2
   [junit4]   2> 101273 DEBUG (ScheduledTrigger-188-thread-2) [    ] o.a.s.c.a.NodeLostTrigger Running NodeLostTrigger: node_lost_trigger with currently live nodes: 2 and last live nodes: 2
   [junit4]   2> 101273 DEBUG (ScheduledTrigger-188-thread-2) [    ] o.a.s.c.a.NodeLostTrigger NodeLostTrigger firing registered processor for lost nodes: [127.0.0.1:10001_solr]
   [junit4]   2> 101273 DEBUG (ScheduledTrigger-188-thread-2) [    ] o.a.s.c.a.ScheduledTriggers ++++++++ Cooldown inactive - processing event: {
   [junit4]   2>   "id":"256c6ad591708T3pxj1s2u7ab9pplw4q0da5luh",
   [junit4]   2>   "source":"node_lost_trigger",
   [junit4]   2>   "eventTime":658361265231624,
   [junit4]   2>   "eventType":"NODELOST",
   [junit4]   2>   "properties":{
   [junit4]   2>     "eventTimes":[658361265231624],
   [junit4]   2>     "preferredOperation":"movereplica",
   [junit4]   2>     "nodeNames":["127.0.0.1:10001_solr"]}}
   [junit4]   2> 101273 DEBUG (ScheduledTrigger-188-thread-2) [    ] o.a.s.c.a.ScheduledTriggers Pausing all triggers: [.auto_add_replicas, node_lost_trigger, node_added_trigger]
   [junit4]   2> 101274 DEBUG (ScheduledTrigger-188-thread-2) [    ] o.a.s.c.a.SystemLogListener Collection .system missing, skip sending event {
   [junit4]   2>   "id":"256c6ad591708T3pxj1s2u7ab9pplw4q0da5luh",
   [junit4]   2>   "source":"node_lost_trigger",
   [junit4]   2>   "eventTime":658361265231624,
   [junit4]   2>   "eventType":"NODEL

[...truncated too long message...]

) [    ] o.a.s.c.a.NodeLostTrigger Running NodeLostTrigger: .auto_add_replicas with currently live nodes: 2 and last live nodes: 2
   [junit4]   2> 941708 DEBUG (ScheduledTrigger-1337-thread-4) [    ] o.a.s.c.a.NodeLostTrigger Running NodeLostTrigger: .auto_add_replicas with currently live nodes: 2 and last live nodes: 2
   [junit4]   2> 941728 DEBUG (ScheduledTrigger-1337-thread-4) [    ] o.a.s.c.a.NodeLostTrigger Running NodeLostTrigger: .auto_add_replicas with currently live nodes: 2 and last live nodes: 2
   [junit4]   2> 941746 DEBUG (ScheduledTrigger-1337-thread-3) [    ] o.a.s.c.a.SearchRateTrigger ### rates for node 127.0.0.1:10033_solr
   [junit4]   2> 941746 DEBUG (ScheduledTrigger-1337-thread-3) [    ] o.a.s.c.a.SearchRateTrigger ###  metrics:solr.core.collection1.shard1.replica_n2:QUERY./select.requestTimes:1minRate	250
   [junit4]   2> 941749 DEBUG (ScheduledTrigger-1337-thread-4) [    ] o.a.s.c.a.NodeLostTrigger Running NodeLostTrigger: .auto_add_replicas with currently live nodes: 2 and last live nodes: 2
   [junit4]   2> 941769 DEBUG (ScheduledTrigger-1337-thread-4) [    ] o.a.s.c.a.NodeLostTrigger Running NodeLostTrigger: .auto_add_replicas with currently live nodes: 2 and last live nodes: 2
   [junit4]   2> 941770 DEBUG (ScheduledTrigger-1337-thread-3) [    ] o.a.s.c.a.SearchRateTrigger ## Collection: collection1
   [junit4]   2> 941789 DEBUG (ScheduledTrigger-1337-thread-4) [    ] o.a.s.c.a.NodeLostTrigger Running NodeLostTrigger: .auto_add_replicas with currently live nodes: 2 and last live nodes: 2
   [junit4]   2> 941795 DEBUG (ScheduledTrigger-1337-thread-3) [    ] o.a.s.c.a.SearchRateTrigger ##  - shard1
   [junit4]   2> 941809 DEBUG (ScheduledTrigger-1337-thread-4) [    ] o.a.s.c.a.NodeLostTrigger Running NodeLostTrigger: .auto_add_replicas with currently live nodes: 2 and last live nodes: 2
   [junit4]   2> 941829 DEBUG (ScheduledTrigger-1337-thread-4) [    ] o.a.s.c.a.NodeLostTrigger Running NodeLostTrigger: .auto_add_replicas with currently live nodes: 2 and last live nodes: 2
   [junit4]   2> 941834 DEBUG (ScheduledTrigger-1337-thread-3) [    ] o.a.s.c.a.SearchRateTrigger ##     collection1_shard1_replica_n1  250.0
   [junit4]   2> 941834 DEBUG (ScheduledTrigger-1337-thread-3) [    ] o.a.s.c.a.SearchRateTrigger ##     collection1_shard1_replica_n2  250.0
   [junit4]   2> 941849 DEBUG (ScheduledTrigger-1337-thread-4) [    ] o.a.s.c.a.NodeLostTrigger Running NodeLostTrigger: .auto_add_replicas with currently live nodes: 2 and last live nodes: 2
   [junit4]   2> 941870 DEBUG (ScheduledTrigger-1337-thread-4) [    ] o.a.s.c.a.NodeLostTrigger Running NodeLostTrigger: .auto_add_replicas with currently live nodes: 2 and last live nodes: 2
   [junit4]   2> 941890 DEBUG (ScheduledTrigger-1337-thread-4) [    ] o.a.s.c.a.NodeLostTrigger Running NodeLostTrigger: .auto_add_replicas with currently live nodes: 2 and last live nodes: 2
   [junit4]   2> 941910 DEBUG (ScheduledTrigger-1337-thread-4) [    ] o.a.s.c.a.NodeLostTrigger Running NodeLostTrigger: .auto_add_replicas with currently live nodes: 2 and last live nodes: 2
   [junit4]   2> 941930 DEBUG (ScheduledTrigger-1337-thread-4) [    ] o.a.s.c.a.NodeLostTrigger Running NodeLostTrigger: .auto_add_replicas with currently live nodes: 2 and last live nodes: 2
   [junit4]   2> 941952 DEBUG (ScheduledTrigger-1337-thread-4) [    ] o.a.s.c.a.NodeLostTrigger Running NodeLostTrigger: .auto_add_replicas with currently live nodes: 2 and last live nodes: 2
   [junit4]   2> 941976 DEBUG (ScheduledTrigger-1337-thread-4) [    ] o.a.s.c.a.NodeLostTrigger Running NodeLostTrigger: .auto_add_replicas with currently live nodes: 2 and last live nodes: 2
   [junit4]   2> 941997 DEBUG (ScheduledTrigger-1337-thread-4) [    ] o.a.s.c.a.NodeLostTrigger Running NodeLostTrigger: .auto_add_replicas with currently live nodes: 2 and last live nodes: 2
   [junit4]   2> 942009 INFO  (Simulated OverseerAutoScalingTriggerThread) [    ] o.a.s.c.a.OverseerTriggerThread OverseerTriggerThread woken up but we are closed, exiting.
   [junit4]   2> 942009 DEBUG (TEST-TestSimTriggerIntegration.testSearchRate-seed#[A96B68EE79AFC9C2]) [    ] o.a.s.c.a.ScheduledTriggers Shutting down scheduled thread pool executor now
   [junit4]   2> 942027 DEBUG (TEST-TestSimTriggerIntegration.testSearchRate-seed#[A96B68EE79AFC9C2]) [    ] o.a.s.c.a.ScheduledTriggers Shutting down action executor now
   [junit4]   2> 942027 DEBUG (TEST-TestSimTriggerIntegration.testSearchRate-seed#[A96B68EE79AFC9C2]) [    ] o.a.s.c.a.ScheduledTriggers Awaiting termination for action executor
   [junit4]   2> 942027 DEBUG (TEST-TestSimTriggerIntegration.testSearchRate-seed#[A96B68EE79AFC9C2]) [    ] o.a.s.c.a.ScheduledTriggers Awaiting termination for scheduled thread pool executor
   [junit4]   2> 942421 DEBUG (ScheduledTrigger-1337-thread-3) [    ] o.a.s.c.a.SearchRateTrigger -- collection1.shard1: totalShardRate=500.0, shardRate=250.0
   [junit4]   2> 942478 DEBUG (TEST-TestSimTriggerIntegration.testSearchRate-seed#[A96B68EE79AFC9C2]) [    ] o.a.s.c.a.ScheduledTriggers ScheduledTriggers closed completely
   [junit4]   2> 942478 DEBUG (TEST-TestSimTriggerIntegration.testSearchRate-seed#[A96B68EE79AFC9C2]) [    ] o.a.s.c.a.OverseerTriggerThread OverseerTriggerThread has been closed explicitly
   [junit4]   2> 942479 INFO  (TEST-TestSimTriggerIntegration.testSearchRate-seed#[A96B68EE79AFC9C2]) [    ] o.a.s.SolrTestCaseJ4 ###Ending testSearchRate
   [junit4]   2> NOTE: reproduce with: ant test  -Dtestcase=TestSimTriggerIntegration -Dtests.method=testSearchRate -Dtests.seed=A96B68EE79AFC9C2 -Dtests.multiplier=3 -Dtests.slow=true -Dtests.badapples=true -Dtests.locale=ast-ES -Dtests.timezone=America/St_Johns -Dtests.asserts=true -Dtests.file.encoding=UTF-8
   [junit4] FAILURE 2.40s J2 | TestSimTriggerIntegration.testSearchRate <<<
   [junit4]    > Throwable #1: java.lang.AssertionError: The trigger did not start in time
   [junit4]    > 	at __randomizedtesting.SeedInfo.seed([A96B68EE79AFC9C2:F4237667B6696F8D]:0)
   [junit4]    > 	at org.apache.solr.cloud.autoscaling.sim.TestSimTriggerIntegration.testSearchRate(TestSimTriggerIntegration.java:1369)
   [junit4]    > 	at java.base/jdk.internal.reflect.NativeMethodAccessorImpl.invoke0(Native Method)
   [junit4]    > 	at java.base/jdk.internal.reflect.NativeMethodAccessorImpl.invoke(NativeMethodAccessorImpl.java:62)
   [junit4]    > 	at java.base/jdk.internal.reflect.DelegatingMethodAccessorImpl.invoke(DelegatingMethodAccessorImpl.java:43)
   [junit4]    > 	at java.base/java.lang.reflect.Method.invoke(Method.java:567)
   [junit4]    > 	at java.base/java.lang.Thread.run(Thread.java:835)
   [junit4]   2> NOTE: leaving temporary files on disk at: /home/jenkins/workspace/Lucene-Solr-master-Linux/solr/build/solr-core/test/J2/temp/solr.cloud.autoscaling.sim.TestSimTriggerIntegration_A96B68EE79AFC9C2-001
   [junit4]   2> NOTE: test params are: codec=Lucene80, sim=Asserting(org.apache.lucene.search.similarities.AssertingSimilarity@2da67619), locale=ast-ES, timezone=America/St_Johns
   [junit4]   2> NOTE: Linux 4.18.0-15-generic amd64/Aleksey Shipilev 12-testing (64-bit)/cpus=8,threads=1,free=70562752,total=510132224
   [junit4]   2> NOTE: All tests run in this JVM: [UnloadDistributedZkTest, UnloadDistributedZkTest, BasicDistributedZkTest, BasicDistributedZkTest, UnloadDistributedZkTest, UnloadDistributedZkTest, TestSimTriggerIntegration]
   [junit4] Completed [27/30 (6!)] on J2 in 7.52s, 11 tests, 1 failure <<< FAILURES!

[...truncated 29 lines...]
BUILD FAILED
/home/jenkins/workspace/Lucene-Solr-master-Linux/lucene/common-build.xml:1572: The following error occurred while executing this line:
/home/jenkins/workspace/Lucene-Solr-master-Linux/lucene/common-build.xml:1099: There were test failures: 30 suites, 90 tests, 5 errors, 1 failure [seed: A96B68EE79AFC9C2]

Total time: 16 minutes 31 seconds

[repro] Setting last failure code to 256

[repro] Failures:
[repro]   0/5 failed: org.apache.solr.cloud.BasicDistributedZkTest
[repro]   0/5 failed: org.apache.solr.cloud.UnloadDistributedZkTest
[repro]   0/5 failed: org.apache.solr.metrics.rrd.SolrRrdBackendFactoryTest
[repro]   1/5 failed: org.apache.solr.cloud.autoscaling.sim.TestSimTriggerIntegration
[repro]   1/5 failed: org.apache.solr.security.JWTAuthPluginIntegrationTest
[repro]   4/5 failed: org.apache.solr.schema.TestCloudSchemaless
[repro] Exiting with code 256
+ mv lucene/build lucene/build.repro
+ mv solr/build solr/build.repro
+ mv lucene/build.orig lucene/build
+ mv solr/build.orig solr/build
Archiving artifacts
Setting ANT_1_8_2_HOME=/home/jenkins/tools/hudson.tasks.Ant_AntInstallation/ANT_1.8.2
[WARNINGS] Parsing warnings in console log with parser Java Compiler (javac)
Setting ANT_1_8_2_HOME=/home/jenkins/tools/hudson.tasks.Ant_AntInstallation/ANT_1.8.2
No credentials specified
Setting ANT_1_8_2_HOME=/home/jenkins/tools/hudson.tasks.Ant_AntInstallation/ANT_1.8.2
<Git Blamer> Using GitBlamer to create author and commit information for all warnings.
<Git Blamer> GIT_COMMIT=9e7ec87f238c77f3a1fc5cec55787bea7023b60d, workspace=/home/jenkins/workspace/Lucene-Solr-master-Linux
[WARNINGS] Computing warning deltas based on reference build #23718
Recording test results
Setting ANT_1_8_2_HOME=/home/jenkins/tools/hudson.tasks.Ant_AntInstallation/ANT_1.8.2
Build step 'Publish JUnit test result report' changed build result to UNSTABLE
Email was triggered for: Unstable (Test Failures)
Sending email for trigger: Unstable (Test Failures)
Setting ANT_1_8_2_HOME=/home/jenkins/tools/hudson.tasks.Ant_AntInstallation/ANT_1.8.2
Setting ANT_1_8_2_HOME=/home/jenkins/tools/hudson.tasks.Ant_AntInstallation/ANT_1.8.2
Setting ANT_1_8_2_HOME=/home/jenkins/tools/hudson.tasks.Ant_AntInstallation/ANT_1.8.2
Setting ANT_1_8_2_HOME=/home/jenkins/tools/hudson.tasks.Ant_AntInstallation/ANT_1.8.2
Setting ANT_1_8_2_HOME=/home/jenkins/tools/hudson.tasks.Ant_AntInstallation/ANT_1.8.2
Setting ANT_1_8_2_HOME=/home/jenkins/tools/hudson.tasks.Ant_AntInstallation/ANT_1.8.2

[JENKINS] Lucene-Solr-master-Linux (64bit/jdk1.8.0_172) - Build # 23720 - Still Unstable!

Posted by Policeman Jenkins Server <je...@thetaphi.de>.
Build: https://jenkins.thetaphi.de/job/Lucene-Solr-master-Linux/23720/
Java: 64bit/jdk1.8.0_172 -XX:+UseCompressedOops -XX:+UseParallelGC

4 tests failed.
FAILED:  junit.framework.TestSuite.org.apache.solr.store.blockcache.BufferStoreTest

Error Message:
1 thread leaked from SUITE scope at org.apache.solr.store.blockcache.BufferStoreTest:     1) Thread[id=14, name=Log4j2-TF-1-AsyncLoggerConfig-1, state=TIMED_WAITING, group=TGRP-BufferStoreTest]         at sun.misc.Unsafe.park(Native Method)         at java.util.concurrent.locks.LockSupport.parkNanos(LockSupport.java:215)         at java.util.concurrent.locks.AbstractQueuedSynchronizer$ConditionObject.awaitNanos(AbstractQueuedSynchronizer.java:2078)         at com.lmax.disruptor.TimeoutBlockingWaitStrategy.waitFor(TimeoutBlockingWaitStrategy.java:38)         at com.lmax.disruptor.ProcessingSequenceBarrier.waitFor(ProcessingSequenceBarrier.java:56)         at com.lmax.disruptor.BatchEventProcessor.processEvents(BatchEventProcessor.java:159)         at com.lmax.disruptor.BatchEventProcessor.run(BatchEventProcessor.java:125)         at java.lang.Thread.run(Thread.java:748)

Stack Trace:
com.carrotsearch.randomizedtesting.ThreadLeakError: 1 thread leaked from SUITE scope at org.apache.solr.store.blockcache.BufferStoreTest: 
   1) Thread[id=14, name=Log4j2-TF-1-AsyncLoggerConfig-1, state=TIMED_WAITING, group=TGRP-BufferStoreTest]
        at sun.misc.Unsafe.park(Native Method)
        at java.util.concurrent.locks.LockSupport.parkNanos(LockSupport.java:215)
        at java.util.concurrent.locks.AbstractQueuedSynchronizer$ConditionObject.awaitNanos(AbstractQueuedSynchronizer.java:2078)
        at com.lmax.disruptor.TimeoutBlockingWaitStrategy.waitFor(TimeoutBlockingWaitStrategy.java:38)
        at com.lmax.disruptor.ProcessingSequenceBarrier.waitFor(ProcessingSequenceBarrier.java:56)
        at com.lmax.disruptor.BatchEventProcessor.processEvents(BatchEventProcessor.java:159)
        at com.lmax.disruptor.BatchEventProcessor.run(BatchEventProcessor.java:125)
        at java.lang.Thread.run(Thread.java:748)
	at __randomizedtesting.SeedInfo.seed([3EF531368FC72D9F]:0)


FAILED:  junit.framework.TestSuite.org.apache.solr.store.blockcache.BufferStoreTest

Error Message:
There are still zombie threads that couldn't be terminated:    1) Thread[id=14, name=Log4j2-TF-1-AsyncLoggerConfig-1, state=TIMED_WAITING, group=TGRP-BufferStoreTest]         at sun.misc.Unsafe.park(Native Method)         at java.util.concurrent.locks.LockSupport.parkNanos(LockSupport.java:215)         at java.util.concurrent.locks.AbstractQueuedSynchronizer$ConditionObject.awaitNanos(AbstractQueuedSynchronizer.java:2078)         at com.lmax.disruptor.TimeoutBlockingWaitStrategy.waitFor(TimeoutBlockingWaitStrategy.java:38)         at com.lmax.disruptor.ProcessingSequenceBarrier.waitFor(ProcessingSequenceBarrier.java:56)         at com.lmax.disruptor.BatchEventProcessor.processEvents(BatchEventProcessor.java:159)         at com.lmax.disruptor.BatchEventProcessor.run(BatchEventProcessor.java:125)         at java.lang.Thread.run(Thread.java:748)

Stack Trace:
com.carrotsearch.randomizedtesting.ThreadLeakError: There are still zombie threads that couldn't be terminated:
   1) Thread[id=14, name=Log4j2-TF-1-AsyncLoggerConfig-1, state=TIMED_WAITING, group=TGRP-BufferStoreTest]
        at sun.misc.Unsafe.park(Native Method)
        at java.util.concurrent.locks.LockSupport.parkNanos(LockSupport.java:215)
        at java.util.concurrent.locks.AbstractQueuedSynchronizer$ConditionObject.awaitNanos(AbstractQueuedSynchronizer.java:2078)
        at com.lmax.disruptor.TimeoutBlockingWaitStrategy.waitFor(TimeoutBlockingWaitStrategy.java:38)
        at com.lmax.disruptor.ProcessingSequenceBarrier.waitFor(ProcessingSequenceBarrier.java:56)
        at com.lmax.disruptor.BatchEventProcessor.processEvents(BatchEventProcessor.java:159)
        at com.lmax.disruptor.BatchEventProcessor.run(BatchEventProcessor.java:125)
        at java.lang.Thread.run(Thread.java:748)
	at __randomizedtesting.SeedInfo.seed([3EF531368FC72D9F]:0)


FAILED:  junit.framework.TestSuite.org.apache.solr.store.blockcache.BufferStoreTest

Error Message:
1 thread leaked from SUITE scope at org.apache.solr.store.blockcache.BufferStoreTest:     1) Thread[id=14, name=Log4j2-TF-1-AsyncLoggerConfig-1, state=TIMED_WAITING, group=TGRP-BufferStoreTest]         at sun.misc.Unsafe.park(Native Method)         at java.util.concurrent.locks.LockSupport.parkNanos(LockSupport.java:215)         at java.util.concurrent.locks.AbstractQueuedSynchronizer$ConditionObject.awaitNanos(AbstractQueuedSynchronizer.java:2078)         at com.lmax.disruptor.TimeoutBlockingWaitStrategy.waitFor(TimeoutBlockingWaitStrategy.java:38)         at com.lmax.disruptor.ProcessingSequenceBarrier.waitFor(ProcessingSequenceBarrier.java:56)         at com.lmax.disruptor.BatchEventProcessor.processEvents(BatchEventProcessor.java:159)         at com.lmax.disruptor.BatchEventProcessor.run(BatchEventProcessor.java:125)         at java.lang.Thread.run(Thread.java:748)

Stack Trace:
com.carrotsearch.randomizedtesting.ThreadLeakError: 1 thread leaked from SUITE scope at org.apache.solr.store.blockcache.BufferStoreTest: 
   1) Thread[id=14, name=Log4j2-TF-1-AsyncLoggerConfig-1, state=TIMED_WAITING, group=TGRP-BufferStoreTest]
        at sun.misc.Unsafe.park(Native Method)
        at java.util.concurrent.locks.LockSupport.parkNanos(LockSupport.java:215)
        at java.util.concurrent.locks.AbstractQueuedSynchronizer$ConditionObject.awaitNanos(AbstractQueuedSynchronizer.java:2078)
        at com.lmax.disruptor.TimeoutBlockingWaitStrategy.waitFor(TimeoutBlockingWaitStrategy.java:38)
        at com.lmax.disruptor.ProcessingSequenceBarrier.waitFor(ProcessingSequenceBarrier.java:56)
        at com.lmax.disruptor.BatchEventProcessor.processEvents(BatchEventProcessor.java:159)
        at com.lmax.disruptor.BatchEventProcessor.run(BatchEventProcessor.java:125)
        at java.lang.Thread.run(Thread.java:748)
	at __randomizedtesting.SeedInfo.seed([3EF531368FC72D9F]:0)


FAILED:  junit.framework.TestSuite.org.apache.solr.store.blockcache.BufferStoreTest

Error Message:
There are still zombie threads that couldn't be terminated:    1) Thread[id=14, name=Log4j2-TF-1-AsyncLoggerConfig-1, state=TIMED_WAITING, group=TGRP-BufferStoreTest]         at sun.misc.Unsafe.park(Native Method)         at java.util.concurrent.locks.LockSupport.parkNanos(LockSupport.java:215)         at java.util.concurrent.locks.AbstractQueuedSynchronizer$ConditionObject.awaitNanos(AbstractQueuedSynchronizer.java:2078)         at com.lmax.disruptor.TimeoutBlockingWaitStrategy.waitFor(TimeoutBlockingWaitStrategy.java:38)         at com.lmax.disruptor.ProcessingSequenceBarrier.waitFor(ProcessingSequenceBarrier.java:56)         at com.lmax.disruptor.BatchEventProcessor.processEvents(BatchEventProcessor.java:159)         at com.lmax.disruptor.BatchEventProcessor.run(BatchEventProcessor.java:125)         at java.lang.Thread.run(Thread.java:748)

Stack Trace:
com.carrotsearch.randomizedtesting.ThreadLeakError: There are still zombie threads that couldn't be terminated:
   1) Thread[id=14, name=Log4j2-TF-1-AsyncLoggerConfig-1, state=TIMED_WAITING, group=TGRP-BufferStoreTest]
        at sun.misc.Unsafe.park(Native Method)
        at java.util.concurrent.locks.LockSupport.parkNanos(LockSupport.java:215)
        at java.util.concurrent.locks.AbstractQueuedSynchronizer$ConditionObject.awaitNanos(AbstractQueuedSynchronizer.java:2078)
        at com.lmax.disruptor.TimeoutBlockingWaitStrategy.waitFor(TimeoutBlockingWaitStrategy.java:38)
        at com.lmax.disruptor.ProcessingSequenceBarrier.waitFor(ProcessingSequenceBarrier.java:56)
        at com.lmax.disruptor.BatchEventProcessor.processEvents(BatchEventProcessor.java:159)
        at com.lmax.disruptor.BatchEventProcessor.run(BatchEventProcessor.java:125)
        at java.lang.Thread.run(Thread.java:748)
	at __randomizedtesting.SeedInfo.seed([3EF531368FC72D9F]:0)




Build Log:
[...truncated 12635 lines...]
   [junit4] Suite: org.apache.solr.store.blockcache.BufferStoreTest
   [junit4]   2> Feb 25, 2019 4:05:57 PM com.carrotsearch.randomizedtesting.ThreadLeakControl checkThreadLeaks
   [junit4]   2> WARNING: Will linger awaiting termination of 1 leaked thread(s).
   [junit4]   2> Feb 25, 2019 4:06:17 PM com.carrotsearch.randomizedtesting.ThreadLeakControl checkThreadLeaks
   [junit4]   2> SEVERE: 1 thread leaked from SUITE scope at org.apache.solr.store.blockcache.BufferStoreTest: 
   [junit4]   2>    1) Thread[id=14, name=Log4j2-TF-1-AsyncLoggerConfig-1, state=TIMED_WAITING, group=TGRP-BufferStoreTest]
   [junit4]   2>         at sun.misc.Unsafe.park(Native Method)
   [junit4]   2>         at java.util.concurrent.locks.LockSupport.parkNanos(LockSupport.java:215)
   [junit4]   2>         at java.util.concurrent.locks.AbstractQueuedSynchronizer$ConditionObject.awaitNanos(AbstractQueuedSynchronizer.java:2078)
   [junit4]   2>         at com.lmax.disruptor.TimeoutBlockingWaitStrategy.waitFor(TimeoutBlockingWaitStrategy.java:38)
   [junit4]   2>         at com.lmax.disruptor.ProcessingSequenceBarrier.waitFor(ProcessingSequenceBarrier.java:56)
   [junit4]   2>         at com.lmax.disruptor.BatchEventProcessor.processEvents(BatchEventProcessor.java:159)
   [junit4]   2>         at com.lmax.disruptor.BatchEventProcessor.run(BatchEventProcessor.java:125)
   [junit4]   2>         at java.lang.Thread.run(Thread.java:748)
   [junit4]   2> Feb 25, 2019 4:06:17 PM com.carrotsearch.randomizedtesting.ThreadLeakControl tryToInterruptAll
   [junit4]   2> INFO: Starting to interrupt leaked threads:
   [junit4]   2>    1) Thread[id=14, name=Log4j2-TF-1-AsyncLoggerConfig-1, state=TIMED_WAITING, group=TGRP-BufferStoreTest]
   [junit4]   2> AsyncLogger error handling event seq=0, value='null': java.lang.InterruptedException: null
   [junit4]   2> java.lang.InterruptedException
   [junit4]   2> 	at java.util.concurrent.locks.AbstractQueuedSynchronizer$ConditionObject.reportInterruptAfterWait(AbstractQueuedSynchronizer.java:2014)
   [junit4]   2> 	at java.util.concurrent.locks.AbstractQueuedSynchronizer$ConditionObject.awaitNanos(AbstractQueuedSynchronizer.java:2088)
   [junit4]   2> 	at com.lmax.disruptor.TimeoutBlockingWaitStrategy.waitFor(TimeoutBlockingWaitStrategy.java:38)
   [junit4]   2> 	at com.lmax.disruptor.ProcessingSequenceBarrier.waitFor(ProcessingSequenceBarrier.java:56)
   [junit4]   2> 	at com.lmax.disruptor.BatchEventProcessor.processEvents(BatchEventProcessor.java:159)
   [junit4]   2> 	at com.lmax.disruptor.BatchEventProcessor.run(BatchEventProcessor.java:125)
   [junit4]   2> 	at java.lang.Thread.run(Thread.java:748)
   [junit4]   2> AsyncLogger error handling event seq=1, value='null': java.lang.InterruptedException: null
   [junit4]   2> java.lang.InterruptedException
   [junit4]   2> 	at java.util.concurrent.locks.AbstractQueuedSynchronizer$ConditionObject.reportInterruptAfterWait(AbstractQueuedSynchronizer.java:2014)
   [junit4]   2> 	at java.util.concurrent.locks.AbstractQueuedSynchronizer$ConditionObject.awaitNanos(AbstractQueuedSynchronizer.java:2088)
   [junit4]   2> 	at com.lmax.disruptor.TimeoutBlockingWaitStrategy.waitFor(TimeoutBlockingWaitStrategy.java:38)
   [junit4]   2> 	at com.lmax.disruptor.ProcessingSequenceBarrier.waitFor(ProcessingSequenceBarrier.java:56)
   [junit4]   2> 	at com.lmax.disruptor.BatchEventProcessor.processEvents(BatchEventProcessor.java:159)
   [junit4]   2> 	at com.lmax.disruptor.BatchEventProcessor.run(BatchEventProcessor.java:125)
   [junit4]   2> 	at java.lang.Thread.run(Thread.java:748)
   [junit4]   2> AsyncLogger error handling event seq=2, value='null': java.lang.InterruptedException: null
   [junit4]   2> java.lang.InterruptedException
   [junit4]   2> 	at java.util.concurrent.locks.AbstractQueuedSynchronizer$ConditionObject.reportInterruptAfterWait(AbstractQueuedSynchronizer.java:2014)
   [junit4]   2> 	at java.util.concurrent.locks.AbstractQueuedSynchronizer$ConditionObject.awaitNanos(AbstractQueuedSynchronizer.java:2088)
   [junit4]   2> 	at com.lmax.disruptor.TimeoutBlockingWaitStrategy.waitFor(TimeoutBlockingWaitStrategy.java:38)
   [junit4]   2> 	at com.lmax.disruptor.ProcessingSequenceBarrier.waitFor(ProcessingSequenceBarrier.java:56)
   [junit4]   2> 	at com.lmax.disruptor.BatchEventProcessor.processEvents(BatchEventProcessor.java:159)
   [junit4]   2> 	at com.lmax.disruptor.BatchEventProcessor.run(BatchEventProcessor.java:125)
   [junit4]   2> 	at java.lang.Thread.run(Thread.java:748)
   [junit4]   2> AsyncLogger error handling event seq=3, value='null': java.lang.InterruptedException: null
   [junit4]   2> java.lang.InterruptedException
   [junit4]   2> 	at java.util.concurrent.locks.AbstractQueuedSynchronizer$ConditionObject.reportInterruptAfterWait(AbstractQueuedSynchronizer.java:2014)
   [junit4]   2> 	at java.util.concurrent.locks.AbstractQueuedSynchronizer$ConditionObject.awaitNanos(AbstractQueuedSynchronizer.java:2088)
   [junit4]   2> 	at com.lmax.disruptor.TimeoutBlockingWaitStrategy.waitFor(TimeoutBlockingWaitStrategy.java:38)
   [junit4]   2> 	at com.lmax.disruptor.ProcessingSequenceBarrier.waitFor(ProcessingSequenceBarrier.java:56)
   [junit4]   2> 	at com.lmax.disruptor.BatchEventProcessor.processEvents(BatchEventProcessor.java:159)
   [junit4]   2> 	at com.lmax.disruptor.BatchEventProcessor.run(BatchEventProcessor.java:125)
   [junit4]   2> 	at java.lang.Thread.run(Thread.java:748)
   [junit4]   2> AsyncLogger error handling event seq=4, value='null': java.lang.InterruptedException: null
   [junit4]   2> java.lang.InterruptedException
   [junit4]   2> 	at java.util.concurrent.locks.AbstractQueuedSynchronizer$ConditionObject.reportInterruptAfterWait(AbstractQueuedSynchronizer.java:2014)
   [junit4]   2> 	at java.util.concurrent.locks.AbstractQueuedSynchronizer$ConditionObject.awaitNanos(AbstractQueuedSynchronizer.java:2088)
   [junit4]   2> 	at com.lmax.disruptor.TimeoutBlockingWaitStrategy.waitFor(TimeoutBlockingWaitStrategy.java:38)
   [junit4]   2> 	at com.lmax.disruptor.ProcessingSequenceBarrier.waitFor(ProcessingSequenceBarrier.java:56)
   [junit4]   2> 	at com.lmax.disruptor.BatchEventProcessor.processEvents(BatchEventProcessor.java:159)
   [junit4]   2> 	at com.lmax.disruptor.BatchEventProcessor.run(BatchEventProcessor.java:125)
   [junit4]   2> 	at java.lang.Thread.run(Thread.java:748)
   [junit4]   2> Feb 25, 2019 4:06:19 PM com.carrotsearch.randomizedtesting.ThreadLeakControl tryToInterruptAll
   [junit4]   2> SEVERE: There are still zombie threads that couldn't be terminated:
   [junit4]   2>    1) Thread[id=14, name=Log4j2-TF-1-AsyncLoggerConfig-1, state=TIMED_WAITING, group=TGRP-BufferStoreTest]
   [junit4]   2>         at sun.misc.Unsafe.park(Native Method)
   [junit4]   2>         at java.util.concurrent.locks.LockSupport.parkNanos(LockSupport.java:215)
   [junit4]   2>         at java.util.concurrent.locks.AbstractQueuedSynchronizer$ConditionObject.awaitNanos(AbstractQueuedSynchronizer.java:2078)
   [junit4]   2>         at com.lmax.disruptor.TimeoutBlockingWaitStrategy.waitFor(TimeoutBlockingWaitStrategy.java:38)
   [junit4]   2>         at com.lmax.disruptor.ProcessingSequenceBarrier.waitFor(ProcessingSequenceBarrier.java:56)
   [junit4]   2>         at com.lmax.disruptor.BatchEventProcessor.processEvents(BatchEventProcessor.java:159)
   [junit4]   2>         at com.lmax.disruptor.BatchEventProcessor.run(BatchEventProcessor.java:125)
   [junit4]   2>         at java.lang.Thread.run(Thread.java:748)
   [junit4]   2> NOTE: test params are: codec=Asserting(Lucene80): {}, docValues:{}, maxPointsInLeafNode=1981, maxMBSortInHeap=5.024447609686821, sim=Asserting(org.apache.lucene.search.similarities.AssertingSimilarity@357e8834), locale=sr-Latn-BA, timezone=Africa/Bissau
   [junit4]   2> NOTE: Linux 4.18.0-15-generic amd64/Oracle Corporation 1.8.0_172 (64-bit)/cpus=8,threads=2,free=427917832,total=514850816
   [junit4]   2> NOTE: All tests run in this JVM: [BufferStoreTest]
   [junit4]   2> NOTE: reproduce with: ant test  -Dtestcase=BufferStoreTest -Dtests.seed=3EF531368FC72D9F -Dtests.multiplier=3 -Dtests.slow=true -Dtests.locale=sr-Latn-BA -Dtests.timezone=Africa/Bissau -Dtests.asserts=true -Dtests.file.encoding=ISO-8859-1
   [junit4] ERROR   0.00s J1 | BufferStoreTest (suite) <<<
   [junit4]    > Throwable #1: com.carrotsearch.randomizedtesting.ThreadLeakError: 1 thread leaked from SUITE scope at org.apache.solr.store.blockcache.BufferStoreTest: 
   [junit4]    >    1) Thread[id=14, name=Log4j2-TF-1-AsyncLoggerConfig-1, state=TIMED_WAITING, group=TGRP-BufferStoreTest]
   [junit4]    >         at sun.misc.Unsafe.park(Native Method)
   [junit4]    >         at java.util.concurrent.locks.LockSupport.parkNanos(LockSupport.java:215)
   [junit4]    >         at java.util.concurrent.locks.AbstractQueuedSynchronizer$ConditionObject.awaitNanos(AbstractQueuedSynchronizer.java:2078)
   [junit4]    >         at com.lmax.disruptor.TimeoutBlockingWaitStrategy.waitFor(TimeoutBlockingWaitStrategy.java:38)
   [junit4]    >         at com.lmax.disruptor.ProcessingSequenceBarrier.waitFor(ProcessingSequenceBarrier.java:56)
   [junit4]    >         at com.lmax.disruptor.BatchEventProcessor.processEvents(BatchEventProcessor.java:159)
   [junit4]    >         at com.lmax.disruptor.BatchEventProcessor.run(BatchEventProcessor.java:125)
   [junit4]    >         at java.lang.Thread.run(Thread.java:748)
   [junit4]    > 	at __randomizedtesting.SeedInfo.seed([3EF531368FC72D9F]:0)Throwable #2: com.carrotsearch.randomizedtesting.ThreadLeakError: There are still zombie threads that couldn't be terminated:
   [junit4]    >    1) Thread[id=14, name=Log4j2-TF-1-AsyncLoggerConfig-1, state=TIMED_WAITING, group=TGRP-BufferStoreTest]
   [junit4]    >         at sun.misc.Unsafe.park(Native Method)
   [junit4]    >         at java.util.concurrent.locks.LockSupport.parkNanos(LockSupport.java:215)
   [junit4]    >         at java.util.concurrent.locks.AbstractQueuedSynchronizer$ConditionObject.awaitNanos(AbstractQueuedSynchronizer.java:2078)
   [junit4]    >         at com.lmax.disruptor.TimeoutBlockingWaitStrategy.waitFor(TimeoutBlockingWaitStrategy.java:38)
   [junit4]    >         at com.lmax.disruptor.ProcessingSequenceBarrier.waitFor(ProcessingSequenceBarrier.java:56)
   [junit4]    >         at com.lmax.disruptor.BatchEventProcessor.processEvents(BatchEventProcessor.java:159)
   [junit4]    >         at com.lmax.disruptor.BatchEventProcessor.run(BatchEventProcessor.java:125)
   [junit4]    >         at java.lang.Thread.run(Thread.java:748)
   [junit4]    > 	at __randomizedtesting.SeedInfo.seed([3EF531368FC72D9F]:0)
   [junit4] Completed [8/844 (1!)] on J1 in 24.65s, 1 test, 2 errors <<< FAILURES!

[...truncated 51911 lines...]
[asciidoctor:convert] asciidoctor: ERROR: about-this-guide.adoc: line 1: invalid part, must have at least one section (e.g., chapter, appendix, etc.)
[asciidoctor:convert] asciidoctor: ERROR: solr-glossary.adoc: line 1: invalid part, must have at least one section (e.g., chapter, appendix, etc.)
     [java] Processed 2477 links (2023 relative) to 3301 anchors in 249 files
     [echo] Validated Links & Anchors via: /home/jenkins/workspace/Lucene-Solr-master-Linux/solr/build/solr-ref-guide/bare-bones-html/

-documentation-lint:
    [jtidy] Checking for broken html (such as invalid tags)...
   [delete] Deleting directory /home/jenkins/workspace/Lucene-Solr-master-Linux/lucene/build/jtidy_tmp
     [echo] Checking for broken links...
     [exec] 
     [exec] Crawl/parse...
     [exec] 
     [exec] Verify...
     [echo] Checking for malformed docs...

jar-checksums:

resolve:

ivy-availability-check:
[loadresource] Do not set property disallowed.ivy.jars.list as its length is 0.

-ivy-fail-disallowed-ivy-version:

ivy-fail:

ivy-configure:
[ivy:configure] :: loading settings :: file = /home/jenkins/workspace/Lucene-Solr-master-Linux/lucene/top-level-ivy-settings.xml

resolve:

ivy-availability-check:
[loadresource] Do not set property disallowed.ivy.jars.list as its length is 0.

-ivy-fail-disallowed-ivy-version:

ivy-fail:

ivy-configure:
[ivy:configure] :: loading settings :: file = /home/jenkins/workspace/Lucene-Solr-master-Linux/lucene/top-level-ivy-settings.xml

resolve:

resolve:

ivy-availability-check:
[loadresource] Do not set property disallowed.ivy.jars.list as its length is 0.

-ivy-fail-disallowed-ivy-version:

ivy-fail:

ivy-configure:
[ivy:configure] :: loading settings :: file = /home/jenkins/workspace/Lucene-Solr-master-Linux/lucene/top-level-ivy-settings.xml

resolve:

ivy-availability-check:
[loadresource] Do not set property disallowed.ivy.jars.list as its length is 0.

-ivy-fail-disallowed-ivy-version:

ivy-fail:

ivy-configure:
[ivy:configure] :: loading settings :: file = /home/jenkins/workspace/Lucene-Solr-master-Linux/lucene/top-level-ivy-settings.xml

resolve:

ivy-availability-check:
[loadresource] Do not set property disallowed.ivy.jars.list as its length is 0.

-ivy-fail-disallowed-ivy-version:

ivy-fail:

ivy-configure:
[ivy:configure] :: loading settings :: file = /home/jenkins/workspace/Lucene-Solr-master-Linux/lucene/top-level-ivy-settings.xml

resolve:

ivy-availability-check:
[loadresource] Do not set property disallowed.ivy.jars.list as its length is 0.

-ivy-fail-disallowed-ivy-version:

ivy-fail:

ivy-configure:
[ivy:configure] :: loading settings :: file = /home/jenkins/workspace/Lucene-Solr-master-Linux/lucene/top-level-ivy-settings.xml

resolve:

ivy-availability-check:
[loadresource] Do not set property disallowed.ivy.jars.list as its length is 0.

-ivy-fail-disallowed-ivy-version:

ivy-fail:

ivy-configure:
[ivy:configure] :: loading settings :: file = /home/jenkins/workspace/Lucene-Solr-master-Linux/lucene/top-level-ivy-settings.xml

resolve:

ivy-availability-check:
[loadresource] Do not set property disallowed.ivy.jars.list as its length is 0.

-ivy-fail-disallowed-ivy-version:

ivy-fail:

ivy-configure:
[ivy:configure] :: loading settings :: file = /home/jenkins/workspace/Lucene-Solr-master-Linux/lucene/top-level-ivy-settings.xml

resolve:

ivy-availability-check:
[loadresource] Do not set property disallowed.ivy.jars.list as its length is 0.

-ivy-fail-disallowed-ivy-version:

ivy-fail:

ivy-configure:
[ivy:configure] :: loading settings :: file = /home/jenkins/workspace/Lucene-Solr-master-Linux/lucene/top-level-ivy-settings.xml

resolve:

ivy-availability-check:
[loadresource] Do not set property disallowed.ivy.jars.list as its length is 0.

-ivy-fail-disallowed-ivy-version:

ivy-fail:

ivy-configure:
[ivy:configure] :: loading settings :: file = /home/jenkins/workspace/Lucene-Solr-master-Linux/lucene/top-level-ivy-settings.xml

resolve:

ivy-availability-check:
[loadresource] Do not set property disallowed.ivy.jars.list as its length is 0.

-ivy-fail-disallowed-ivy-version:

ivy-fail:

ivy-configure:
[ivy:configure] :: loading settings :: file = /home/jenkins/workspace/Lucene-Solr-master-Linux/lucene/top-level-ivy-settings.xml

resolve:

ivy-availability-check:
[loadresource] Do not set property disallowed.ivy.jars.list as its length is 0.

-ivy-fail-disallowed-ivy-version:

ivy-fail:

ivy-configure:
[ivy:configure] :: loading settings :: file = /home/jenkins/workspace/Lucene-Solr-master-Linux/lucene/top-level-ivy-settings.xml

resolve:

ivy-availability-check:
[loadresource] Do not set property disallowed.ivy.jars.list as its length is 0.

-ivy-fail-disallowed-ivy-version:

ivy-fail:

ivy-configure:
[ivy:configure] :: loading settings :: file = /home/jenkins/workspace/Lucene-Solr-master-Linux/lucene/top-level-ivy-settings.xml

resolve:

ivy-availability-check:
[loadresource] Do not set property disallowed.ivy.jars.list as its length is 0.

-ivy-fail-disallowed-ivy-version:

ivy-fail:

ivy-configure:
[ivy:configure] :: loading settings :: file = /home/jenkins/workspace/Lucene-Solr-master-Linux/lucene/top-level-ivy-settings.xml

resolve:

ivy-availability-check:
[loadresource] Do not set property disallowed.ivy.jars.list as its length is 0.

-ivy-fail-disallowed-ivy-version:

ivy-fail:

ivy-configure:
[ivy:configure] :: loading settings :: file = /home/jenkins/workspace/Lucene-Solr-master-Linux/lucene/top-level-ivy-settings.xml

resolve:

ivy-availability-check:
[loadresource] Do not set property disallowed.ivy.jars.list as its length is 0.

-ivy-fail-disallowed-ivy-version:

ivy-fail:

ivy-configure:
[ivy:configure] :: loading settings :: file = /home/jenkins/workspace/Lucene-Solr-master-Linux/lucene/top-level-ivy-settings.xml

resolve:

ivy-availability-check:
[loadresource] Do not set property disallowed.ivy.jars.list as its length is 0.

-ivy-fail-disallowed-ivy-version:

ivy-fail:

ivy-configure:
[ivy:configure] :: loading settings :: file = /home/jenkins/workspace/Lucene-Solr-master-Linux/lucene/top-level-ivy-settings.xml

resolve:

ivy-availability-check:
[loadresource] Do not set property disallowed.ivy.jars.list as its length is 0.

-ivy-fail-disallowed-ivy-version:

ivy-fail:

ivy-configure:
[ivy:configure] :: loading settings :: file = /home/jenkins/workspace/Lucene-Solr-master-Linux/lucene/top-level-ivy-settings.xml

resolve:

ivy-availability-check:
[loadresource] Do not set property disallowed.ivy.jars.list as its length is 0.

-ivy-fail-disallowed-ivy-version:

ivy-fail:

ivy-configure:
[ivy:configure] :: loading settings :: file = /home/jenkins/workspace/Lucene-Solr-master-Linux/lucene/top-level-ivy-settings.xml

resolve:

ivy-availability-check:
[loadresource] Do not set property disallowed.ivy.jars.list as its length is 0.

-ivy-fail-disallowed-ivy-version:

ivy-fail:

ivy-configure:
[ivy:configure] :: loading settings :: file = /home/jenkins/workspace/Lucene-Solr-master-Linux/lucene/top-level-ivy-settings.xml

resolve:

ivy-availability-check:
[loadresource] Do not set property disallowed.ivy.jars.list as its length is 0.

-ivy-fail-disallowed-ivy-version:

ivy-fail:

ivy-configure:
[ivy:configure] :: loading settings :: file = /home/jenkins/workspace/Lucene-Solr-master-Linux/lucene/top-level-ivy-settings.xml

resolve:

ivy-availability-check:
[loadresource] Do not set property disallowed.ivy.jars.list as its length is 0.

-ivy-fail-disallowed-ivy-version:

ivy-fail:

ivy-configure:
[ivy:configure] :: loading settings :: file = /home/jenkins/workspace/Lucene-Solr-master-Linux/lucene/top-level-ivy-settings.xml

resolve:

ivy-availability-check:
[loadresource] Do not set property disallowed.ivy.jars.list as its length is 0.

-ivy-fail-disallowed-ivy-version:

ivy-fail:

ivy-configure:
[ivy:configure] :: loading settings :: file = /home/jenkins/workspace/Lucene-Solr-master-Linux/lucene/top-level-ivy-settings.xml

resolve:

ivy-availability-check:
[loadresource] Do not set property disallowed.ivy.jars.list as its length is 0.

-ivy-fail-disallowed-ivy-version:

ivy-fail:

ivy-configure:
[ivy:configure] :: loading settings :: file = /home/jenkins/workspace/Lucene-Solr-master-Linux/lucene/top-level-ivy-settings.xml

resolve:

ivy-availability-check:
[loadresource] Do not set property disallowed.ivy.jars.list as its length is 0.

-ivy-fail-disallowed-ivy-version:

ivy-fail:

ivy-configure:
[ivy:configure] :: loading settings :: file = /home/jenkins/workspace/Lucene-Solr-master-Linux/lucene/top-level-ivy-settings.xml

resolve:

ivy-availability-check:
[loadresource] Do not set property disallowed.ivy.jars.list as its length is 0.

-ivy-fail-disallowed-ivy-version:

ivy-fail:

ivy-configure:
[ivy:configure] :: loading settings :: file = /home/jenkins/workspace/Lucene-Solr-master-Linux/lucene/top-level-ivy-settings.xml

common.resolve:

resolve:

ivy-availability-check:
[loadresource] Do not set property disallowed.ivy.jars.list as its length is 0.

-ivy-fail-disallowed-ivy-version:

ivy-fail:

ivy-configure:
[ivy:configure] :: loading settings :: file = /home/jenkins/workspace/Lucene-Solr-master-Linux/lucene/top-level-ivy-settings.xml

resolve:

ivy-availability-check:
[loadresource] Do not set property disallowed.ivy.jars.list as its length is 0.

-ivy-fail-disallowed-ivy-version:

ivy-fail:

ivy-configure:
[ivy:configure] :: loading settings :: file = /home/jenkins/workspace/Lucene-Solr-master-Linux/lucene/top-level-ivy-settings.xml

resolve:

ivy-availability-check:
[loadresource] Do not set property disallowed.ivy.jars.list as its length is 0.

-ivy-fail-disallowed-ivy-version:

ivy-fail:

ivy-configure:
[ivy:configure] :: loading settings :: file = /home/jenkins/workspace/Lucene-Solr-master-Linux/lucene/top-level-ivy-settings.xml

resolve:

ivy-availability-check:
[loadresource] Do not set property disallowed.ivy.jars.list as its length is 0.

-ivy-fail-disallowed-ivy-version:

ivy-fail:

ivy-configure:
[ivy:configure] :: loading settings :: file = /home/jenkins/workspace/Lucene-Solr-master-Linux/lucene/top-level-ivy-settings.xml

resolve:

ivy-availability-check:
[loadresource] Do not set property disallowed.ivy.jars.list as its length is 0.

-ivy-fail-disallowed-ivy-version:

ivy-fail:

ivy-configure:
[ivy:configure] :: loading settings :: file = /home/jenkins/workspace/Lucene-Solr-master-Linux/lucene/top-level-ivy-settings.xml

resolve:

jar-checksums:
    [mkdir] Created dir: /home/jenkins/workspace/Lucene-Solr-master-Linux/lucene/null914797042
     [copy] Copying 36 files to /home/jenkins/workspace/Lucene-Solr-master-Linux/lucene/null914797042
   [delete] Deleting directory /home/jenkins/workspace/Lucene-Solr-master-Linux/lucene/null914797042

resolve-example:

ivy-availability-check:
[loadresource] Do not set property disallowed.ivy.jars.list as its length is 0.

-ivy-fail-disallowed-ivy-version:

ivy-fail:

ivy-configure:
[ivy:configure] :: loading settings :: file = /home/jenkins/workspace/Lucene-Solr-master-Linux/lucene/top-level-ivy-settings.xml

resolve:

resolve-server:

ivy-availability-check:
[loadresource] Do not set property disallowed.ivy.jars.list as its length is 0.

-ivy-fail-disallowed-ivy-version:

ivy-fail:

ivy-fail:

ivy-configure:
[ivy:configure] :: loading settings :: file = /home/jenkins/workspace/Lucene-Solr-master-Linux/lucene/top-level-ivy-settings.xml

resolve:

resolve:

ivy-availability-check:
[loadresource] Do not set property disallowed.ivy.jars.list as its length is 0.

-ivy-fail-disallowed-ivy-version:

ivy-fail:

ivy-fail:

ivy-configure:
[ivy:configure] :: loading settings :: file = /home/jenkins/workspace/Lucene-Solr-master-Linux/lucene/top-level-ivy-settings.xml

resolve:

ivy-availability-check:
[loadresource] Do not set property disallowed.ivy.jars.list as its length is 0.

-ivy-fail-disallowed-ivy-version:

ivy-fail:

ivy-fail:

ivy-configure:
[ivy:configure] :: loading settings :: file = /home/jenkins/workspace/Lucene-Solr-master-Linux/lucene/top-level-ivy-settings.xml

resolve:

ivy-availability-check:
[loadresource] Do not set property disallowed.ivy.jars.list as its length is 0.

-ivy-fail-disallowed-ivy-version:

ivy-fail:

ivy-configure:
[ivy:configure] :: loading settings :: file = /home/jenkins/workspace/Lucene-Solr-master-Linux/lucene/top-level-ivy-settings.xml

resolve:

ivy-availability-check:
[loadresource] Do not set property disallowed.ivy.jars.list as its length is 0.

-ivy-fail-disallowed-ivy-version:

ivy-fail:

ivy-fail:

ivy-configure:
[ivy:configure] :: loading settings :: file = /home/jenkins/workspace/Lucene-Solr-master-Linux/lucene/top-level-ivy-settings.xml

resolve:

ivy-availability-check:
[loadresource] Do not set property disallowed.ivy.jars.list as its length is 0.

-ivy-fail-disallowed-ivy-version:

ivy-fail:

ivy-configure:
[ivy:configure] :: loading settings :: file = /home/jenkins/workspace/Lucene-Solr-master-Linux/lucene/top-level-ivy-settings.xml

resolve:

ivy-availability-check:
[loadresource] Do not set property disallowed.ivy.jars.list as its length is 0.

-ivy-fail-disallowed-ivy-version:

ivy-fail:

ivy-fail:

ivy-configure:
[ivy:configure] :: loading settings :: file = /home/jenkins/workspace/Lucene-Solr-master-Linux/lucene/top-level-ivy-settings.xml

resolve:

ivy-availability-check:
[loadresource] Do not set property disallowed.ivy.jars.list as its length is 0.

-ivy-fail-disallowed-ivy-version:

ivy-fail:

ivy-fail:

ivy-configure:
[ivy:configure] :: loading settings :: file = /home/jenkins/workspace/Lucene-Solr-master-Linux/lucene/top-level-ivy-settings.xml

resolve:

ivy-availability-check:
[loadresource] Do not set property disallowed.ivy.jars.list as its length is 0.

-ivy-fail-disallowed-ivy-version:

ivy-fail:

ivy-fail:

ivy-configure:
[ivy:configure] :: loading settings :: file = /home/jenkins/workspace/Lucene-Solr-master-Linux/lucene/top-level-ivy-settings.xml

resolve:

ivy-availability-check:
[loadresource] Do not set property disallowed.ivy.jars.list as its length is 0.

-ivy-fail-disallowed-ivy-version:

ivy-fail:

ivy-fail:

ivy-configure:
[ivy:configure] :: loading settings :: file = /home/jenkins/workspace/Lucene-Solr-master-Linux/lucene/top-level-ivy-settings.xml

resolve:

ivy-availability-check:
[loadresource] Do not set property disallowed.ivy.jars.list as its length is 0.

-ivy-fail-disallowed-ivy-version:

ivy-fail:

ivy-fail:

ivy-configure:
[ivy:configure] :: loading settings :: file = /home/jenkins/workspace/Lucene-Solr-master-Linux/lucene/top-level-ivy-settings.xml

resolve:

ivy-availability-check:
[loadresource] Do not set property disallowed.ivy.jars.list as its length is 0.

-ivy-fail-disallowed-ivy-version:

ivy-fail:

ivy-fail:

ivy-configure:
[ivy:configure] :: loading settings :: file = /home/jenkins/workspace/Lucene-Solr-master-Linux/lucene/top-level-ivy-settings.xml

resolve:

ivy-availability-check:
[loadresource] Do not set property disallowed.ivy.jars.list as its length is 0.

-ivy-fail-disallowed-ivy-version:

ivy-fail:

ivy-fail:

ivy-configure:
[ivy:configure] :: loading settings :: file = /home/jenkins/workspace/Lucene-Solr-master-Linux/lucene/top-level-ivy-settings.xml

resolve:

ivy-availability-check:
[loadresource] Do not set property disallowed.ivy.jars.list as its length is 0.

-ivy-fail-disallowed-ivy-version:

ivy-fail:

ivy-fail:

ivy-configure:
[ivy:configure] :: loading settings :: file = /home/jenkins/workspace/Lucene-Solr-master-Linux/lucene/top-level-ivy-settings.xml

resolve:

ivy-availability-check:
[loadresource] Do not set property disallowed.ivy.jars.list as its length is 0.

-ivy-fail-disallowed-ivy-version:

ivy-fail:

ivy-fail:

ivy-configure:
[ivy:configure] :: loading settings :: file = /home/jenkins/workspace/Lucene-Solr-master-Linux/lucene/top-level-ivy-settings.xml

resolve:

ivy-availability-check:
[loadresource] Do not set property disallowed.ivy.jars.list as its length is 0.

-ivy-fail-disallowed-ivy-version:

ivy-fail:

ivy-fail:

ivy-configure:
[ivy:configure] :: loading settings :: file = /home/jenkins/workspace/Lucene-Solr-master-Linux/lucene/top-level-ivy-settings.xml

resolve:

jar-checksums:
    [mkdir] Created dir: /home/jenkins/workspace/Lucene-Solr-master-Linux/solr/null185953816
     [copy] Copying 239 files to /home/jenkins/workspace/Lucene-Solr-master-Linux/solr/null185953816
   [delete] Deleting directory /home/jenkins/workspace/Lucene-Solr-master-Linux/solr/null185953816

check-working-copy:
[ivy:cachepath] :: resolving dependencies :: org.eclipse.jgit#org.eclipse.jgit-caller;working
[ivy:cachepath] 	confs: [default]
[ivy:cachepath] 	found org.eclipse.jgit#org.eclipse.jgit;4.6.0.201612231935-r in public
[ivy:cachepath] 	found com.jcraft#jsch;0.1.53 in public
[ivy:cachepath] 	found com.googlecode.javaewah#JavaEWAH;1.1.6 in public
[ivy:cachepath] 	found org.apache.httpcomponents#httpclient;4.3.6 in public
[ivy:cachepath] 	found org.apache.httpcomponents#httpcore;4.3.3 in public
[ivy:cachepath] 	found commons-logging#commons-logging;1.1.3 in public
[ivy:cachepath] 	found commons-codec#commons-codec;1.6 in public
[ivy:cachepath] 	found org.slf4j#slf4j-api;1.7.2 in public
[ivy:cachepath] :: resolution report :: resolve 23ms :: artifacts dl 1ms
	---------------------------------------------------------------------
	|                  |            modules            ||   artifacts   |
	|       conf       | number| search|dwnlded|evicted|| number|dwnlded|
	---------------------------------------------------------------------
	|      default     |   8   |   0   |   0   |   0   ||   8   |   0   |
	---------------------------------------------------------------------
[wc-checker] Initializing working copy...
[wc-checker] SLF4J: Failed to load class "org.slf4j.impl.StaticLoggerBinder".
[wc-checker] SLF4J: Defaulting to no-operation (NOP) logger implementation
[wc-checker] SLF4J: See http://www.slf4j.org/codes.html#StaticLoggerBinder for further details.
[wc-checker] Checking working copy status...

-jenkins-base:

BUILD SUCCESSFUL
Total time: 70 minutes 51 seconds
Setting ANT_1_8_2_HOME=/home/jenkins/tools/hudson.tasks.Ant_AntInstallation/ANT_1.8.2
[Lucene-Solr-master-Linux] $ /bin/sh -xe /tmp/jenkins4579380517787895115.sh
+ mv lucene/build lucene/build.orig
+ mv solr/build solr/build.orig
+ export ANT_HOME=/home/jenkins/tools/hudson.tasks.Ant_AntInstallation/ANT_1.8.2
+ export PATH=/home/jenkins/tools/hudson.tasks.Ant_AntInstallation/ANT_1.8.2/bin:/home/jenkins/tools/java/64bit/jdk1.8.0_172/bin:/usr/local/bin:/usr/bin:/bin:/usr/local/games:/usr/games
+ python3 -u dev-tools/scripts/reproduceJenkinsFailures.py --no-git https://jenkins.thetaphi.de/job/Lucene-Solr-master-Linux/23720/consoleText
[repro] Jenkins log URL: https://jenkins.thetaphi.de/job/Lucene-Solr-master-Linux/23720/consoleText

[repro] Revision: 8c34da8a626634eac07841795b72c8e225de3b04

[repro] Ant options: "-Dargs=-XX:+UseCompressedOops -XX:+UseParallelGC"
[repro] Repro line:  ant test  -Dtestcase=BufferStoreTest -Dtests.seed=3EF531368FC72D9F -Dtests.multiplier=3 -Dtests.slow=true -Dtests.locale=sr-Latn-BA -Dtests.timezone=Africa/Bissau -Dtests.asserts=true -Dtests.file.encoding=ISO-8859-1

[repro] ant clean
Buildfile: /home/jenkins/workspace/Lucene-Solr-master-Linux/build.xml

clean:

clean:

clean:

BUILD SUCCESSFUL
Total time: 0 seconds
[repro] Test suites by module:
[repro]    solr/core
[repro]       BufferStoreTest
[repro] ant compile-test
Buildfile: /home/jenkins/workspace/Lucene-Solr-master-Linux/solr/core/build.xml

check-analyzers-icu-uptodate:

jar-analyzers-icu:

-mrjar-classes-uptodate:

ivy-availability-check:
[loadresource] Do not set property disallowed.ivy.jars.list as its length is 0.

-ivy-fail-disallowed-ivy-version:

ivy-fail:

ivy-configure:
[ivy:configure] :: Apache Ivy 2.4.0 - 20141213170938 :: http://ant.apache.org/ivy/ ::
[ivy:configure] :: loading settings :: file = /home/jenkins/workspace/Lucene-Solr-master-Linux/lucene/top-level-ivy-settings.xml

resolve-groovy:
[ivy:cachepath] :: resolving dependencies :: org.codehaus.groovy#groovy-all-caller;working
[ivy:cachepath] 	confs: [default]
[ivy:cachepath] 	found org.codehaus.groovy#groovy-all;2.4.15 in public
[ivy:cachepath] :: resolution report :: resolve 99ms :: artifacts dl 2ms
	---------------------------------------------------------------------
	|                  |            modules            ||   artifacts   |
	|       conf       | number| search|dwnlded|evicted|| number|dwnlded|
	---------------------------------------------------------------------
	|      default     |   1   |   0   |   0   |   0   ||   1   |   0   |
	---------------------------------------------------------------------

check-analyzers-common-uptodate:

jar-analyzers-common:

-mrjar-classes-uptodate:

ivy-availability-check:
[loadresource] Do not set property disallowed.ivy.jars.list as its length is 0.

-ivy-fail-disallowed-ivy-version:

ivy-fail:

ivy-configure:
[ivy:configure] :: loading settings :: file = /home/jenkins/workspace/Lucene-Solr-master-Linux/lucene/top-level-ivy-settings.xml

resolve-groovy:

-check-git-state:

-git-cleanroot:

-copy-git-state:
     [copy] Copying 1 file to /home/jenkins/workspace/Lucene-Solr-master-Linux/lucene/build

git-autoclean:

resolve:

common.init:

compile-lucene-core:

-check-git-state:

-git-cleanroot:

-copy-git-state:

git-autoclean:

ivy-availability-check:
[loadresource] Do not set property disallowed.ivy.jars.list as its length is 0.

-ivy-fail-disallowed-ivy-version:

ivy-fail:

ivy-configure:
[ivy:configure] :: loading settings :: file = /home/jenkins/workspace/Lucene-Solr-master-Linux/lucene/top-level-ivy-settings.xml

resolve:

init:

-clover.disable:

-clover.load:

-clover.classpath:

-clover.setup:

clover:

compile-core:
    [mkdir] Created dir: /home/jenkins/workspace/Lucene-Solr-master-Linux/lucene/build/core/classes/java
    [javac] Compiling 862 source files to /home/jenkins/workspace/Lucene-Solr-master-Linux/lucene/build/core/classes/java
    [javac] Creating empty /home/jenkins/workspace/Lucene-Solr-master-Linux/lucene/build/core/classes/java/org/apache/lucene/util/graph/package-info.class
    [javac] Creating empty /home/jenkins/workspace/Lucene-Solr-master-Linux/lucene/build/core/classes/java/org/apache/lucene/document/package-info.class
    [javac] Creating empty /home/jenkins/workspace/Lucene-Solr-master-Linux/lucene/build/core/classes/java/org/apache/lucene/package-info.class
    [javac] Creating empty /home/jenkins/workspace/Lucene-Solr-master-Linux/lucene/build/core/classes/java/org/apache/lucene/util/bkd/package-info.class
    [javac] Creating empty /home/jenkins/workspace/Lucene-Solr-master-Linux/lucene/build/core/classes/java/org/apache/lucene/codecs/compressing/package-info.class
    [javac] Creating empty /home/jenkins/workspace/Lucene-Solr-master-Linux/lucene/build/core/classes/java/org/apache/lucene/codecs/lucene60/package-info.class
    [javac] Creating empty /home/jenkins/workspace/Lucene-Solr-master-Linux/lucene/build/core/classes/java/org/apache/lucene/codecs/package-info.class
    [javac] Creating empty /home/jenkins/workspace/Lucene-Solr-master-Linux/lucene/build/core/classes/java/org/apache/lucene/codecs/lucene80/package-info.class
    [javac] Creating empty /home/jenkins/workspace/Lucene-Solr-master-Linux/lucene/build/core/classes/java/org/apache/lucene/util/package-info.class
    [javac] Creating empty /home/jenkins/workspace/Lucene-Solr-master-Linux/lucene/build/core/classes/java/org/apache/lucene/index/package-info.class
    [javac] Creating empty /home/jenkins/workspace/Lucene-Solr-master-Linux/lucene/build/core/classes/java/org/apache/lucene/util/fst/package-info.class
    [javac] Creating empty /home/jenkins/workspace/Lucene-Solr-master-Linux/lucene/build/core/classes/java/org/apache/lucene/analysis/tokenattributes/package-info.class
    [javac] Creating empty /home/jenkins/workspace/Lucene-Solr-master-Linux/lucene/build/core/classes/java/org/apache/lucene/search/package-info.class
    [javac] Creating empty /home/jenkins/workspace/Lucene-Solr-master-Linux/lucene/build/core/classes/java/org/apache/lucene/util/packed/package-info.class
    [javac] Creating empty /home/jenkins/workspace/Lucene-Solr-master-Linux/lucene/build/core/classes/java/org/apache/lucene/util/mutable/package-info.class
    [javac] Creating empty /home/jenkins/workspace/Lucene-Solr-master-Linux/lucene/build/core/classes/java/org/apache/lucene/codecs/lucene70/package-info.class
    [javac] Creating empty /home/jenkins/workspace/Lucene-Solr-master-Linux/lucene/build/core/classes/java/org/apache/lucene/codecs/perfield/package-info.class
    [javac] Creating empty /home/jenkins/workspace/Lucene-Solr-master-Linux/lucene/build/core/classes/java/org/apache/lucene/analysis/package-info.class
    [javac] Creating empty /home/jenkins/workspace/Lucene-Solr-master-Linux/lucene/build/core/classes/java/org/apache/lucene/analysis/standard/package-info.class
    [javac] Creating empty /home/jenkins/workspace/Lucene-Solr-master-Linux/lucene/build/core/classes/java/org/apache/lucene/store/package-info.class
    [javac] Creating empty /home/jenkins/workspace/Lucene-Solr-master-Linux/lucene/build/core/classes/java/org/apache/lucene/codecs/blocktree/package-info.class
    [javac] Creating empty /home/jenkins/workspace/Lucene-Solr-master-Linux/lucene/build/core/classes/java/org/apache/lucene/search/spans/package-info.class
    [javac] Creating empty /home/jenkins/workspace/Lucene-Solr-master-Linux/lucene/build/core/classes/java/org/apache/lucene/search/similarities/package-info.class
    [javac] Creating empty /home/jenkins/workspace/Lucene-Solr-master-Linux/lucene/build/core/classes/java/org/apache/lucene/util/automaton/package-info.class
    [javac] Creating empty /home/jenkins/workspace/Lucene-Solr-master-Linux/lucene/build/core/classes/java/org/apache/lucene/codecs/lucene50/package-info.class
    [javac] Creating empty /home/jenkins/workspace/Lucene-Solr-master-Linux/lucene/build/core/classes/java/org/apache/lucene/geo/package-info.class
     [copy] Copying 3 files to /home/jenkins/workspace/Lucene-Solr-master-Linux/lucene/build/core/classes/java

init:

-clover.disable:

-clover.load:

-clover.classpath:

-clover.setup:

clover:

compile-core:
    [mkdir] Created dir: /home/jenkins/workspace/Lucene-Solr-master-Linux/lucene/build/analysis/common/classes/java
    [javac] Compiling 472 source files to /home/jenkins/workspace/Lucene-Solr-master-Linux/lucene/build/analysis/common/classes/java
    [javac] Note: Some input files use or override a deprecated API.
    [javac] Note: Recompile with -Xlint:deprecation for details.
    [javac] Creating empty /home/jenkins/workspace/Lucene-Solr-master-Linux/lucene/build/analysis/common/classes/java/org/apache/lucene/analysis/hunspell/package-info.class
    [javac] Creating empty /home/jenkins/workspace/Lucene-Solr-master-Linux/lucene/build/analysis/common/classes/java/org/apache/lucene/analysis/minhash/package-info.class
    [javac] Creating empty /home/jenkins/workspace/Lucene-Solr-master-Linux/lucene/build/analysis/common/classes/java/org/apache/lucene/analysis/ga/package-info.class
    [javac] Creating empty /home/jenkins/workspace/Lucene-Solr-master-Linux/lucene/build/analysis/common/classes/java/org/apache/lucene/analysis/ca/package-info.class
    [javac] Creating empty /home/jenkins/workspace/Lucene-Solr-master-Linux/lucene/build/analysis/common/classes/java/org/apache/lucene/analysis/custom/package-info.class
    [javac] Creating empty /home/jenkins/workspace/Lucene-Solr-master-Linux/lucene/build/analysis/common/classes/java/org/apache/lucene/analysis/sr/package-info.class
    [javac] Creating empty /home/jenkins/workspace/Lucene-Solr-master-Linux/lucene/build/analysis/common/classes/java/org/apache/lucene/collation/package-info.class
    [javac] Creating empty /home/jenkins/workspace/Lucene-Solr-master-Linux/lucene/build/analysis/common/classes/java/org/apache/lucene/analysis/sv/package-info.class
    [javac] Creating empty /home/jenkins/workspace/Lucene-Solr-master-Linux/lucene/build/analysis/common/classes/java/org/apache/lucene/analysis/bg/package-info.class
    [javac] Creating empty /home/jenkins/workspace/Lucene-Solr-master-Linux/lucene/build/analysis/common/classes/java/org/apache/lucene/analysis/payloads/package-info.class
    [javac] Creating empty /home/jenkins/workspace/Lucene-Solr-master-Linux/lucene/build/analysis/common/classes/java/org/apache/lucene/analysis/ngram/package-info.class
    [javac] Creating empty /home/jenkins/workspace/Lucene-Solr-master-Linux/lucene/build/analysis/common/classes/java/org/apache/lucene/analysis/core/package-info.class
    [javac] Creating empty /home/jenkins/workspace/Lucene-Solr-master-Linux/lucene/build/analysis/common/classes/java/org/apache/lucene/analysis/bn/package-info.class
    [javac] Creating empty /home/jenkins/workspace/Lucene-Solr-master-Linux/lucene/build/analysis/common/classes/java/org/apache/lucene/analysis/fr/package-info.class
    [javac] Creating empty /home/jenkins/workspace/Lucene-Solr-master-Linux/lucene/build/analysis/common/classes/java/org/tartarus/snowball/ext/package-info.class
    [javac] Creating empty /home/jenkins/workspace/Lucene-Solr-master-Linux/lucene/build/analysis/common/classes/java/org/apache/lucene/analysis/br/package-info.class
    [javac] Creating empty /home/jenkins/workspace/Lucene-Solr-master-Linux/lucene/build/analysis/common/classes/java/org/apache/lucene/analysis/miscellaneous/package-info.class
    [javac] Creating empty /home/jenkins/workspace/Lucene-Solr-master-Linux/lucene/build/analysis/common/classes/java/org/apache/lucene/analysis/sinks/package-info.class
    [javac] Creating empty /home/jenkins/workspace/Lucene-Solr-master-Linux/lucene/build/analysis/common/classes/java/org/apache/lucene/analysis/cjk/package-info.class
    [javac] Creating empty /home/jenkins/workspace/Lucene-Solr-master-Linux/lucene/build/analysis/common/classes/java/org/apache/lucene/analysis/synonym/package-info.class
    [javac] Creating empty /home/jenkins/workspace/Lucene-Solr-master-Linux/lucene/build/analysis/common/classes/java/org/apache/lucene/analysis/wikipedia/package-info.class
    [javac] Creating empty /home/jenkins/workspace/Lucene-Solr-master-Linux/lucene/build/analysis/common/classes/java/org/apache/lucene/analysis/fa/package-info.class
    [javac] Creating empty /home/jenkins/workspace/Lucene-Solr-master-Linux/lucene/build/analysis/common/classes/java/org/apache/lucene/analysis/reverse/package-info.class
    [javac] Creating empty /home/jenkins/workspace/Lucene-Solr-master-Linux/lucene/build/analysis/common/classes/java/org/apache/lucene/analysis/nl/package-info.class
    [javac] Creating empty /home/jenkins/workspace/Lucene-Solr-master-Linux/lucene/build/analysis/common/classes/java/org/apache/lucene/analysis/ro/package-info.class
    [javac] Creating empty /home/jenkins/workspace/Lucene-Solr-master-Linux/lucene/build/analysis/common/classes/java/org/apache/lucene/analysis/fi/package-info.class
    [javac] Creating empty /home/jenkins/workspace/Lucene-Solr-master-Linux/lucene/build/analysis/common/classes/java/org/apache/lucene/analysis/ru/package-info.class
    [javac] Creating empty /home/jenkins/workspace/Lucene-Solr-master-Linux/lucene/build/analysis/common/classes/java/org/apache/lucene/analysis/no/package-info.class
    [javac] Creating empty /home/jenkins/workspace/Lucene-Solr-master-Linux/lucene/build/analysis/common/classes/java/org/apache/lucene/analysis/el/package-info.class
    [javac] Creating empty /home/jenkins/workspace/Lucene-Solr-master-Linux/lucene/build/analysis/common/classes/java/org/apache/lucene/analysis/ckb/package-info.class
    [javac] Creating empty /home/jenkins/workspace/Lucene-Solr-master-Linux/lucene/build/analysis/common/classes/java/org/tartarus/snowball/package-info.class
    [javac] Creating empty /home/jenkins/workspace/Lucene-Solr-master-Linux/lucene/build/analysis/common/classes/java/org/apache/lucene/analysis/in/package-info.class
    [javac] Creating empty /home/jenkins/workspace/Lucene-Solr-master-Linux/lucene/build/analysis/common/classes/java/org/apache/lucene/analysis/util/package-info.class
    [javac] Creating empty /home/jenkins/workspace/Lucene-Solr-master-Linux/lucene/build/analysis/common/classes/java/org/apache/lucene/analysis/it/package-info.class
    [javac] Creating empty /home/jenkins/workspace/Lucene-Solr-master-Linux/lucene/build/analysis/common/classes/java/org/apache/lucene/analysis/snowball/package-info.class
    [javac] Creating empty /home/jenkins/workspace/Lucene-Solr-master-Linux/lucene/build/analysis/common/classes/java/org/apache/lucene/analysis/en/package-info.class
    [javac] Creating empty /home/jenkins/workspace/Lucene-Solr-master-Linux/lucene/build/analysis/common/classes/java/org/apache/lucene/analysis/es/package-info.class
    [javac] Creating empty /home/jenkins/workspace/Lucene-Solr-master-Linux/lucene/build/analysis/common/classes/java/org/apache/lucene/analysis/shingle/package-info.class
    [javac] Creating empty /home/jenkins/workspace/Lucene-Solr-master-Linux/lucene/build/analysis/common/classes/java/org/apache/lucene/analysis/eu/package-info.class
    [javac] Creating empty /home/jenkins/workspace/Lucene-Solr-master-Linux/lucene/build/analysis/common/classes/java/org/apache/lucene/analysis/ar/package-info.class
    [javac] Creating empty /home/jenkins/workspace/Lucene-Solr-master-Linux/lucene/build/analysis/common/classes/java/org/apache/lucene/analysis/query/package-info.class
    [javac] Creating empty /home/jenkins/workspace/Lucene-Solr-master-Linux/lucene/build/analysis/common/classes/java/org/apache/lucene/analysis/id/package-info.class
    [javac] Creating empty /home/jenkins/workspace/Lucene-Solr-master-Linux/lucene/build/analysis/common/classes/java/org/apache/lucene/analysis/compound/hyphenation/package-info.class
    [javac] Creating empty /home/jenkins/workspace/Lucene-Solr-master-Linux/lucene/build/analysis/common/classes/java/org/apache/lucene/analysis/charfilter/package-info.class
    [javac] Creating empty /home/jenkins/workspace/Lucene-Solr-master-Linux/lucene/build/analysis/common/classes/java/org/apache/lucene/analysis/pt/package-info.class
    [javac] Creating empty /home/jenkins/workspace/Lucene-Solr-master-Linux/lucene/build/analysis/common/classes/java/org/apache/lucene/analysis/lv/package-info.class
    [javac] Creating empty /home/jenkins/workspace/Lucene-Solr-master-Linux/lucene/build/analysis/common/classes/java/org/apache/lucene/analysis/lt/package-info.class
    [javac] Creating empty /home/jenkins/workspace/Lucene-Solr-master-Linux/lucene/build/analysis/common/classes/java/org/apache/lucene/analysis/hu/package-info.class
    [javac] Creating empty /home/jenkins/workspace/Lucene-Solr-master-Linux/lucene/build/analysis/common/classes/java/org/apache/lucene/analysis/hy/package-info.class
    [javac] Creating empty /home/jenkins/workspace/Lucene-Solr-master-Linux/lucene/build/analysis/common/classes/java/org/apache/lucene/analysis/pattern/package-info.class
    [javac] Creating empty /home/jenkins/workspace/Lucene-Solr-master-Linux/lucene/build/analysis/common/classes/java/org/apache/lucene/analysis/cz/package-info.class
    [javac] Creating empty /home/jenkins/workspace/Lucene-Solr-master-Linux/lucene/build/analysis/common/classes/java/org/apache/lucene/analysis/th/package-info.class
    [javac] Creating empty /home/jenkins/workspace/Lucene-Solr-master-Linux/lucene/build/analysis/common/classes/java/org/apache/lucene/analysis/path/package-info.class
    [javac] Creating empty /home/jenkins/workspace/Lucene-Solr-master-Linux/lucene/build/analysis/common/classes/java/org/apache/lucene/analysis/tr/package-info.class
    [javac] Creating empty /home/jenkins/workspace/Lucene-Solr-master-Linux/lucene/build/analysis/common/classes/java/org/apache/lucene/analysis/da/package-info.class
    [javac] Creating empty /home/jenkins/workspace/Lucene-Solr-master-Linux/lucene/build/analysis/common/classes/java/org/apache/lucene/analysis/de/package-info.class
    [javac] Creating empty /home/jenkins/workspace/Lucene-Solr-master-Linux/lucene/build/analysis/common/classes/java/org/apache/lucene/analysis/hi/package-info.class
    [javac] Creating empty /home/jenkins/workspace/Lucene-Solr-master-Linux/lucene/build/analysis/common/classes/java/org/apache/lucene/collation/tokenattributes/package-info.class
    [javac] Creating empty /home/jenkins/workspace/Lucene-Solr-master-Linux/lucene/build/analysis/common/classes/java/org/apache/lucene/analysis/gl/package-info.class
    [javac] Creating empty /home/jenkins/workspace/Lucene-Solr-master-Linux/lucene/build/analysis/common/classes/java/org/apache/lucene/analysis/commongrams/package-info.class
    [javac] Creating empty /home/jenkins/workspace/Lucene-Solr-master-Linux/lucene/build/analysis/common/classes/java/org/apache/lucene/analysis/compound/package-info.class
     [copy] Copying 40 files to /home/jenkins/workspace/Lucene-Solr-master-Linux/lucene/build/analysis/common/classes/java

patch-mrjar-classes:
[patch-cls] Remapped 0 class files for Java 9 to: /home/jenkins/workspace/Lucene-Solr-master-Linux/lucene/build/analysis/common/classes/java9
    [touch] Creating /home/jenkins/workspace/Lucene-Solr-master-Linux/lucene/build/analysis/common/patch-mrjar.stamp

-mrjar-check:

-mrjar-core:

-jar-core:
      [jar] Building jar: /home/jenkins/workspace/Lucene-Solr-master-Linux/lucene/build/analysis/common/lucene-analyzers-common-9.0.0-SNAPSHOT.jar

jar-core:

-check-git-state:

-git-cleanroot:

-copy-git-state:

git-autoclean:

resolve:

common.init:

compile-lucene-core:

-check-git-state:

-git-cleanroot:

-copy-git-state:

git-autoclean:

ivy-availability-check:
[loadresource] Do not set property disallowed.ivy.jars.list as its length is 0.

-ivy-fail-disallowed-ivy-version:

ivy-fail:

ivy-configure:
[ivy:configure] :: loading settings :: file = /home/jenkins/workspace/Lucene-Solr-master-Linux/lucene/top-level-ivy-settings.xml

resolve:

init:

-clover.disable:

-clover.load:

-clover.classpath:

-clover.setup:

clover:

compile-core:

init:

-clover.disable:

-clover.load:

-clover.classpath:

-clover.setup:

clover:

common.compile-core:
    [mkdir] Created dir: /home/jenkins/workspace/Lucene-Solr-master-Linux/lucene/build/analysis/icu/classes/java
    [javac] Compiling 25 source files to /home/jenkins/workspace/Lucene-Solr-master-Linux/lucene/build/analysis/icu/classes/java
    [javac] Note: /home/jenkins/workspace/Lucene-Solr-master-Linux/lucene/analysis/icu/src/java/org/apache/lucene/analysis/icu/ICUTransformFilter.java uses or overrides a deprecated API.
    [javac] Note: Recompile with -Xlint:deprecation for details.
    [javac] Creating empty /home/jenkins/workspace/Lucene-Solr-master-Linux/lucene/build/analysis/icu/classes/java/org/apache/lucene/analysis/icu/package-info.class
    [javac] Creating empty /home/jenkins/workspace/Lucene-Solr-master-Linux/lucene/build/analysis/icu/classes/java/org/apache/lucene/analysis/icu/tokenattributes/package-info.class
    [javac] Creating empty /home/jenkins/workspace/Lucene-Solr-master-Linux/lucene/build/analysis/icu/classes/java/org/apache/lucene/analysis/icu/segmentation/package-info.class
     [copy] Copying 6 files to /home/jenkins/workspace/Lucene-Solr-master-Linux/lucene/build/analysis/icu/classes/java

compile-core:

patch-mrjar-classes:
[patch-cls] Remapped 0 class files for Java 9 to: /home/jenkins/workspace/Lucene-Solr-master-Linux/lucene/build/analysis/icu/classes/java9
    [touch] Creating /home/jenkins/workspace/Lucene-Solr-master-Linux/lucene/build/analysis/icu/patch-mrjar.stamp

-mrjar-check:

-mrjar-core:

-jar-core:
      [jar] Building jar: /home/jenkins/workspace/Lucene-Solr-master-Linux/lucene/build/analysis/icu/lucene-analyzers-icu-9.0.0-SNAPSHOT.jar

jar-core:

-compile-test-lucene-queryparser:

-check-git-state:

-git-cleanroot:

-copy-git-state:

git-autoclean:

ivy-availability-check:
[loadresource] Do not set property disallowed.ivy.jars.list as its length is 0.

-ivy-fail-disallowed-ivy-version:

ivy-fail:

ivy-configure:
[ivy:configure] :: loading settings :: file = /home/jenkins/workspace/Lucene-Solr-master-Linux/lucene/top-level-ivy-settings.xml

resolve:

common.init:

compile-lucene-core:

-check-git-state:

-git-cleanroot:

-copy-git-state:

git-autoclean:

ivy-availability-check:
[loadresource] Do not set property disallowed.ivy.jars.list as its length is 0.

-ivy-fail-disallowed-ivy-version:

ivy-fail:

ivy-configure:
[ivy:configure] :: loading settings :: file = /home/jenkins/workspace/Lucene-Solr-master-Linux/lucene/top-level-ivy-settings.xml

resolve:

init:

-clover.disable:

-clover.load:

-clover.classpath:

-clover.setup:

clover:

compile-core:

init:

compile-test:

check-queries-uptodate:

jar-queries:

-mrjar-classes-uptodate:

ivy-availability-check:
[loadresource] Do not set property disallowed.ivy.jars.list as its length is 0.

-ivy-fail-disallowed-ivy-version:

ivy-fail:

ivy-configure:
[ivy:configure] :: loading settings :: file = /home/jenkins/workspace/Lucene-Solr-master-Linux/lucene/top-level-ivy-settings.xml

resolve-groovy:
[ivy:cachepath] :: resolving dependencies :: org.codehaus.groovy#groovy-all-caller;working
[ivy:cachepath] 	confs: [default]
[ivy:cachepath] 	found org.codehaus.groovy#groovy-all;2.4.15 in public
[ivy:cachepath] :: resolution report :: resolve 10ms :: artifacts dl 1ms
	---------------------------------------------------------------------
	|                  |            modules            ||   artifacts   |
	|       conf       | number| search|dwnlded|evicted|| number|dwnlded|
	---------------------------------------------------------------------
	|      default     |   1   |   0   |   0   |   0   ||   1   |   0   |
	---------------------------------------------------------------------

check-expressions-uptodate:

jar-expressions:

-mrjar-classes-uptodate:

ivy-availability-check:
[loadresource] Do not set property disallowed.ivy.jars.list as its length is 0.

-ivy-fail-disallowed-ivy-version:

ivy-fail:

ivy-configure:
[ivy:configure] :: loading settings :: file = /home/jenkins/workspace/Lucene-Solr-master-Linux/lucene/top-level-ivy-settings.xml

resolve-groovy:

-check-git-state:

-git-cleanroot:

-copy-git-state:

git-autoclean:

resolve:

common.init:

compile-lucene-core:

init:

-clover.disable:

-clover.load:

-clover.classpath:

-clover.setup:

clover:

compile-core:
    [mkdir] Created dir: /home/jenkins/workspace/Lucene-Solr-master-Linux/lucene/build/expressions/classes/java
    [javac] Compiling 16 source files to /home/jenkins/workspace/Lucene-Solr-master-Linux/lucene/build/expressions/classes/java
    [javac] Creating empty /home/jenkins/workspace/Lucene-Solr-master-Linux/lucene/build/expressions/classes/java/org/apache/lucene/expressions/js/package-info.class
    [javac] Creating empty /home/jenkins/workspace/Lucene-Solr-master-Linux/lucene/build/expressions/classes/java/org/apache/lucene/expressions/package-info.class
     [copy] Copying 1 file to /home/jenkins/workspace/Lucene-Solr-master-Linux/lucene/build/expressions/classes/java

patch-mrjar-classes:
[patch-cls] Remapped 0 class files for Java 9 to: /home/jenkins/workspace/Lucene-Solr-master-Linux/lucene/build/expressions/classes/java9
    [touch] Creating /home/jenkins/workspace/Lucene-Solr-master-Linux/lucene/build/expressions/patch-mrjar.stamp

-mrjar-check:

-mrjar-core:

-jar-core:
      [jar] Building jar: /home/jenkins/workspace/Lucene-Solr-master-Linux/lucene/build/expressions/lucene-expressions-9.0.0-SNAPSHOT.jar

jar-core:

-check-git-state:

-git-cleanroot:

-copy-git-state:

git-autoclean:

resolve:

common.init:

compile-lucene-core:

init:

-clover.disable:

-clover.load:

-clover.classpath:

-clover.setup:

clover:

common.compile-core:
    [mkdir] Created dir: /home/jenkins/workspace/Lucene-Solr-master-Linux/lucene/build/queries/classes/java
    [javac] Compiling 82 source files to /home/jenkins/workspace/Lucene-Solr-master-Linux/lucene/build/queries/classes/java
    [javac] /home/jenkins/workspace/Lucene-Solr-master-Linux/lucene/queries/src/java/org/apache/lucene/queries/function/FunctionQuery.java:60: warning: [rawtypes] found raw type: Map
    [javac]     protected final Map context;
    [javac]                     ^
    [javac]   missing type arguments for generic class Map<K,V>
    [javac]   where K,V are type-variables:
    [javac]     K extends Object declared in interface Map
    [javac]     V extends Object declared in interface Map
    [javac] /home/jenkins/workspace/Lucene-Solr-master-Linux/lucene/queries/src/java/org/apache/lucene/queries/function/ValueSource.java:54: warning: [rawtypes] found raw type: Map
    [javac]   public abstract FunctionValues getValues(Map context, LeafReaderContext readerContext) throws IOException;
    [javac]                                            ^
    [javac]   missing type arguments for generic class Map<K,V>
    [javac]   where K,V are type-variables:
    [javac]     K extends Object declared in interface Map
    [javac]     V extends Object declared in interface Map
    [javac] /home/jenkins/workspace/Lucene-Solr-master-Linux/lucene/queries/src/java/org/apache/lucene/queries/function/ValueSource.java:78: warning: [rawtypes] found raw type: Map
    [javac]   public void createWeight(Map context, IndexSearcher searcher) throws IOException {
    [javac]                            ^
    [javac]   missing type arguments for generic class Map<K,V>
    [javac]   where K,V are type-variables:
    [javac]     K extends Object declared in interface Map
    [javac]     V extends Object declared in interface Map
    [javac] /home/jenkins/workspace/Lucene-Solr-master-Linux/lucene/queries/src/java/org/apache/lucene/queries/function/ValueSource.java:84: warning: [rawtypes] found raw type: Map
    [javac]   public static Map newContext(IndexSearcher searcher) {
    [javac]                 ^
    [javac]   missing type arguments for generic class Map<K,V>
    [javac]   where K,V are type-variables:
    [javac]     K extends Object declared in interface Map
    [javac]     V extends Object declared in interface Map
    [javac] /home/jenkins/workspace/Lucene-Solr-master-Linux/lucene/queries/src/java/org/apache/lucene/queries/function/ValueSource.java:85: warning: [rawtypes] found raw type: Map
    [javac]     Map context = new IdentityHashMap();
    [javac]     ^
    [javac]   missing type arguments for generic class Map<K,V>
    [javac]   where K,V are type-variables:
    [javac]     K extends Object declared in interface Map
    [javac]     V extends Object declared in interface Map
    [javac] /home/jenkins/workspace/Lucene-Solr-master-Linux/lucene/queries/src/java/org/apache/lucene/queries/function/ValueSource.java:85: warning: [rawtypes] found raw type: IdentityHashMap
    [javac]     Map context = new IdentityHashMap();
    [javac]                       ^
    [javac]   missing type arguments for generic class IdentityHashMap<K,V>
    [javac]   where K,V are type-variables:
    [javac]     K extends Object declared in class IdentityHashMap
    [javac]     V extends Object declared in class IdentityHashMap
    [javac] /home/jenkins/workspace/Lucene-Solr-master-Linux/lucene/queries/src/java/org/apache/lucene/queries/function/ValueSource.java:86: warning: [unchecked] unchecked call to put(K,V) as a member of the raw type Map
    [javac]     context.put("searcher", searcher);
    [javac]                ^
    [javac]   where K,V are type-variables:
    [javac]     K extends Object declared in interface Map
    [javac]     V extends Object declared in interface Map
    [javac] /home/jenkins/workspace/Lucene-Solr-master-Linux/lucene/queries/src/java/org/apache/lucene/queries/function/ValueSource.java:123: warning: [rawtypes] found raw type: Map
    [javac]       Map context = new IdentityHashMap<>();
    [javac]       ^
    [javac]   missing type arguments for generic class Map<K,V>
    [javac]   where K,V are type-variables:
    [javac]     K extends Object declared in interface Map
    [javac]     V extends Object declared in interface Map
    [javac] /home/jenkins/workspace/Lucene-Solr-master-Linux/lucene/queries/src/java/org/apache/lucene/queries/function/ValueSource.java:125: warning: [unchecked] unchecked call to put(K,V) as a member of the raw type Map
    [javac]       context.put("scorer", scorer);
    [javac]                  ^
    [javac]   where K,V are type-variables:
    [javac]     K extends Object declared in interface Map
    [javac]     V extends Object declared in interface Map
    [javac] /home/jenkins/workspace/Lucene-Solr-master-Linux/lucene/queries/src/java/org/apache/lucene/queries/function/ValueSource.java:199: warning: [rawtypes] found raw type: Map
    [javac]       Map context = new HashMap<>();
    [javac]       ^
    [javac]   missing type arguments for generic class Map<K,V>
    [javac]   where K,V are type-variables:
    [javac]     K extends Object declared in interface Map
    [javac]     V extends Object declared in interface Map
    [javac] /home/jenkins/workspace/Lucene-Solr-master-Linux/lucene/queries/src/java/org/apache/lucene/queries/function/ValueSource.java:201: warning: [unchecked] unchecked call to put(K,V) as a member of the raw type Map
    [javac]       context.put("scorer", scorer);
    [javac]                  ^
    [javac]   where K,V are type-variables:
    [javac]     K extends Object declared in interface Map
    [javac]     V extends Object declared in interface Map
    [javac] /home/jenkins/workspace/Lucene-Solr-master-Linux/lucene/queries/src/java/org/apache/lucene/queries/function/ValueSource.java:202: warning: [unchecked] unchecked call to put(K,V) as a member of the raw type Map
    [javac]       context.put("searcher", searcher);
    [javac]                  ^
    [javac]   where K,V are type-variables:
    [javac]     K extends Object declared in interface Map
    [javac]     V extends Object declared in interface Map
    [javac] /home/jenkins/workspace/Lucene-Solr-master-Linux/lucene/queries/src/java/org/apache/lucene/queries/function/ValueSource.java:239: warning: [rawtypes] found raw type: Map
    [javac]       Map context = new HashMap<>();
    [javac]       ^
    [javac]   missing type arguments for generic class Map<K,V>
    [javac]   where K,V are type-variables:
    [javac]     K extends Object declared in interface Map
    [javac]     V extends Object declared in interface Map
    [javac] /home/jenkins/workspace/Lucene-Solr-master-Linux/lucene/queries/src/java/org/apache/lucene/queries/function/ValueSource.java:242: warning: [unchecked] unchecked call to put(K,V) as a member of the raw type Map
    [javac]       context.put("scorer", scorer);
    [javac]                  ^
    [javac]   where K,V are type-variables:
    [javac]     K extends Object declared in interface Map
    [javac]     V extends Object declared in interface Map
    [javac] /home/jenkins/workspace/Lucene-Solr-master-Linux/lucene/queries/src/java/org/apache/lucene/queries/function/ValueSource.java:243: warning: [unchecked] unchecked call to put(K,V) as a member of the raw type Map
    [javac]       context.put("searcher", searcher);
    [javac]                  ^
    [javac]   where K,V are type-variables:
    [javac]     K extends Object declared in interface Map
    [javac]     V extends Object declared in interface Map
    [javac] /home/jenkins/workspace/Lucene-Solr-master-Linux/lucene/queries/src/java/org/apache/lucene/queries/function/ValueSource.java:287: warning: [rawtypes] found raw type: Map
    [javac]     public FunctionValues getValues(Map context, LeafReaderContext readerContext) throws IOException {
    [javac]                                     ^
    [javac]   missing type arguments for generic class Map<K,V>
    [javac]   where K,V are type-variables:
    [javac]     K extends Object declared in interface Map
    [javac]     V extends Object declared in interface Map
    [javac] /home/jenkins/workspace/Lucene-Solr-master-Linux/lucene/queries/src/java/org/apache/lucene/queries/function/ValueSource.java:369: warning: [rawtypes] found raw type: Map
    [javac]       Map context = newContext(searcher);
    [javac]       ^
    [javac]   missing type arguments for generic class Map<K,V>
    [javac]   where K,V are type-variables:
    [javac]     K extends Object declared in interface Map
    [javac]     V extends Object declared in interface Map
    [javac] /home/jenkins/workspace/Lucene-Solr-master-Linux/lucene/queries/src/java/org/apache/lucene/queries/function/ValueSource.java:376: warning: [rawtypes] found raw type: Map
    [javac]     private final Map context;
    [javac]                   ^
    [javac]   missing type arguments for generic class Map<K,V>
    [javac]   where K,V are type-variables:
    [javac]     K extends Object declared in interface Map
    [javac]     V extends Object declared in interface Map
    [javac] /home/jenkins/workspace/Lucene-Solr-master-Linux/lucene/queries/src/java/org/apache/lucene/queries/function/ValueSource.java:378: warning: [rawtypes] found raw type: Map
    [javac]     public ValueSourceComparatorSource(Map context) {
    [javac]                                        ^
    [javac]   missing type arguments for generic class Map<K,V>
    [javac]   where K,V are type-variables:
    [javac]     K extends Object declared in interface Map
    [javac]     V extends Object declared in interface Map
    [javac] /home/jenkins/workspace/Lucene-Solr-master-Linux/lucene/queries/src/java/org/apache/lucene/queries/function/ValueSource.java:398: warning: [rawtypes] found raw type: Map
    [javac]     private final Map fcontext;
    [javac]                   ^
    [javac]   missing type arguments for generic class Map<K,V>
    [javac]   where K,V are type-variables:
    [javac]     K extends Object declared in interface Map
    [javac]     V extends Object declared in interface Map
    [javac] /home/jenkins/workspace/Lucene-Solr-master-Linux/lucene/queries/src/java/org/apache/lucene/queries/function/ValueSource.java:401: warning: [rawtypes] found raw type: Map
    [javac]     ValueSourceComparator(Map fcontext, int numHits) {
    [javac]                           ^
    [javac]   missing type arguments for generic class Map<K,V>
    [javac]   where K,V are type-variables:
    [javac]     K extends Object declared in interface Map
    [javac]     V extends Object declared in interface Map
    [javac] /home/jenkins/workspace/Lucene-Solr-master-Linux/lucene/queries/src/java/org/apache/lucene/queries/function/valuesource/BytesRefFieldSource.java:44: warning: [rawtypes] found raw type: Map
    [javac]   public FunctionValues getValues(Map context, LeafReaderContext readerContext) throws IOException {
    [javac]                                   ^
    [javac]   missing type arguments for generic class Map<K,V>
    [javac]   where K,V are type-variables:
    [javac]     K extends Object declared in interface Map
    [javac]     V extends Object declared in interface Map
    [javac] /home/jenkins/workspace/Lucene-Solr-master-Linux/lucene/queries/src/java/org/apache/lucene/queries/function/valuesource/ComparisonBoolFunction.java:53: warning: [rawtypes] found raw type: Map
    [javac]   public FunctionValues getValues(Map context, LeafReaderContext readerContext) throws IOException {
    [javac]                                   ^
    [javac]   missing type arguments for generic class Map<K,V>
    [javac]   where K,V are type-variables:
    [javac]     K extends Object declared in interface Map
    [javac]     V extends Object declared in interface Map
    [javac] /home/jenkins/workspace/Lucene-Solr-master-Linux/lucene/queries/src/java/org/apache/lucene/queries/function/valuesource/ComparisonBoolFunction.java:100: warning: [rawtypes] found raw type: Map
    [javac]   public void createWeight(Map context, IndexSearcher searcher) throws IOException {
    [javac]                            ^
    [javac]   missing type arguments for generic class Map<K,V>
    [javac]   where K,V are type-variables:
    [javac]     K extends Object declared in interface Map
    [javac]     V extends Object declared in interface Map
    [javac] /home/jenkins/workspace/Lucene-Solr-master-Linux/lucene/queries/src/java/org/apache/lucene/queries/function/valuesource/ConstValueSource.java:44: warning: [rawtypes] found raw type: Map
    [javac]   public FunctionValues getValues(Map context, LeafReaderContext readerContext) throws IOException {
    [javac]                                   ^
    [javac]   missing type arguments for generic class Map<K,V>
    [javac]   where K,V are type-variables:
    [javac]     K extends Object declared in interface Map
    [javac]     V extends Object declared in interface Map
    [javac] /home/jenkins/workspace/Lucene-Solr-master-Linux/lucene/queries/src/java/org/apache/lucene/queries/function/valuesource/MultiFunction.java:115: warning: [rawtypes] found raw type: Map
    [javac]   public static FunctionValues[] valsArr(List<ValueSource> sources, Map fcontext, LeafReaderContext readerContext) throws IOException {
    [javac]                                                                     ^
    [javac]   missing type arguments for generic class Map<K,V>
    [javac]   where K,V are type-variables:
    [javac]     K extends Object declared in interface Map
    [javac]     V extends Object declared in interface Map
    [javac] /home/jenkins/workspace/Lucene-Solr-master-Linux/lucene/queries/src/java/org/apache/lucene/queries/function/valuesource/MultiFunction.java:160: warning: [rawtypes] found raw type: Map
    [javac]   public void createWeight(Map context, IndexSearcher searcher) throws IOException {
    [javac]                            ^
    [javac]   missing type arguments for generic class Map<K,V>
    [javac]   where K,V are type-variables:
    [javac]     K extends Object declared in interface Map
    [javac]     V extends Object declared in interface Map
    [javac] /home/jenkins/workspace/Lucene-Solr-master-Linux/lucene/queries/src/java/org/apache/lucene/queries/function/valuesource/DefFunction.java:45: warning: [rawtypes] found raw type: Map
    [javac]   public FunctionValues getValues(Map fcontext, LeafReaderContext readerContext) throws IOException {
    [javac]                                   ^
    [javac]   missing type arguments for generic class Map<K,V>
    [javac]   where K,V are type-variables:
    [javac]     K extends Object declared in interface Map
    [javac]     V extends Object declared in interface Map
    [javac] /home/jenkins/workspace/Lucene-Solr-master-Linux/lucene/queries/src/java/org/apache/lucene/queries/function/valuesource/DualFloatFunction.java:54: warning: [rawtypes] found raw type: Map
    [javac]   public FunctionValues getValues(Map context, LeafReaderContext readerContext) throws IOException {
    [javac]                                   ^
    [javac]   missing type arguments for generic class Map<K,V>
    [javac]   where K,V are type-variables:
    [javac]     K extends Object declared in interface Map
    [javac]     V extends Object declared in interface Map
    [javac] /home/jenkins/workspace/Lucene-Solr-master-Linux/lucene/queries/src/java/org/apache/lucene/queries/function/valuesource/DualFloatFunction.java:78: warning: [rawtypes] found raw type: Map
    [javac]   public void createWeight(Map context, IndexSearcher searcher) throws IOException {
    [javac]                            ^
    [javac]   missing type arguments for generic class Map<K,V>
    [javac]   where K,V are type-variables:
    [javac]     K extends Object declared in interface Map
    [javac]     V extends Object declared in interface Map
    [javac] /home/jenkins/workspace/Lucene-Solr-master-Linux/lucene/queries/src/java/org/apache/lucene/queries/function/valuesource/DocFreqValueSource.java:148: warning: [rawtypes] found raw type: Map
    [javac]   public FunctionValues getValues(Map context, LeafReaderContext readerContext) throws IOException {
    [javac]                                   ^
    [javac]   missing type arguments for generic class Map<K,V>
    [javac]   where K,V are type-variables:
    [javac]     K extends Object declared in interface Map
    [javac]     V extends Object declared in interface Map
    [javac] /home/jenkins/workspace/Lucene-Solr-master-Linux/lucene/queries/src/java/org/apache/lucene/queries/function/valuesource/DocFreqValueSource.java:155: warning: [rawtypes] found raw type: Map
    [javac]   public void createWeight(Map context, IndexSearcher searcher) throws IOException {
    [javac]                            ^
    [javac]   missing type arguments for generic class Map<K,V>
    [javac]   where K,V are type-variables:
    [javac]     K extends Object declared in interface Map
    [javac]     V extends Object declared in interface Map
    [javac] /home/jenkins/workspace/Lucene-Solr-master-Linux/lucene/queries/src/java/org/apache/lucene/queries/function/valuesource/DocFreqValueSource.java:156: warning: [unchecked] unchecked call to put(K,V) as a member of the raw type Map
    [javac]     context.put("searcher",searcher);
    [javac]                ^
    [javac]   where K,V are type-variables:
    [javac]     K extends Object declared in interface Map
    [javac]     V extends Object declared in interface Map
    [javac] /home/jenkins/workspace/Lucene-Solr-master-Linux/lucene/queries/src/java/org/apache/lucene/queries/function/valuesource/DoubleConstValueSource.java:46: warning: [rawtypes] found raw type: Map
    [javac]   public FunctionValues getValues(Map context, LeafReaderContext readerContext) throws IOException {
    [javac]                                   ^
    [javac]   missing type arguments for generic class Map<K,V>
    [javac]   where K,V are type-variables:
    [javac]     K extends Object declared in interface Map
    [javac]     V extends Object declared in interface Map
    [javac] /home/jenkins/workspace/Lucene-Solr-master-Linux/lucene/queries/src/java/org/apache/lucene/queries/function/valuesource/DoubleFieldSource.java:53: warning: [rawtypes] found raw type: Map
    [javac]   public FunctionValues getValues(Map context, LeafReaderContext readerContext) throws IOException {
    [javac]                                   ^
    [javac]   missing type arguments for generic class Map<K,V>
    [javac]   where K,V are type-variables:
    [javac]     K extends Object declared in interface Map
    [javac]     V extends Object declared in interface Map
    [javac] /home/jenkins/workspace/Lucene-Solr-master-Linux/lucene/queries/src/java/org/apache/lucene/queries/function/valuesource/DoubleFieldSource.java:107: warning: [rawtypes] found raw type: Map
    [javac]   protected NumericDocValues getNumericDocValues(Map context, LeafReaderContext readerContext) throws IOException {
    [javac]                                                  ^
    [javac]   missing type arguments for generic class Map<K,V>
    [javac]   where K,V are type-variables:
    [javac]     K extends Object declared in interface Map
    [javac]     V extends Object declared in interface Map
    [javac] /home/jenkins/workspace/Lucene-Solr-master-Linux/lucene/queries/src/java/org/apache/lucene/queries/function/valuesource/EnumFieldSource.java:97: warning: [rawtypes] found raw type: Map
    [javac]   public FunctionValues getValues(Map context, LeafReaderContext readerContext) throws IOException {
    [javac]                                   ^
    [javac]   missing type arguments for generic class Map<K,V>
    [javac]   where K,V are type-variables:
    [javac]     K extends Object declared in interface Map
    [javac]     V extends Object declared in interface Map
    [javac] /home/jenkins/workspace/Lucene-Solr-master-Linux/lucene/queries/src/java/org/apache/lucene/queries/function/valuesource/FloatFieldSource.java:53: warning: [rawtypes] found raw type: Map
    [javac]   public FunctionValues getValues(Map context, LeafReaderContext readerContext) throws IOException {
    [javac]                                   ^
    [javac]   missing type arguments for generic class Map<K,V>
    [javac]   where K,V are type-variables:
    [javac]     K extends Object declared in interface Map
    [javac]     V extends Object declared in interface Map
    [javac] /home/jenkins/workspace/Lucene-Solr-master-Linux/lucene/queries/src/java/org/apache/lucene/queries/function/valuesource/FloatFieldSource.java:108: warning: [rawtypes] found raw type: Map
    [javac]   protected NumericDocValues getNumericDocValues(Map context, LeafReaderContext readerContext) throws IOException {
    [javac]                                                  ^
    [javac]   missing type arguments for generic class Map<K,V>
    [javac]   where K,V are type-variables:
    [javac]     K extends Object declared in interface Map
    [javac]     V extends Object declared in interface Map
    [javac] /home/jenkins/workspace/Lucene-Solr-master-Linux/lucene/queries/src/java/org/apache/lucene/queries/function/valuesource/IDFValueSource.java:48: warning: [rawtypes] found raw type: Map
    [javac]   public FunctionValues getValues(Map context, LeafReaderContext readerContext) throws IOException {
    [javac]                                   ^
    [javac]   missing type arguments for generic class Map<K,V>
    [javac]   where K,V are type-variables:
    [javac]     K extends Object declared in interface Map
    [javac]     V extends Object declared in interface Map
    [javac] /home/jenkins/workspace/Lucene-Solr-master-Linux/lucene/queries/src/java/org/apache/lucene/queries/function/valuesource/IDFValueSource.java:56: warning: auxiliary class ConstDoubleDocValues in /home/jenkins/workspace/Lucene-Solr-master-Linux/lucene/queries/src/java/org/apache/lucene/queries/function/valuesource/DocFreqValueSource.java should not be accessed from outside its own source file
    [javac]     return new ConstDoubleDocValues(idf, this);
    [javac]                ^
    [javac] /home/jenkins/workspace/Lucene-Solr-master-Linux/lucene/queries/src/java/org/apache/lucene/queries/function/valuesource/IfFunction.java:46: warning: [rawtypes] found raw type: Map
    [javac]   public FunctionValues getValues(Map context, LeafReaderContext readerContext) throws IOException {
    [javac]                                   ^
    [javac]   missing type arguments for generic class Map<K,V>
    [javac]   where K,V are type-variables:
    [javac]     K extends Object declared in interface Map
    [javac]     V extends Object declared in interface Map
    [javac] /home/jenkins/workspace/Lucene-Solr-master-Linux/lucene/queries/src/java/org/apache/lucene/queries/function/valuesource/IfFunction.java:145: warning: [rawtypes] found raw type: Map
    [javac]   public void createWeight(Map context, IndexSearcher searcher) throws IOException {
    [javac]                            ^
    [javac]   missing type arguments for generic class Map<K,V>
    [javac]   where K,V are type-variables:
    [javac]     K extends Object declared in interface Map
    [javac]     V extends Object declared in interface Map
    [javac] /home/jenkins/workspace/Lucene-Solr-master-Linux/lucene/queries/src/java/org/apache/lucene/queries/function/valuesource/IntFieldSource.java:53: warning: [rawtypes] found raw type: Map
    [javac]   public FunctionValues getValues(Map context, LeafReaderContext readerContext) throws IOException {
    [javac]                                   ^
    [javac]   missing type arguments for generic class Map<K,V>
    [javac]   where K,V are type-variables:
    [javac]     K extends Object declared in interface Map
    [javac]     V extends Object declared in interface Map
    [javac] /home/jenkins/workspace/Lucene-Solr-master-Linux/lucene/queries/src/java/org/apache/lucene/queries/function/valuesource/IntFieldSource.java:112: warning: [rawtypes] found raw type: Map
    [javac]   protected NumericDocValues getNumericDocValues(Map context, LeafReaderContext readerContext) throws IOException {
    [javac]                                                  ^
    [javac]   missing type arguments for generic class Map<K,V>
    [javac]   where K,V are type-variables:
    [javac]     K extends Object declared in interface Map
    [javac]     V extends Object declared in interface Map
    [javac] /home/jenkins/workspace/Lucene-Solr-master-Linux/lucene/queries/src/java/org/apache/lucene/queries/function/valuesource/JoinDocFreqValueSource.java:56: warning: [rawtypes] found raw type: Map
    [javac]   public FunctionValues getValues(Map context, LeafReaderContext readerContext) throws IOException
    [javac]                                   ^
    [javac]   missing type arguments for generic class Map<K,V>
    [javac]   where K,V are type-variables:
    [javac]     K extends Object declared in interface Map
    [javac]     V extends Object declared in interface Map
    [javac] /home/jenkins/workspace/Lucene-Solr-master-Linux/lucene/queries/src/java/org/apache/lucene/queries/function/valuesource/LinearFloatFunction.java:53: warning: [rawtypes] found raw type: Map
    [javac]   public FunctionValues getValues(Map context, LeafReaderContext readerContext) throws IOException {
    [javac]                                   ^
    [javac]   missing type arguments for generic class Map<K,V>
    [javac]   where K,V are type-variables:
    [javac]     K extends Object declared in interface Map
    [javac]     V extends Object declared in interface Map
    [javac] /home/jenkins/workspace/Lucene-Solr-master-Linux/lucene/queries/src/java/org/apache/lucene/queries/function/valuesource/LinearFloatFunction.java:72: warning: [rawtypes] found raw type: Map
    [javac]   public void createWeight(Map context, IndexSearcher searcher) throws IOException {
    [javac]                            ^
    [javac]   missing type arguments for generic class Map<K,V>
    [javac]   where K,V are type-variables:
    [javac]     K extends Object declared in interface Map
    [javac]     V extends Object declared in interface Map
    [javac] /home/jenkins/workspace/Lucene-Solr-master-Linux/lucene/queries/src/java/org/apache/lucene/queries/function/valuesource/LiteralValueSource.java:48: warning: [rawtypes] found raw type: Map
    [javac]   public FunctionValues getValues(Map context, LeafReaderContext readerContext) throws IOException {
    [javac]                                   ^
    [javac]   missing type arguments for generic class Map<K,V>
    [javac]   where K,V are type-variables:
    [javac]     K extends Object declared in interface Map
    [javac]     V extends Object declared in interface Map
    [javac] /home/jenkins/workspace/Lucene-Solr-master-Linux/lucene/queries/src/java/org/apache/lucene/queries/function/valuesource/LongFieldSource.java:65: warning: [rawtypes] found raw type: Map
    [javac]   public FunctionValues getValues(Map context, LeafReaderContext readerContext) throws IOException {
    [javac]                                   ^
    [javac]   missing type arguments for generic class Map<K,V>
    [javac]  

[...truncated too long message...]

q=2, value='null': java.lang.InterruptedException: null
   [junit4]   2> java.lang.InterruptedException
   [junit4]   2> 	at java.util.concurrent.locks.AbstractQueuedSynchronizer$ConditionObject.reportInterruptAfterWait(AbstractQueuedSynchronizer.java:2014)
   [junit4]   2> 	at java.util.concurrent.locks.AbstractQueuedSynchronizer$ConditionObject.awaitNanos(AbstractQueuedSynchronizer.java:2088)
   [junit4]   2> 	at com.lmax.disruptor.TimeoutBlockingWaitStrategy.waitFor(TimeoutBlockingWaitStrategy.java:38)
   [junit4]   2> 	at com.lmax.disruptor.ProcessingSequenceBarrier.waitFor(ProcessingSequenceBarrier.java:56)
   [junit4]   2> 	at com.lmax.disruptor.BatchEventProcessor.processEvents(BatchEventProcessor.java:159)
   [junit4]   2> 	at com.lmax.disruptor.BatchEventProcessor.run(BatchEventProcessor.java:125)
   [junit4]   2> 	at java.lang.Thread.run(Thread.java:748)
   [junit4]   2> AsyncLogger error handling event seq=3, value='null': java.lang.InterruptedException: null
   [junit4]   2> java.lang.InterruptedException
   [junit4]   2> 	at java.util.concurrent.locks.AbstractQueuedSynchronizer$ConditionObject.reportInterruptAfterWait(AbstractQueuedSynchronizer.java:2014)
   [junit4]   2> 	at java.util.concurrent.locks.AbstractQueuedSynchronizer$ConditionObject.awaitNanos(AbstractQueuedSynchronizer.java:2088)
   [junit4]   2> 	at com.lmax.disruptor.TimeoutBlockingWaitStrategy.waitFor(TimeoutBlockingWaitStrategy.java:38)
   [junit4]   2> 	at com.lmax.disruptor.ProcessingSequenceBarrier.waitFor(ProcessingSequenceBarrier.java:56)
   [junit4]   2> 	at com.lmax.disruptor.BatchEventProcessor.processEvents(BatchEventProcessor.java:159)
   [junit4]   2> 	at com.lmax.disruptor.BatchEventProcessor.run(BatchEventProcessor.java:125)
   [junit4]   2> 	at java.lang.Thread.run(Thread.java:748)
   [junit4]   2> AsyncLogger error handling event seq=4, value='null': java.lang.InterruptedException: null
   [junit4]   2> java.lang.InterruptedException
   [junit4]   2> 	at java.util.concurrent.locks.AbstractQueuedSynchronizer$ConditionObject.reportInterruptAfterWait(AbstractQueuedSynchronizer.java:2014)
   [junit4]   2> 	at java.util.concurrent.locks.AbstractQueuedSynchronizer$ConditionObject.awaitNanos(AbstractQueuedSynchronizer.java:2088)
   [junit4]   2> 	at com.lmax.disruptor.TimeoutBlockingWaitStrategy.waitFor(TimeoutBlockingWaitStrategy.java:38)
   [junit4]   2> 	at com.lmax.disruptor.ProcessingSequenceBarrier.waitFor(ProcessingSequenceBarrier.java:56)
   [junit4]   2> 	at com.lmax.disruptor.BatchEventProcessor.processEvents(BatchEventProcessor.java:159)
   [junit4]   2> 	at com.lmax.disruptor.BatchEventProcessor.run(BatchEventProcessor.java:125)
   [junit4]   2> 	at java.lang.Thread.run(Thread.java:748)
   [junit4]   2> Feb 25, 2019 4:43:35 PM com.carrotsearch.randomizedtesting.ThreadLeakControl tryToInterruptAll
   [junit4]   2> SEVERE: There are still zombie threads that couldn't be terminated:
   [junit4]   2>    1) Thread[id=14, name=Log4j2-TF-1-AsyncLoggerConfig-1, state=TIMED_WAITING, group=TGRP-BufferStoreTest]
   [junit4]   2>         at sun.misc.Unsafe.park(Native Method)
   [junit4]   2>         at java.util.concurrent.locks.LockSupport.parkNanos(LockSupport.java:215)
   [junit4]   2>         at java.util.concurrent.locks.AbstractQueuedSynchronizer$ConditionObject.awaitNanos(AbstractQueuedSynchronizer.java:2078)
   [junit4]   2>         at com.lmax.disruptor.TimeoutBlockingWaitStrategy.waitFor(TimeoutBlockingWaitStrategy.java:38)
   [junit4]   2>         at com.lmax.disruptor.ProcessingSequenceBarrier.waitFor(ProcessingSequenceBarrier.java:56)
   [junit4]   2>         at com.lmax.disruptor.BatchEventProcessor.processEvents(BatchEventProcessor.java:159)
   [junit4]   2>         at com.lmax.disruptor.BatchEventProcessor.run(BatchEventProcessor.java:125)
   [junit4]   2>         at java.lang.Thread.run(Thread.java:748)
   [junit4]   2> NOTE: test params are: codec=Asserting(Lucene80): {}, docValues:{}, maxPointsInLeafNode=1981, maxMBSortInHeap=5.024447609686821, sim=Asserting(org.apache.lucene.search.similarities.AssertingSimilarity@2b9abaa5), locale=sr-Latn-BA, timezone=Africa/Bissau
   [junit4]   2> NOTE: Linux 4.18.0-15-generic amd64/Oracle Corporation 1.8.0_172 (64-bit)/cpus=8,threads=2,free=427936976,total=514850816
   [junit4]   2> NOTE: All tests run in this JVM: [BufferStoreTest]
   [junit4]   2> NOTE: reproduce with: ant test  -Dtestcase=BufferStoreTest -Dtests.seed=3EF531368FC72D9F -Dtests.multiplier=3 -Dtests.slow=true -Dtests.badapples=true -Dtests.locale=sr-Latn-BA -Dtests.timezone=Africa/Bissau -Dtests.asserts=true -Dtests.file.encoding=ISO-8859-1
   [junit4] ERROR   0.00s J0 | BufferStoreTest (suite) <<<
   [junit4]    > Throwable #1: com.carrotsearch.randomizedtesting.ThreadLeakError: 1 thread leaked from SUITE scope at org.apache.solr.store.blockcache.BufferStoreTest: 
   [junit4]    >    1) Thread[id=14, name=Log4j2-TF-1-AsyncLoggerConfig-1, state=TIMED_WAITING, group=TGRP-BufferStoreTest]
   [junit4]    >         at sun.misc.Unsafe.park(Native Method)
   [junit4]    >         at java.util.concurrent.locks.LockSupport.parkNanos(LockSupport.java:215)
   [junit4]    >         at java.util.concurrent.locks.AbstractQueuedSynchronizer$ConditionObject.awaitNanos(AbstractQueuedSynchronizer.java:2078)
   [junit4]    >         at com.lmax.disruptor.TimeoutBlockingWaitStrategy.waitFor(TimeoutBlockingWaitStrategy.java:38)
   [junit4]    >         at com.lmax.disruptor.ProcessingSequenceBarrier.waitFor(ProcessingSequenceBarrier.java:56)
   [junit4]    >         at com.lmax.disruptor.BatchEventProcessor.processEvents(BatchEventProcessor.java:159)
   [junit4]    >         at com.lmax.disruptor.BatchEventProcessor.run(BatchEventProcessor.java:125)
   [junit4]    >         at java.lang.Thread.run(Thread.java:748)
   [junit4]    > 	at __randomizedtesting.SeedInfo.seed([3EF531368FC72D9F]:0)Throwable #2: com.carrotsearch.randomizedtesting.ThreadLeakError: There are still zombie threads that couldn't be terminated:
   [junit4]    >    1) Thread[id=14, name=Log4j2-TF-1-AsyncLoggerConfig-1, state=TIMED_WAITING, group=TGRP-BufferStoreTest]
   [junit4]    >         at sun.misc.Unsafe.park(Native Method)
   [junit4]    >         at java.util.concurrent.locks.LockSupport.parkNanos(LockSupport.java:215)
   [junit4]    >         at java.util.concurrent.locks.AbstractQueuedSynchronizer$ConditionObject.awaitNanos(AbstractQueuedSynchronizer.java:2078)
   [junit4]    >         at com.lmax.disruptor.TimeoutBlockingWaitStrategy.waitFor(TimeoutBlockingWaitStrategy.java:38)
   [junit4]    >         at com.lmax.disruptor.ProcessingSequenceBarrier.waitFor(ProcessingSequenceBarrier.java:56)
   [junit4]    >         at com.lmax.disruptor.BatchEventProcessor.processEvents(BatchEventProcessor.java:159)
   [junit4]    >         at com.lmax.disruptor.BatchEventProcessor.run(BatchEventProcessor.java:125)
   [junit4]    >         at java.lang.Thread.run(Thread.java:748)
   [junit4]    > 	at __randomizedtesting.SeedInfo.seed([3EF531368FC72D9F]:0)
   [junit4] Completed [4/5 (3!)] on J0 in 24.68s, 1 test, 2 errors <<< FAILURES!
   [junit4] 
   [junit4] Suite: org.apache.solr.store.blockcache.BufferStoreTest
   [junit4] Completed [5/5 (3!)] on J1 in 0.01s, 1 test, 1 skipped
   [junit4] 
   [junit4] 
   [junit4] Tests with failures [seed: 3EF531368FC72D9F]:
   [junit4]   - org.apache.solr.store.blockcache.BufferStoreTest (suite)
   [junit4]   - org.apache.solr.store.blockcache.BufferStoreTest (suite)
   [junit4]   - org.apache.solr.store.blockcache.BufferStoreTest (suite)
   [junit4] 
   [junit4] 
   [junit4] JVM J0:     0.72 ..    26.04 =    25.31s
   [junit4] JVM J1:     0.71 ..    26.43 =    25.72s
   [junit4] JVM J2:     0.72 ..    25.99 =    25.27s
   [junit4] Execution time total: 26 seconds
   [junit4] Tests summary: 5 suites, 5 tests, 6 suite-level errors, 2 ignored

BUILD FAILED
/home/jenkins/workspace/Lucene-Solr-master-Linux/lucene/common-build.xml:1572: The following error occurred while executing this line:
/home/jenkins/workspace/Lucene-Solr-master-Linux/lucene/common-build.xml:1099: There were test failures: 5 suites, 5 tests, 6 suite-level errors, 2 ignored [seed: 3EF531368FC72D9F]

Total time: 28 seconds

[repro] Setting last failure code to 256

[repro] Failures:
[repro]   3/5 failed: org.apache.solr.store.blockcache.BufferStoreTest
[repro] Exiting with code 256
+ mv lucene/build lucene/build.repro
+ mv solr/build solr/build.repro
+ mv lucene/build.orig lucene/build
+ mv solr/build.orig solr/build
Archiving artifacts
Setting ANT_1_8_2_HOME=/home/jenkins/tools/hudson.tasks.Ant_AntInstallation/ANT_1.8.2
[WARNINGS] Parsing warnings in console log with parser Java Compiler (javac)
Setting ANT_1_8_2_HOME=/home/jenkins/tools/hudson.tasks.Ant_AntInstallation/ANT_1.8.2
No credentials specified
Setting ANT_1_8_2_HOME=/home/jenkins/tools/hudson.tasks.Ant_AntInstallation/ANT_1.8.2
<Git Blamer> Using GitBlamer to create author and commit information for all warnings.
<Git Blamer> GIT_COMMIT=8c34da8a626634eac07841795b72c8e225de3b04, workspace=/home/jenkins/workspace/Lucene-Solr-master-Linux
[WARNINGS] Computing warning deltas based on reference build #23719
Recording test results
Setting ANT_1_8_2_HOME=/home/jenkins/tools/hudson.tasks.Ant_AntInstallation/ANT_1.8.2
Build step 'Publish JUnit test result report' changed build result to UNSTABLE
Email was triggered for: Unstable (Test Failures)
Sending email for trigger: Unstable (Test Failures)
Setting ANT_1_8_2_HOME=/home/jenkins/tools/hudson.tasks.Ant_AntInstallation/ANT_1.8.2
Setting ANT_1_8_2_HOME=/home/jenkins/tools/hudson.tasks.Ant_AntInstallation/ANT_1.8.2
Setting ANT_1_8_2_HOME=/home/jenkins/tools/hudson.tasks.Ant_AntInstallation/ANT_1.8.2
Setting ANT_1_8_2_HOME=/home/jenkins/tools/hudson.tasks.Ant_AntInstallation/ANT_1.8.2
Setting ANT_1_8_2_HOME=/home/jenkins/tools/hudson.tasks.Ant_AntInstallation/ANT_1.8.2
Setting ANT_1_8_2_HOME=/home/jenkins/tools/hudson.tasks.Ant_AntInstallation/ANT_1.8.2