You are viewing a plain text version of this content. The canonical link for it is here.
Posted to dev@tika.apache.org by Tim Allison <ta...@apache.org> on 2026/09/25 20:45:22 UTC
[VOTE] Release Apache Tika 4.1.0 Candidate #2
A candidate for the Tika 4.1.0 release is available at:
https://dist.apache.org/repos/dist/dev/tika/4.1.0
The release candidate is a zip archive of the sources in:
https://github.com/apache/tika/tree/4.1.0-rc2/
The SHA-512 checksum of the archive is
4a71fe021015f58e1f518ed0671d201bc2eb5abe97fab51b54509a280780447260fe9b59e6be9d7694e04736f60ddc28ad49e83f17280839277e62d92413983e.
In addition, a staged maven repository is available here:
https://repository.apache.org/content/repositories/orgapachetika-1133/org/apache/tika
Please vote on releasing this package as Apache Tika 4.1.0.
The vote is open for the next 72 hours and passes if a majority of at
least three +1 Tika PMC votes are cast.
[ ] +1 Release this package as Apache Tika 4.1.0
[ ] -1 Do not release this package because...
Here's my +1
Cheers,
Tim
[RESULT][VOTE] Release Apache Tika 4.1.0 Candidate #2
Posted by Tim Allison <ta...@apache.org>.
Tilman found that the release artifacts don't build because the
assembly excluded a directory for a unit test in tika-eval-app.
I'm changing my vote to -1 and will respin.
On Sat, Sep 26, 2026 at 8:16 AM Tilman Hausherr <ti...@apache.org> wrote:
>
> Decide this yourself :-)
>
> Tilman
>
> On 2026/09/26 12:04:23 Tim Allison wrote:
> > Y, the issue is that the .run-info in the test directory didn't make
> > it into the release artifacts, which causes the test to fail.
> >
> > I think we should respin an rc3?
> >
> > On Sat, Sep 26, 2026 at 6:27 AM Tilman Hausherr <ti...@apache.org> wrote:
> > >
> > > Building from the repository works fine.
> > >
> > > Tilman
> > >
> > > On 2026/09/26 09:32:12 Tilman Hausherr wrote:
> > > > +1
> > > >
> > > > However it fails with tika-eval-app (which is less relevant because it's mostly for us)
> > > >
> > > > [ERROR] Failures:
> > > > [ERROR] ComparerOneSidedLedgerTest.testOnlyB:57 expected: <TIMEOUT> but was: <null>
> > > > [ERROR] ProfilerDiscoveryTest.testDiscoversRunInfoAndSkipsItInCrawl:46->one:69 no row for: select run_value from run_info where run_key='batch.run.id' ==> expected: <true> but was: <false>
> > > > [INFO]
> > > > [ERROR] Tests run: 57, Failures: 2, Errors: 0, Skipped: 5
> > > > [INFO]
> > > > [INFO] ------------------------------------------------------------------------
> > > > [INFO] Reactor Summary for Apache Tika 4.1.0:
> > > > [INFO]
> > > > [INFO] Apache Tika eval application ....................... FAILURE [01:12 min]
> > > > [INFO] Apache Tika eval structure ......................... SKIPPED
> > > > [INFO] Apache Tika translate .............................. SKIPPED
> > > > [INFO] Apache Tika examples ............................... SKIPPED
> > > > [INFO] Apache Tika Java-7 Components ...................... SKIPPED
> > > > [INFO] Apache Tika ........................................ SKIPPED
> > > > [INFO] ------------------------------------------------------------------------
> > > > [INFO] BUILD FAILURE
> > > > [INFO] ------------------------------------------------------------------------
> > > >
> > > > java version "17.0.12" 2024-07-16 LTS
> > > > Java(TM) SE Runtime Environment (build 17.0.12+8-LTS-286)
> > > > Java HotSpot(TM) 64-Bit Server VM (build 17.0.12+8-LTS-286, mixed mode, sharing)
> > > >
> > > > Tilman
> > > >
> > > > On 2026/09/25 20:45:22 Tim Allison wrote:
> > > > > A candidate for the Tika 4.1.0 release is available at:
> > > > > https://dist.apache.org/repos/dist/dev/tika/4.1.0
> > > > >
> > > > > The release candidate is a zip archive of the sources in:
> > > > > https://github.com/apache/tika/tree/4.1.0-rc2/
> > > > >
> > > > > The SHA-512 checksum of the archive is
> > > > > 4a71fe021015f58e1f518ed0671d201bc2eb5abe97fab51b54509a280780447260fe9b59e6be9d7694e04736f60ddc28ad49e83f17280839277e62d92413983e.
> > > > >
> > > > > In addition, a staged maven repository is available here:
> > > > > https://repository.apache.org/content/repositories/orgapachetika-1133/org/apache/tika
> > > > >
> > > > > Please vote on releasing this package as Apache Tika 4.1.0.
> > > > > The vote is open for the next 72 hours and passes if a majority of at
> > > > > least three +1 Tika PMC votes are cast.
> > > > >
> > > > > [ ] +1 Release this package as Apache Tika 4.1.0
> > > > > [ ] -1 Do not release this package because...
> > > > >
> > > > > Here's my +1
> > > > >
> > > > > Cheers,
> > > > >
> > > > > Tim
> > > > >
> > > >
> >
Re: [VOTE] Release Apache Tika 4.1.0 Candidate #2
Posted by Tilman Hausherr <ti...@apache.org>.
Decide this yourself :-)
Tilman
On 2026/09/26 12:04:23 Tim Allison wrote:
> Y, the issue is that the .run-info in the test directory didn't make
> it into the release artifacts, which causes the test to fail.
>
> I think we should respin an rc3?
>
> On Sat, Sep 26, 2026 at 6:27 AM Tilman Hausherr <ti...@apache.org> wrote:
> >
> > Building from the repository works fine.
> >
> > Tilman
> >
> > On 2026/09/26 09:32:12 Tilman Hausherr wrote:
> > > +1
> > >
> > > However it fails with tika-eval-app (which is less relevant because it's mostly for us)
> > >
> > > [ERROR] Failures:
> > > [ERROR] ComparerOneSidedLedgerTest.testOnlyB:57 expected: <TIMEOUT> but was: <null>
> > > [ERROR] ProfilerDiscoveryTest.testDiscoversRunInfoAndSkipsItInCrawl:46->one:69 no row for: select run_value from run_info where run_key='batch.run.id' ==> expected: <true> but was: <false>
> > > [INFO]
> > > [ERROR] Tests run: 57, Failures: 2, Errors: 0, Skipped: 5
> > > [INFO]
> > > [INFO] ------------------------------------------------------------------------
> > > [INFO] Reactor Summary for Apache Tika 4.1.0:
> > > [INFO]
> > > [INFO] Apache Tika eval application ....................... FAILURE [01:12 min]
> > > [INFO] Apache Tika eval structure ......................... SKIPPED
> > > [INFO] Apache Tika translate .............................. SKIPPED
> > > [INFO] Apache Tika examples ............................... SKIPPED
> > > [INFO] Apache Tika Java-7 Components ...................... SKIPPED
> > > [INFO] Apache Tika ........................................ SKIPPED
> > > [INFO] ------------------------------------------------------------------------
> > > [INFO] BUILD FAILURE
> > > [INFO] ------------------------------------------------------------------------
> > >
> > > java version "17.0.12" 2024-07-16 LTS
> > > Java(TM) SE Runtime Environment (build 17.0.12+8-LTS-286)
> > > Java HotSpot(TM) 64-Bit Server VM (build 17.0.12+8-LTS-286, mixed mode, sharing)
> > >
> > > Tilman
> > >
> > > On 2026/09/25 20:45:22 Tim Allison wrote:
> > > > A candidate for the Tika 4.1.0 release is available at:
> > > > https://dist.apache.org/repos/dist/dev/tika/4.1.0
> > > >
> > > > The release candidate is a zip archive of the sources in:
> > > > https://github.com/apache/tika/tree/4.1.0-rc2/
> > > >
> > > > The SHA-512 checksum of the archive is
> > > > 4a71fe021015f58e1f518ed0671d201bc2eb5abe97fab51b54509a280780447260fe9b59e6be9d7694e04736f60ddc28ad49e83f17280839277e62d92413983e.
> > > >
> > > > In addition, a staged maven repository is available here:
> > > > https://repository.apache.org/content/repositories/orgapachetika-1133/org/apache/tika
> > > >
> > > > Please vote on releasing this package as Apache Tika 4.1.0.
> > > > The vote is open for the next 72 hours and passes if a majority of at
> > > > least three +1 Tika PMC votes are cast.
> > > >
> > > > [ ] +1 Release this package as Apache Tika 4.1.0
> > > > [ ] -1 Do not release this package because...
> > > >
> > > > Here's my +1
> > > >
> > > > Cheers,
> > > >
> > > > Tim
> > > >
> > >
>
Re: [VOTE] Release Apache Tika 4.1.0 Candidate #2
Posted by Tim Allison <ta...@apache.org>.
Y, the issue is that the .run-info in the test directory didn't make
it into the release artifacts, which causes the test to fail.
I think we should respin an rc3?
On Sat, Sep 26, 2026 at 6:27 AM Tilman Hausherr <ti...@apache.org> wrote:
>
> Building from the repository works fine.
>
> Tilman
>
> On 2026/09/26 09:32:12 Tilman Hausherr wrote:
> > +1
> >
> > However it fails with tika-eval-app (which is less relevant because it's mostly for us)
> >
> > [ERROR] Failures:
> > [ERROR] ComparerOneSidedLedgerTest.testOnlyB:57 expected: <TIMEOUT> but was: <null>
> > [ERROR] ProfilerDiscoveryTest.testDiscoversRunInfoAndSkipsItInCrawl:46->one:69 no row for: select run_value from run_info where run_key='batch.run.id' ==> expected: <true> but was: <false>
> > [INFO]
> > [ERROR] Tests run: 57, Failures: 2, Errors: 0, Skipped: 5
> > [INFO]
> > [INFO] ------------------------------------------------------------------------
> > [INFO] Reactor Summary for Apache Tika 4.1.0:
> > [INFO]
> > [INFO] Apache Tika eval application ....................... FAILURE [01:12 min]
> > [INFO] Apache Tika eval structure ......................... SKIPPED
> > [INFO] Apache Tika translate .............................. SKIPPED
> > [INFO] Apache Tika examples ............................... SKIPPED
> > [INFO] Apache Tika Java-7 Components ...................... SKIPPED
> > [INFO] Apache Tika ........................................ SKIPPED
> > [INFO] ------------------------------------------------------------------------
> > [INFO] BUILD FAILURE
> > [INFO] ------------------------------------------------------------------------
> >
> > java version "17.0.12" 2024-07-16 LTS
> > Java(TM) SE Runtime Environment (build 17.0.12+8-LTS-286)
> > Java HotSpot(TM) 64-Bit Server VM (build 17.0.12+8-LTS-286, mixed mode, sharing)
> >
> > Tilman
> >
> > On 2026/09/25 20:45:22 Tim Allison wrote:
> > > A candidate for the Tika 4.1.0 release is available at:
> > > https://dist.apache.org/repos/dist/dev/tika/4.1.0
> > >
> > > The release candidate is a zip archive of the sources in:
> > > https://github.com/apache/tika/tree/4.1.0-rc2/
> > >
> > > The SHA-512 checksum of the archive is
> > > 4a71fe021015f58e1f518ed0671d201bc2eb5abe97fab51b54509a280780447260fe9b59e6be9d7694e04736f60ddc28ad49e83f17280839277e62d92413983e.
> > >
> > > In addition, a staged maven repository is available here:
> > > https://repository.apache.org/content/repositories/orgapachetika-1133/org/apache/tika
> > >
> > > Please vote on releasing this package as Apache Tika 4.1.0.
> > > The vote is open for the next 72 hours and passes if a majority of at
> > > least three +1 Tika PMC votes are cast.
> > >
> > > [ ] +1 Release this package as Apache Tika 4.1.0
> > > [ ] -1 Do not release this package because...
> > >
> > > Here's my +1
> > >
> > > Cheers,
> > >
> > > Tim
> > >
> >
Re: [VOTE] Release Apache Tika 4.1.0 Candidate #2
Posted by Tilman Hausherr <ti...@apache.org>.
Building from the repository works fine.
Tilman
On 2026/09/26 09:32:12 Tilman Hausherr wrote:
> +1
>
> However it fails with tika-eval-app (which is less relevant because it's mostly for us)
>
> [ERROR] Failures:
> [ERROR] ComparerOneSidedLedgerTest.testOnlyB:57 expected: <TIMEOUT> but was: <null>
> [ERROR] ProfilerDiscoveryTest.testDiscoversRunInfoAndSkipsItInCrawl:46->one:69 no row for: select run_value from run_info where run_key='batch.run.id' ==> expected: <true> but was: <false>
> [INFO]
> [ERROR] Tests run: 57, Failures: 2, Errors: 0, Skipped: 5
> [INFO]
> [INFO] ------------------------------------------------------------------------
> [INFO] Reactor Summary for Apache Tika 4.1.0:
> [INFO]
> [INFO] Apache Tika eval application ....................... FAILURE [01:12 min]
> [INFO] Apache Tika eval structure ......................... SKIPPED
> [INFO] Apache Tika translate .............................. SKIPPED
> [INFO] Apache Tika examples ............................... SKIPPED
> [INFO] Apache Tika Java-7 Components ...................... SKIPPED
> [INFO] Apache Tika ........................................ SKIPPED
> [INFO] ------------------------------------------------------------------------
> [INFO] BUILD FAILURE
> [INFO] ------------------------------------------------------------------------
>
> java version "17.0.12" 2024-07-16 LTS
> Java(TM) SE Runtime Environment (build 17.0.12+8-LTS-286)
> Java HotSpot(TM) 64-Bit Server VM (build 17.0.12+8-LTS-286, mixed mode, sharing)
>
> Tilman
>
> On 2026/09/25 20:45:22 Tim Allison wrote:
> > A candidate for the Tika 4.1.0 release is available at:
> > https://dist.apache.org/repos/dist/dev/tika/4.1.0
> >
> > The release candidate is a zip archive of the sources in:
> > https://github.com/apache/tika/tree/4.1.0-rc2/
> >
> > The SHA-512 checksum of the archive is
> > 4a71fe021015f58e1f518ed0671d201bc2eb5abe97fab51b54509a280780447260fe9b59e6be9d7694e04736f60ddc28ad49e83f17280839277e62d92413983e.
> >
> > In addition, a staged maven repository is available here:
> > https://repository.apache.org/content/repositories/orgapachetika-1133/org/apache/tika
> >
> > Please vote on releasing this package as Apache Tika 4.1.0.
> > The vote is open for the next 72 hours and passes if a majority of at
> > least three +1 Tika PMC votes are cast.
> >
> > [ ] +1 Release this package as Apache Tika 4.1.0
> > [ ] -1 Do not release this package because...
> >
> > Here's my +1
> >
> > Cheers,
> >
> > Tim
> >
>
Re: [VOTE] Release Apache Tika 4.1.0 Candidate #2
Posted by Tilman Hausherr <ti...@apache.org>.
+1
However it fails with tika-eval-app (which is less relevant because it's mostly for us)
[ERROR] Failures:
[ERROR] ComparerOneSidedLedgerTest.testOnlyB:57 expected: <TIMEOUT> but was: <null>
[ERROR] ProfilerDiscoveryTest.testDiscoversRunInfoAndSkipsItInCrawl:46->one:69 no row for: select run_value from run_info where run_key='batch.run.id' ==> expected: <true> but was: <false>
[INFO]
[ERROR] Tests run: 57, Failures: 2, Errors: 0, Skipped: 5
[INFO]
[INFO] ------------------------------------------------------------------------
[INFO] Reactor Summary for Apache Tika 4.1.0:
[INFO]
[INFO] Apache Tika eval application ....................... FAILURE [01:12 min]
[INFO] Apache Tika eval structure ......................... SKIPPED
[INFO] Apache Tika translate .............................. SKIPPED
[INFO] Apache Tika examples ............................... SKIPPED
[INFO] Apache Tika Java-7 Components ...................... SKIPPED
[INFO] Apache Tika ........................................ SKIPPED
[INFO] ------------------------------------------------------------------------
[INFO] BUILD FAILURE
[INFO] ------------------------------------------------------------------------
java version "17.0.12" 2024-07-16 LTS
Java(TM) SE Runtime Environment (build 17.0.12+8-LTS-286)
Java HotSpot(TM) 64-Bit Server VM (build 17.0.12+8-LTS-286, mixed mode, sharing)
Tilman
On 2026/09/25 20:45:22 Tim Allison wrote:
> A candidate for the Tika 4.1.0 release is available at:
> https://dist.apache.org/repos/dist/dev/tika/4.1.0
>
> The release candidate is a zip archive of the sources in:
> https://github.com/apache/tika/tree/4.1.0-rc2/
>
> The SHA-512 checksum of the archive is
> 4a71fe021015f58e1f518ed0671d201bc2eb5abe97fab51b54509a280780447260fe9b59e6be9d7694e04736f60ddc28ad49e83f17280839277e62d92413983e.
>
> In addition, a staged maven repository is available here:
> https://repository.apache.org/content/repositories/orgapachetika-1133/org/apache/tika
>
> Please vote on releasing this package as Apache Tika 4.1.0.
> The vote is open for the next 72 hours and passes if a majority of at
> least three +1 Tika PMC votes are cast.
>
> [ ] +1 Release this package as Apache Tika 4.1.0
> [ ] -1 Do not release this package because...
>
> Here's my +1
>
> Cheers,
>
> Tim
>