You are viewing a plain text version of this content. The canonical link for it is here.
Posted to dev@royale.apache.org by ap...@gmail.com on 2020/03/22 23:40:42 UTC

Build failed in Jenkins: royale-asjs_jsonly #1093

See <http://apacheroyaleci2.westus2.cloudapp.azure.com:8080/job/royale-asjs_jsonly/1093/display/redirect?page=changes>

Changes:

[carlosrovira] jewel-badge: temporal fix for badges clipped


------------------------------------------
Started by an SCM change
Running as SYSTEM
[EnvInject] - Loading node environment variables.
Building remotely on agent1 in workspace <http://apacheroyaleci2.westus2.cloudapp.azure.com:8080/job/royale-asjs_jsonly/ws/>
No credentials specified
 > C:\Program Files\Git\cmd\git.exe rev-parse --is-inside-work-tree # timeout=10
Fetching changes from the remote Git repository
 > C:\Program Files\Git\cmd\git.exe config remote.origin.url https://github.com/apache/royale-asjs # timeout=10
Fetching upstream changes from https://github.com/apache/royale-asjs
 > C:\Program Files\Git\cmd\git.exe --version # timeout=10
 > C:\Program Files\Git\cmd\git.exe fetch --tags --force --progress -- https://github.com/apache/royale-asjs +refs/heads/*:refs/remotes/origin/*
 > C:\Program Files\Git\cmd\git.exe rev-parse "refs/remotes/origin/develop^{commit}" # timeout=10
 > C:\Program Files\Git\cmd\git.exe rev-parse "refs/remotes/origin/origin/develop^{commit}" # timeout=10
Checking out Revision ecd7312c2073ba5fe78ae06b0bd44b1111d855b8 (refs/remotes/origin/develop)
 > C:\Program Files\Git\cmd\git.exe config core.sparsecheckout # timeout=10
 > C:\Program Files\Git\cmd\git.exe checkout -f ecd7312c2073ba5fe78ae06b0bd44b1111d855b8
Commit message: "jewel-badge: temporal fix for badges clipped"
 > C:\Program Files\Git\cmd\git.exe rev-list --no-walk 7695b701238e878b51ede0f0d847de30cccfe32a # timeout=10
[royale-asjs_jsonly] $ cmd.exe /C "C:\apache\apache-ant-1.9.9\bin\ant.bat -DROYALE_COMPILER_REPO=C:\jenkins\workspace\royale-compiler -Denv.ROYALE_TRANSPILER_HOME=C:\jenkins\workspace\royale-compiler\compiler-jx '"-Dbrowser=C:\Program Files\Mozilla Firefox\firefox.exe"' -DROYALE_TYPEDEFS_HOME=C:\jenkins\workspace\royale-typedefs -Dbuild.noprompt=true -Dplayerglobal.version=11.7 -Denv.ROYALE_COMPILER_HOME=C:\jenkins\workspace\royale-compiler\compiler release create-SHA-512 create-SHA-512-jsonly && exit %%ERRORLEVEL%%"
Buildfile: <http://apacheroyaleci2.westus2.cloudapp.azure.com:8080/job/royale-asjs_jsonly/ws/build.xml>

block-flat-fonts:

check-compiler-home:

check-typedefs-home:

thirdparty-clean:

thirdparty-clean:

pixelbender-clean:

swfobject-clean:

flat-ui-clean:

gcl-clean:
     [echo] Deleting Google Closure Library

clean:

examples-clean:

clean:

clean:

clean:

clean:

clean:

clean:

clean:

clean:

clean:

clean:

clean:

clean:

clean:

clean:

clean:

clean:

clean:

clean:

clean:

clean:

clean:

clean:

clean:

BUILD FAILED
<http://apacheroyaleci2.westus2.cloudapp.azure.com:8080/job/royale-asjs_jsonly/ws/build.xml>:630: The following error occurred while executing this line:
<http://apacheroyaleci2.westus2.cloudapp.azure.com:8080/job/royale-asjs_jsonly/ws/examples/build.xml>:163: Basedir <http://apacheroyaleci2.westus2.cloudapp.azure.com:8080/job/royale-asjs_jsonly/ws/examples/royale/TourDeJewel> does not exist

Total time: 1 second
Picked up JAVA_TOOL_OPTIONS: -Dfile.encoding=UTF-8 -Xms384m -Xmx2g
Build step 'Invoke Ant' marked build as failure
Skipped archiving because build is not successful

Build failed in Jenkins: royale-asjs_jsonly #1117

Posted by ap...@gmail.com.
See <http://apacheroyaleci2.westus2.cloudapp.azure.com:8080/job/royale-asjs_jsonly/1117/display/redirect>

Changes:


------------------------------------------
[...truncated 1.72 MB...]
main:

tweak-for-jsonly:
     [copy] Copying 1 file to <http://apacheroyaleci2.westus2.cloudapp.azure.com:8080/job/royale-asjs_jsonly/ws/frameworks/libs>
     [copy] Copying 1 file to <http://apacheroyaleci2.westus2.cloudapp.azure.com:8080/job/royale-asjs_jsonly/ws/temp>

check-royale-config:

fixup-royale-config:

ide:

post-build:
    [mkdir] Created dir: <http://apacheroyaleci2.westus2.cloudapp.azure.com:8080/job/royale-asjs_jsonly/ws/frameworks/locale>
    [mkdir] Created dir: <http://apacheroyaleci2.westus2.cloudapp.azure.com:8080/job/royale-asjs_jsonly/ws/frameworks/mx>
    [mkdir] Created dir: <http://apacheroyaleci2.westus2.cloudapp.azure.com:8080/job/royale-asjs_jsonly/ws/frameworks/rsls>
    [mkdir] Created dir: <http://apacheroyaleci2.westus2.cloudapp.azure.com:8080/job/royale-asjs_jsonly/ws/frameworks/themes/Halo>
     [copy] Copying 1 file to <http://apacheroyaleci2.westus2.cloudapp.azure.com:8080/job/royale-asjs_jsonly/ws/frameworks/themes/Halo>
     [copy] Copying 1 file to <http://apacheroyaleci2.westus2.cloudapp.azure.com:8080/job/royale-asjs_jsonly/ws/frameworks>
    [touch] Creating <http://apacheroyaleci2.westus2.cloudapp.azure.com:8080/job/royale-asjs_jsonly/ws/frameworks/macfonts.ser>
    [touch] Creating <http://apacheroyaleci2.westus2.cloudapp.azure.com:8080/job/royale-asjs_jsonly/ws/frameworks/winfonts.ser>
    [touch] Creating <http://apacheroyaleci2.westus2.cloudapp.azure.com:8080/job/royale-asjs_jsonly/ws/frameworks/localfonts.ser>

last-message-if-airsdk:

main:
     [echo] ant main target completed on 03/24/2020 03:57:01 PM

sample-themes:

check-runtime-env:

runtime-setup:

mustella-setup:

load-task:

marmotinni-setup:

prepare:
     [echo] Making lib directory <http://apacheroyaleci2.westus2.cloudapp.azure.com:8080/job/royale-asjs_jsonly/ws/marmotinni/java/c>:\jenkins\workspace\royale-asjs_jsonly\marmotinni\java/lib
    [mkdir] Created dir: <http://apacheroyaleci2.westus2.cloudapp.azure.com:8080/job/royale-asjs_jsonly/ws/marmotinni/java/lib>

selenium3-jar-check:

selenium3-jar:
    [mkdir] Created dir: <http://apacheroyaleci2.westus2.cloudapp.azure.com:8080/job/royale-asjs_jsonly/ws/marmotinni/java/lib/selenium>

download-zip:
    [mkdir] Created dir: <http://apacheroyaleci2.westus2.cloudapp.azure.com:8080/job/royale-asjs_jsonly/ws/marmotinni/java/in>
      [get] Getting: https://bit.ly/2zm3ZzF
      [get] To: <http://apacheroyaleci2.westus2.cloudapp.azure.com:8080/job/royale-asjs_jsonly/ws/marmotinni/java/in/client-combined-3.141.59.zip>
      [get] https://bit.ly/2zm3ZzF permanently moved to https://selenium-release.storage.googleapis.com/3.141/selenium-java-3.141.59.zip

untar-file:

unzip-file:
    [unzip] Expanding: <http://apacheroyaleci2.westus2.cloudapp.azure.com:8080/job/royale-asjs_jsonly/ws/marmotinni/java/in/client-combined-3.141.59.zip> into <http://apacheroyaleci2.westus2.cloudapp.azure.com:8080/job/royale-asjs_jsonly/ws/marmotinni/java/in/temp>

check-sum:

copy-downloaded-jar:
      [get] Getting: http://www.apache.org/licenses/LICENSE-2.0
      [get] To: <http://apacheroyaleci2.westus2.cloudapp.azure.com:8080/job/royale-asjs_jsonly/ws/marmotinni/java/lib/selenium/selenium-LICENSE.txt>
     [copy] Copying 10 files to <http://apacheroyaleci2.westus2.cloudapp.azure.com:8080/job/royale-asjs_jsonly/ws/marmotinni/java/lib/selenium>

clean:

main:

clean:
   [delete] Deleting: <http://apacheroyaleci2.westus2.cloudapp.azure.com:8080/job/royale-asjs_jsonly/ws/mustella/mustella.swc>

check-compiler-home:

check-compiler:

compile:

compile-js:
     [echo] Compiling mustella.swc
     [echo] ROYALE_HOME: <http://apacheroyaleci2.westus2.cloudapp.azure.com:8080/job/royale-asjs_jsonly/ws/>
     [echo] ROYALE_COMPILER_HOME: <http://apacheroyaleci2.westus2.cloudapp.azure.com:8080/job/royale-asjs_jsonly/ws/js>
     [java] args:
     [java] +royalelib=<http://apacheroyaleci2.westus2.cloudapp.azure.com:8080/job/royale-asjs_jsonly/ws/frameworks>
     [java] +playerglobal.version=11.7
     [java] +env.PLAYERGLOBAL_HOME=${env.PLAYERGLOBAL_HOME}
     [java] -compiler.strict-xml=true
     [java] -compiler.targets=SWF,JSRoyale
     [java] -output=<http://apacheroyaleci2.westus2.cloudapp.azure.com:8080/job/royale-asjs_jsonly/ws/mustella/mustella.swc>
     [java] -load-config=<http://apacheroyaleci2.westus2.cloudapp.azure.com:8080/job/royale-asjs_jsonly/ws/frameworks/js-config.xml>
     [java] -load-config+=<http://apacheroyaleci2.westus2.cloudapp.azure.com:8080/job/royale-asjs_jsonly/ws/mustella/src/main/config/compile-js-config.xml>
     [java] -js-load-config=<http://apacheroyaleci2.westus2.cloudapp.azure.com:8080/job/royale-asjs_jsonly/ws/frameworks/js-config.xml>
     [java] -js-load-config+=<http://apacheroyaleci2.westus2.cloudapp.azure.com:8080/job/royale-asjs_jsonly/ws/mustella/src/main/config/compile-js-config.xml>
     [java] target:SWF
     [java] target:JSRoyale
     [java] COMPC
     [java] Loading configuration: <http://apacheroyaleci2.westus2.cloudapp.azure.com:8080/job/royale-asjs_jsonly/ws/frameworks/js-config.xml>
     [java] Loading configuration: <http://apacheroyaleci2.westus2.cloudapp.azure.com:8080/job/royale-asjs_jsonly/ws/mustella/src/main/config/compile-js-config.xml>
     [java] 
     [java] 29261 bytes written to C:\jenkins\workspace\royale-asjs_jsonly\mustella\mustella.swc in 3.199 seconds
     [java] COMPCJSCRoyale
     [java] <http://apacheroyaleci2.westus2.cloudapp.azure.com:8080/job/royale-asjs_jsonly/ws/mustella/src/main/royale/DontSendScriptComplete.as(21)>: col: 8 Warning: No definitions matching flash.net.* could be found.
     [java] 
     [java] import flash.net.*;
     [java]        ^
     [java] 
     [java] <http://apacheroyaleci2.westus2.cloudapp.azure.com:8080/job/royale-asjs_jsonly/ws/mustella/src/main/royale/DontSendScriptComplete.as(22)>: col: 8 Warning: Definition flash.events.Event could not be found.
     [java] 
     [java] import flash.events.Event;
     [java]        ^
     [java] 
     [java] 5.3334555 seconds
     [java] <http://apacheroyaleci2.westus2.cloudapp.azure.com:8080/job/royale-asjs_jsonly/ws/mustella/src/main/royale/DontSendScriptComplete.as(21)>: col: 8 No definitions matching flash.net.* could be found.
     [java] 
     [java] import flash.net.*;
     [java]        ^
     [java] 
     [java] <http://apacheroyaleci2.westus2.cloudapp.azure.com:8080/job/royale-asjs_jsonly/ws/mustella/src/main/royale/DontSendScriptComplete.as(22)>: col: 8 Definition flash.events.Event could not be found.
     [java] 
     [java] import flash.events.Event;
     [java]        ^
     [java] 
     [java] Picked up JAVA_TOOL_OPTIONS: -Dfile.encoding=UTF-8 -Xms384m -Xmx2g
     [java] Java Result: 2

main:

basictests-compile-java:
   [delete] Deleting directory <http://apacheroyaleci2.westus2.cloudapp.azure.com:8080/job/royale-asjs_jsonly/ws/mustella/target/classes>
    [mkdir] Created dir: <http://apacheroyaleci2.westus2.cloudapp.azure.com:8080/job/royale-asjs_jsonly/ws/mustella/target/classes>
    [javac] <http://apacheroyaleci2.westus2.cloudapp.azure.com:8080/job/royale-asjs_jsonly/ws/build.xml>:1336: warning: 'includeantruntime' was not set, defaulting to build.sysclasspath=last; set to false for repeatable builds
    [javac] Compiling 12 source files to <http://apacheroyaleci2.westus2.cloudapp.azure.com:8080/job/royale-asjs_jsonly/ws/mustella/target/classes>
    [javac] Note: <http://apacheroyaleci2.westus2.cloudapp.azure.com:8080/job/royale-asjs_jsonly/ws/mustella/src/main/java/marmotinni/DispatchMouseClickEvent.java> uses or overrides a deprecated API.
    [javac] Note: Recompile with -Xlint:deprecation for details.

basictests:

basictests-mustella:

basictests-compile-js:
     [echo] ROYALE_HOME: <http://apacheroyaleci2.westus2.cloudapp.azure.com:8080/job/royale-asjs_jsonly/ws/>
     [echo] ROYALE_COMPILER_HOME: <http://apacheroyaleci2.westus2.cloudapp.azure.com:8080/job/royale-asjs_jsonly/ws/js>
     [echo] GOOG_HOME: <http://apacheroyaleci2.westus2.cloudapp.azure.com:8080/job/royale-asjs_jsonly/ws/js/lib/google/closure-library>
    [mxmlc] MXMLJSC
    [mxmlc] -sdk-js-lib=<http://apacheroyaleci2.westus2.cloudapp.azure.com:8080/job/royale-asjs_jsonly/ws/mustella/js>
    [mxmlc] -compiler.debug=true
    [mxmlc] +royalelib=<http://apacheroyaleci2.westus2.cloudapp.azure.com:8080/job/royale-asjs_jsonly/ws/frameworks/>
    [mxmlc] -closure-lib=<http://apacheroyaleci2.westus2.cloudapp.azure.com:8080/job/royale-asjs_jsonly/ws/js/lib/google/closure-library>
    [mxmlc] -compiler.targets=JSRoyale
    [mxmlc] -compiler.library-path=<http://apacheroyaleci2.westus2.cloudapp.azure.com:8080/job/royale-asjs_jsonly/ws/mustella/mustella.swc>
    [mxmlc] -compiler.js-external-library-path=<http://apacheroyaleci2.westus2.cloudapp.azure.com:8080/job/royale-asjs_jsonly/ws/js/libs/js.swc>
    [mxmlc] -compiler.js-library-path=<http://apacheroyaleci2.westus2.cloudapp.azure.com:8080/job/royale-asjs_jsonly/ws/frameworks/js/libs>
    [mxmlc] -compiler.js-library-path+=<http://apacheroyaleci2.westus2.cloudapp.azure.com:8080/job/royale-asjs_jsonly/ws/mustella/mustella.swc>
    [mxmlc] --
    [mxmlc] <http://apacheroyaleci2.westus2.cloudapp.azure.com:8080/job/royale-asjs_jsonly/ws/mustella/tests/basicTests/BasicTestsApp.mxml>
    [mxmlc] The project 'BasicTestsApp' has been successfully compiled.
    [mxmlc] 11.0909746 seconds
    [mxmlc] <http://apacheroyaleci2.westus2.cloudapp.azure.com:8080/job/royale-asjs_jsonly/ws/frameworks/js/libs/CoreJS.swc> Warning: The definition goog.events depended on by org.apache.royale.core.ElementWrapper in the SWC <http://apacheroyaleci2.westus2.cloudapp.azure.com:8080/job/royale-asjs_jsonly/ws/frameworks/js/libs/CoreJS.swc> could not be found
    [mxmlc] 
    [mxmlc] 
    [mxmlc] <http://apacheroyaleci2.westus2.cloudapp.azure.com:8080/job/royale-asjs_jsonly/ws/frameworks/js/libs/CoreJS.swc> Warning: The definition goog.events.BrowserEvent depended on by org.apache.royale.core.ElementWrapper in the SWC <http://apacheroyaleci2.westus2.cloudapp.azure.com:8080/job/royale-asjs_jsonly/ws/frameworks/js/libs/CoreJS.swc> could not be found
    [mxmlc] 
    [mxmlc] 
    [mxmlc] <http://apacheroyaleci2.westus2.cloudapp.azure.com:8080/job/royale-asjs_jsonly/ws/frameworks/js/libs/CoreJS.swc> Warning: The definition goog.DEBUG depended on by org.apache.royale.core.ElementWrapper in the SWC <http://apacheroyaleci2.westus2.cloudapp.azure.com:8080/job/royale-asjs_jsonly/ws/frameworks/js/libs/CoreJS.swc> could not be found
    [mxmlc] 
    [mxmlc] 
    [mxmlc] <http://apacheroyaleci2.westus2.cloudapp.azure.com:8080/job/royale-asjs_jsonly/ws/frameworks/js/libs/CoreJS.swc> Warning: The definition goog.events depended on by org.apache.royale.events.EventDispatcher in the SWC <http://apacheroyaleci2.westus2.cloudapp.azure.com:8080/job/royale-asjs_jsonly/ws/frameworks/js/libs/CoreJS.swc> could not be found
    [mxmlc] 
    [mxmlc] 
    [mxmlc] <http://apacheroyaleci2.westus2.cloudapp.azure.com:8080/job/royale-asjs_jsonly/ws/frameworks/js/libs/CoreJS.swc> Warning: The definition goog.events.EventTarget depended on by org.apache.royale.events.EventDispatcher in the SWC <http://apacheroyaleci2.westus2.cloudapp.azure.com:8080/job/royale-asjs_jsonly/ws/frameworks/js/libs/CoreJS.swc> could not be found
    [mxmlc] 
    [mxmlc] 
    [mxmlc] <http://apacheroyaleci2.westus2.cloudapp.azure.com:8080/job/royale-asjs_jsonly/ws/frameworks/js/libs/CoreJS.swc> Warning: The definition goog.events.Listener depended on by org.apache.royale.events.EventDispatcher in the SWC <http://apacheroyaleci2.westus2.cloudapp.azure.com:8080/job/royale-asjs_jsonly/ws/frameworks/js/libs/CoreJS.swc> could not be found
    [mxmlc] 
    [mxmlc] 
    [mxmlc] <http://apacheroyaleci2.westus2.cloudapp.azure.com:8080/job/royale-asjs_jsonly/ws/frameworks/js/libs/CoreJS.swc> Warning: The definition goog.events.BrowserEvent depended on by org.apache.royale.events.MouseEvent in the SWC <http://apacheroyaleci2.westus2.cloudapp.azure.com:8080/job/royale-asjs_jsonly/ws/frameworks/js/libs/CoreJS.swc> could not be found
    [mxmlc] 
    [mxmlc] 
    [mxmlc] <http://apacheroyaleci2.westus2.cloudapp.azure.com:8080/job/royale-asjs_jsonly/ws/frameworks/js/libs/CoreJS.swc> Warning: The definition goog.events.Event depended on by org.apache.royale.events.utils.MouseEventConverter in the SWC <http://apacheroyaleci2.westus2.cloudapp.azure.com:8080/job/royale-asjs_jsonly/ws/frameworks/js/libs/CoreJS.swc> could not be found
    [mxmlc] 
    [mxmlc] 
    [mxmlc] <http://apacheroyaleci2.westus2.cloudapp.azure.com:8080/job/royale-asjs_jsonly/ws/frameworks/js/libs/CoreJS.swc> Warning: The definition goog.events.BrowserEvent depended on by org.apache.royale.events.utils.MouseEventConverter in the SWC <http://apacheroyaleci2.westus2.cloudapp.azure.com:8080/job/royale-asjs_jsonly/ws/frameworks/js/libs/CoreJS.swc> could not be found
    [mxmlc] 
    [mxmlc] 
    [mxmlc] <http://apacheroyaleci2.westus2.cloudapp.azure.com:8080/job/royale-asjs_jsonly/ws/frameworks/js/libs/CoreJS.swc> Warning: The definition goog.events.BrowserEvent depended on by org.apache.royale.events.BrowserEvent in the SWC <http://apacheroyaleci2.westus2.cloudapp.azure.com:8080/job/royale-asjs_jsonly/ws/frameworks/js/libs/CoreJS.swc> could not be found
    [mxmlc] 
    [mxmlc] 
    [mxmlc] <http://apacheroyaleci2.westus2.cloudapp.azure.com:8080/job/royale-asjs_jsonly/ws/frameworks/js/libs/CoreJS.swc> Warning: The definition goog.DEBUG depended on by org.apache.royale.debugging.assert in the SWC <http://apacheroyaleci2.westus2.cloudapp.azure.com:8080/job/royale-asjs_jsonly/ws/frameworks/js/libs/CoreJS.swc> could not be found
    [mxmlc] 
    [mxmlc] 
    [mxmlc] <http://apacheroyaleci2.westus2.cloudapp.azure.com:8080/job/royale-asjs_jsonly/ws/frameworks/js/libs/CoreJS.swc> Warning: The definition goog.bind depended on by org.apache.royale.utils.MXMLDataInterpreter in the SWC <http://apacheroyaleci2.westus2.cloudapp.azure.com:8080/job/royale-asjs_jsonly/ws/frameworks/js/libs/CoreJS.swc> could not be found
    [mxmlc] 
    [mxmlc] 
    [mxmlc] <http://apacheroyaleci2.westus2.cloudapp.azure.com:8080/job/royale-asjs_jsonly/ws/frameworks/js/libs/CoreJS.swc> Warning: The definition goog.events.BrowserEvent depended on by org.apache.royale.events.IBrowserEvent in the SWC <http://apacheroyaleci2.westus2.cloudapp.azure.com:8080/job/royale-asjs_jsonly/ws/frameworks/js/libs/CoreJS.swc> could not be found
    [mxmlc] 
    [mxmlc] 
    [mxmlc] <http://apacheroyaleci2.westus2.cloudapp.azure.com:8080/job/royale-asjs_jsonly/ws/frameworks/js/libs/CoreJS.swc> Warning: The definition goog.events.Event depended on by org.apache.royale.events.Event in the SWC <http://apacheroyaleci2.westus2.cloudapp.azure.com:8080/job/royale-asjs_jsonly/ws/frameworks/js/libs/CoreJS.swc> could not be found
    [mxmlc] 
    [mxmlc] 
    [mxmlc] Picked up JAVA_TOOL_OPTIONS: -Dfile.encoding=UTF-8 -Xms384m -Xmx2g

basictests-run-js:
     [echo] GECKODRIVER_HOME=C:\\geckodriver\\geckodriver.exe
     [echo] url=file://<http://apacheroyaleci2.westus2.cloudapp.azure.com:8080/job/royale-asjs_jsonly/ws/mustella/tests/basicTests/bin/js-debug/index.html>
     [echo] script=<http://apacheroyaleci2.westus2.cloudapp.azure.com:8080/job/royale-asjs_jsonly/ws/mustella/tests/basicTests/halo/scripts/ButtonTestScript.mxml>
     [echo] script=<http://apacheroyaleci2.westus2.cloudapp.azure.com:8080/job/royale-asjs_jsonly/ws/mustella/tests/basicTests/halo/scripts/CheckBoxTestScript.mxml>
     [java] file://<http://apacheroyaleci2.westus2.cloudapp.azure.com:8080/job/royale-asjs_jsonly/ws/mustella/tests/basicTests/bin/js-debug/index.html>
     [java] 1585065444341	mozrunner::runner	INFO	Running command: "C:\\Program Files\\Mozilla Firefox\\firefox.exe" "-marionette" "-foreground" "-no-remote" "-profile" "C:\\Users\\ApacheRoyaleCI\\AppData\\Local\\Temp\\rust_mozprofile.q35JjigtzGuK"
     [java] Exception in thread "main" org.openqa.selenium.WebDriverException: permission denied
     [java] Build info: version: '3.141.59', revision: 'e82be7d358', time: '2018-11-14T08:25:48'
     [java] System info: host: 'ApacheRoyaleCI', ip: '10.0.0.5', os.name: 'Windows Server 2016', os.arch: 'amd64', os.version: '10.0', java.version: '1.8.0_201'
     [java] Driver info: driver.version: FirefoxDriver
     [java] remote stacktrace: 
     [java] 	at sun.reflect.NativeConstructorAccessorImpl.newInstance0(Native Method)
     [java] 	at sun.reflect.NativeConstructorAccessorImpl.newInstance(NativeConstructorAccessorImpl.java:62)
     [java] 	at sun.reflect.DelegatingConstructorAccessorImpl.newInstance(DelegatingConstructorAccessorImpl.java:45)
     [java] 	at java.lang.reflect.Constructor.newInstance(Constructor.java:423)
     [java] 	at org.openqa.selenium.remote.W3CHandshakeResponse.lambda$errorHandler$0(W3CHandshakeResponse.java:62)
     [java] 	at org.openqa.selenium.remote.HandshakeResponse.lambda$getResponseFunction$0(HandshakeResponse.java:30)
     [java] 	at org.openqa.selenium.remote.ProtocolHandshake.lambda$createSession$0(ProtocolHandshake.java:126)
     [java] 	at java.util.stream.ReferencePipeline$3$1.accept(ReferencePipeline.java:193)
     [java] 	at java.util.Spliterators$ArraySpliterator.tryAdvance(Spliterators.java:958)
     [java] 	at java.util.stream.ReferencePipeline.forEachWithCancel(ReferencePipeline.java:126)
     [java] 	at java.util.stream.AbstractPipeline.copyIntoWithCancel(AbstractPipeline.java:498)
     [java] 	at java.util.stream.AbstractPipeline.copyInto(AbstractPipeline.java:485)
     [java] 	at java.util.stream.AbstractPipeline.wrapAndCopyInto(AbstractPipeline.java:471)
     [java] 	at java.util.stream.FindOps$FindOp.evaluateSequential(FindOps.java:152)
     [java] 	at java.util.stream.AbstractPipeline.evaluate(AbstractPipeline.java:234)
     [java] 	at java.util.stream.ReferencePipeline.findFirst(ReferencePipeline.java:464)
     [java] 	at org.openqa.selenium.remote.ProtocolHandshake.createSession(ProtocolHandshake.java:128)
     [java] 	at org.openqa.selenium.remote.ProtocolHandshake.createSession(ProtocolHandshake.java:74)
     [java] 	at org.openqa.selenium.remote.HttpCommandExecutor.execute(HttpCommandExecutor.java:136)
     [java] 	at org.openqa.selenium.remote.service.DriverCommandExecutor.execute(DriverCommandExecutor.java:83)
     [java] 	at org.openqa.selenium.remote.RemoteWebDriver.execute(RemoteWebDriver.java:552)
     [java] 	at org.openqa.selenium.remote.RemoteWebDriver.startSession(RemoteWebDriver.java:213)
     [java] 	at org.openqa.selenium.remote.RemoteWebDriver.<init>(RemoteWebDriver.java:131)
     [java] 	at org.openqa.selenium.firefox.FirefoxDriver.<init>(FirefoxDriver.java:147)
     [java] 	at marmotinni.MarmotinniRunner.main(Unknown Source)
     [java] Picked up JAVA_TOOL_OPTIONS: -Dfile.encoding=UTF-8 -Xms384m -Xmx2g

BUILD FAILED
<http://apacheroyaleci2.westus2.cloudapp.azure.com:8080/job/royale-asjs_jsonly/ws/build.xml>:1283: Java returned: 1

Total time: 15 minutes 59 seconds
Picked up JAVA_TOOL_OPTIONS: -Dfile.encoding=UTF-8 -Xms384m -Xmx2g
Build step 'Invoke Ant' marked build as failure
Skipped archiving because build is not successful

Build failed in Jenkins: royale-asjs_jsonly #1116

Posted by ap...@gmail.com.
See <http://apacheroyaleci2.westus2.cloudapp.azure.com:8080/job/royale-asjs_jsonly/1116/display/redirect?page=changes>

Changes:

[piotrzarzycki21] Adjust cleanup after moving TourDeJewel


------------------------------------------
[...truncated 116.33 KB...]

clean-tests:

clean:
     [echo] swc-date is 03/24/20 15:07 +0000
   [delete] Deleting: <http://apacheroyaleci2.westus2.cloudapp.azure.com:8080/job/royale-asjs_jsonly/ws/frameworks/js/projects/RoyaleUnitJS/RoyaleUnitJS.swc.properties>

clean:
     [echo] swc-date is 03/24/20 15:07 +0000
   [delete] Deleting: <http://apacheroyaleci2.westus2.cloudapp.azure.com:8080/job/royale-asjs_jsonly/ws/frameworks/js/projects/RoyaleUnitJS/RoyaleUnitJS.swc.properties>

check-for-tests:

clean-tests:

clean:
     [echo] swc-date is 03/24/20 15:07 +0000
   [delete] Deleting: <http://apacheroyaleci2.westus2.cloudapp.azure.com:8080/job/royale-asjs_jsonly/ws/frameworks/js/projects/StorageJS/StorageJS.swc.properties>

clean:
     [echo] swc-date is 03/24/20 15:07 +0000
   [delete] Deleting: <http://apacheroyaleci2.westus2.cloudapp.azure.com:8080/job/royale-asjs_jsonly/ws/frameworks/js/projects/StorageJS/StorageJS.swc.properties>

check-for-tests:

clean-tests:
     [echo] swc-date is 03/24/20 15:07 +0000
   [delete] Deleting: <http://apacheroyaleci2.westus2.cloudapp.azure.com:8080/job/royale-asjs_jsonly/ws/frameworks/js/projects/TextJS/TextJS.swc.properties>

clean:
     [echo] swc-date is 03/24/20 15:07 +0000
   [delete] Deleting: <http://apacheroyaleci2.westus2.cloudapp.azure.com:8080/job/royale-asjs_jsonly/ws/frameworks/js/projects/TextJS/TextJS.swc.properties>

check-for-tests:

clean-tests:
     [echo] swc-date is 03/24/20 15:07 +0000
   [delete] Deleting: <http://apacheroyaleci2.westus2.cloudapp.azure.com:8080/job/royale-asjs_jsonly/ws/frameworks/js/projects/TLFJS/TLFJS.swc.properties>

clean:
     [echo] swc-date is 03/24/20 15:07 +0000
   [delete] Deleting: <http://apacheroyaleci2.westus2.cloudapp.azure.com:8080/job/royale-asjs_jsonly/ws/frameworks/js/projects/TLFJS/TLFJS.swc.properties>

check-for-tests:

clean-tests:
     [echo] swc-date is 03/24/20 15:07 +0000
   [delete] Deleting: <http://apacheroyaleci2.westus2.cloudapp.azure.com:8080/job/royale-asjs_jsonly/ws/frameworks/js/projects/XMLJS/XMLJS.swc.properties>

clean:
     [echo] swc-date is 03/24/20 15:07 +0000
   [delete] Deleting: <http://apacheroyaleci2.westus2.cloudapp.azure.com:8080/job/royale-asjs_jsonly/ws/frameworks/js/projects/XMLJS/XMLJS.swc.properties>

check-for-tests:

clean-tests:

clean:
     [echo] swc-date is 03/24/20 15:07 +0000
   [delete] Deleting: <http://apacheroyaleci2.westus2.cloudapp.azure.com:8080/job/royale-asjs_jsonly/ws/frameworks/js/projects/IconsJS/IconsJS.swc.properties>

clean:
     [echo] swc-date is 03/24/20 15:07 +0000
   [delete] Deleting: <http://apacheroyaleci2.westus2.cloudapp.azure.com:8080/job/royale-asjs_jsonly/ws/frameworks/js/projects/IconsJS/IconsJS.swc.properties>

check-for-tests:

clean-tests:
     [echo] swc-date is 03/24/20 15:07 +0000
   [delete] Deleting: <http://apacheroyaleci2.westus2.cloudapp.azure.com:8080/job/royale-asjs_jsonly/ws/frameworks/js/projects/JewelJS/JewelJS.swc.properties>

clean:
     [echo] swc-date is 03/24/20 15:07 +0000
   [delete] Deleting: <http://apacheroyaleci2.westus2.cloudapp.azure.com:8080/job/royale-asjs_jsonly/ws/frameworks/js/projects/JewelJS/JewelJS.swc.properties>

check-for-tests:

clean-tests:
     [echo] swc-date is 03/24/20 15:07 +0000
   [delete] Deleting: <http://apacheroyaleci2.westus2.cloudapp.azure.com:8080/job/royale-asjs_jsonly/ws/frameworks/js/projects/MXRoyaleJS/MXRoyaleJS.swc.properties>

clean:
     [echo] swc-date is 03/24/20 15:07 +0000
   [delete] Deleting: <http://apacheroyaleci2.westus2.cloudapp.azure.com:8080/job/royale-asjs_jsonly/ws/frameworks/js/projects/MXRoyaleJS/MXRoyaleJS.swc.properties>

check-for-tests:

clean-tests:

clean:
     [echo] swc-date is 03/24/20 15:07 +0000
   [delete] Deleting: <http://apacheroyaleci2.westus2.cloudapp.azure.com:8080/job/royale-asjs_jsonly/ws/frameworks/js/projects/CruxJS/CruxJS.swc.properties>

clean:
     [echo] swc-date is 03/24/20 15:07 +0000
   [delete] Deleting: <http://apacheroyaleci2.westus2.cloudapp.azure.com:8080/job/royale-asjs_jsonly/ws/frameworks/js/projects/CruxJS/CruxJS.swc.properties>

check-for-tests:

clean-tests:
     [echo] swc-date is 03/24/20 15:07 +0000
   [delete] Deleting: <http://apacheroyaleci2.westus2.cloudapp.azure.com:8080/job/royale-asjs_jsonly/ws/frameworks/js/projects/SparkRoyaleJS/SparkRoyaleJS.swc.properties>

clean:
     [echo] swc-date is 03/24/20 15:07 +0000
   [delete] Deleting: <http://apacheroyaleci2.westus2.cloudapp.azure.com:8080/job/royale-asjs_jsonly/ws/frameworks/js/projects/SparkRoyaleJS/SparkRoyaleJS.swc.properties>

check-for-tests:

clean-tests:
     [echo] swc-date is 03/24/20 15:07 +0000
   [delete] Deleting: <http://apacheroyaleci2.westus2.cloudapp.azure.com:8080/job/royale-asjs_jsonly/ws/frameworks/js/projects/AceJS/AceJS.swc.properties>

clean:
     [echo] swc-date is 03/24/20 15:07 +0000
   [delete] Deleting: <http://apacheroyaleci2.westus2.cloudapp.azure.com:8080/job/royale-asjs_jsonly/ws/frameworks/js/projects/AceJS/AceJS.swc.properties>

check-for-tests:

clean-tests:
     [echo] swc-date is 03/24/20 15:07 +0000
   [delete] Deleting: <http://apacheroyaleci2.westus2.cloudapp.azure.com:8080/job/royale-asjs_jsonly/ws/frameworks/js/projects/RoyaleSiteJS/RoyaleSiteJS.swc.properties>

clean:
     [echo] swc-date is 03/24/20 15:07 +0000
   [delete] Deleting: <http://apacheroyaleci2.westus2.cloudapp.azure.com:8080/job/royale-asjs_jsonly/ws/frameworks/js/projects/RoyaleSiteJS/RoyaleSiteJS.swc.properties>

check-for-tests:

clean-tests:
   [delete] Deleting directory <http://apacheroyaleci2.westus2.cloudapp.azure.com:8080/job/royale-asjs_jsonly/ws/frameworks/js/libs>

package-clean:
   [delete] Deleting directory <http://apacheroyaleci2.westus2.cloudapp.azure.com:8080/job/royale-asjs_jsonly/ws/out>

clean-temp:
   [delete] Deleting directory <http://apacheroyaleci2.westus2.cloudapp.azure.com:8080/job/royale-asjs_jsonly/ws/temp/royale-asjs>

checkintests-clean:
   [delete] Deleting directory <http://apacheroyaleci2.westus2.cloudapp.azure.com:8080/job/royale-asjs_jsonly/ws/mustella/tests/basicTests/bin>

mxtests-clean:

clean:
   [delete] Deleting: <http://apacheroyaleci2.westus2.cloudapp.azure.com:8080/job/royale-asjs_jsonly/ws/royale-sdk-description.xml>
   [delete] Deleting directory <http://apacheroyaleci2.westus2.cloudapp.azure.com:8080/job/royale-asjs_jsonly/ws/js/libs>
   [delete] Deleting directory <http://apacheroyaleci2.westus2.cloudapp.azure.com:8080/job/royale-asjs_jsonly/ws/temp>
     [echo] ROYALE_HOME = <http://apacheroyaleci2.westus2.cloudapp.azure.com:8080/job/royale-asjs_jsonly/ws/>
     [echo] royalelib = <http://apacheroyaleci2.westus2.cloudapp.azure.com:8080/job/royale-asjs_jsonly/ws/frameworks>
     [echo] doc_output = <http://apacheroyaleci2.westus2.cloudapp.azure.com:8080/job/royale-asjs_jsonly/ws/asdoc-output>
     [echo] compiler.source-path = <http://apacheroyaleci2.westus2.cloudapp.azure.com:8080/job/royale-asjs_jsonly/ws/frameworks/projects/*/src/main/royale>

clean:

super-clean:
   [delete] Deleting directory <http://apacheroyaleci2.westus2.cloudapp.azure.com:8080/job/royale-asjs_jsonly/ws/frameworks/libs/player>
   [delete] Deleting directory <http://apacheroyaleci2.westus2.cloudapp.azure.com:8080/job/royale-asjs_jsonly/ws/frameworks/libs/air>
   [delete] Deleting directory <http://apacheroyaleci2.westus2.cloudapp.azure.com:8080/job/royale-asjs_jsonly/ws/frameworks/locale>
   [delete] Deleting directory <http://apacheroyaleci2.westus2.cloudapp.azure.com:8080/job/royale-asjs_jsonly/ws/frameworks/mx>
   [delete] Deleting directory <http://apacheroyaleci2.westus2.cloudapp.azure.com:8080/job/royale-asjs_jsonly/ws/frameworks/rsls>
   [delete] Deleting directory <http://apacheroyaleci2.westus2.cloudapp.azure.com:8080/job/royale-asjs_jsonly/ws/frameworks/themes/Halo>
   [delete] Deleting directory <http://apacheroyaleci2.westus2.cloudapp.azure.com:8080/job/royale-asjs_jsonly/ws/frameworks/themes/Spark>
   [delete] Deleting: <http://apacheroyaleci2.westus2.cloudapp.azure.com:8080/job/royale-asjs_jsonly/ws/frameworks/airmobile-config.xml>
   [delete] Deleting: <http://apacheroyaleci2.westus2.cloudapp.azure.com:8080/job/royale-asjs_jsonly/ws/frameworks/macfonts.ser>
   [delete] Deleting: <http://apacheroyaleci2.westus2.cloudapp.azure.com:8080/job/royale-asjs_jsonly/ws/frameworks/winfonts.ser>
   [delete] Deleting: <http://apacheroyaleci2.westus2.cloudapp.azure.com:8080/job/royale-asjs_jsonly/ws/frameworks/localfonts.ser>
   [delete] Deleting: <http://apacheroyaleci2.westus2.cloudapp.azure.com:8080/job/royale-asjs_jsonly/ws/frameworks/mxml-manifest.xml>
   [delete] Deleting: <http://apacheroyaleci2.westus2.cloudapp.azure.com:8080/job/royale-asjs_jsonly/ws/frameworks/spark-manifest.xml>
   [delete] Deleting: <http://apacheroyaleci2.westus2.cloudapp.azure.com:8080/job/royale-asjs_jsonly/ws/ide/flashbuilder/flashbuilder-config.xml>

create-description:
     [echo] build.number is 20200324

js-output-royale-description:

swf-js-output-royale-description:

create-config:

playerglobal-setswfversion:

create-config:
     [copy] Copying 1 file to <http://apacheroyaleci2.westus2.cloudapp.azure.com:8080/job/royale-asjs_jsonly/ws/frameworks>

tweak-for-jsonly:

tweak-for-jsonly:
     [copy] Warning: Could not find file <http://apacheroyaleci2.westus2.cloudapp.azure.com:8080/job/royale-asjs_jsonly/ws/js/libs/js.swc> to copy.
     [copy] Copying 1 file to <http://apacheroyaleci2.westus2.cloudapp.azure.com:8080/job/royale-asjs_jsonly/ws/temp>

check-royale-config:

fixup-royale-config:

playerglobal-setswfversion:

create-config:
     [copy] Copying 1 file to <http://apacheroyaleci2.westus2.cloudapp.azure.com:8080/job/royale-asjs_jsonly/ws/frameworks>

tweak-for-jsonly:

playerglobal-setswfversion:

create-config:
     [copy] Copying 1 file to <http://apacheroyaleci2.westus2.cloudapp.azure.com:8080/job/royale-asjs_jsonly/ws/frameworks>

tweak-for-jsonly:

playerglobal-setswfversion:

create-config:
     [copy] Copying 1 file to <http://apacheroyaleci2.westus2.cloudapp.azure.com:8080/job/royale-asjs_jsonly/ws/frameworks>

tweak-for-jsonly:

playerglobal-setswfversion:

create-config:
     [copy] Copying 1 file to <http://apacheroyaleci2.westus2.cloudapp.azure.com:8080/job/royale-asjs_jsonly/ws/frameworks>

tweak-for-jsonly:

playerglobal-setswfversion:

create-config:
     [copy] Copying 1 file to <http://apacheroyaleci2.westus2.cloudapp.azure.com:8080/job/royale-asjs_jsonly/ws/frameworks>

tweak-for-jsonly:

playerglobal-setswfversion:

create-config:
     [copy] Copying 1 file to <http://apacheroyaleci2.westus2.cloudapp.azure.com:8080/job/royale-asjs_jsonly/ws/frameworks>

tweak-for-jsonly:

playerglobal-setswfversion:

create-config:
     [copy] Copying 1 file to <http://apacheroyaleci2.westus2.cloudapp.azure.com:8080/job/royale-asjs_jsonly/ws/frameworks>

tweak-for-jsonly:
    [mkdir] Created dir: <http://apacheroyaleci2.westus2.cloudapp.azure.com:8080/job/royale-asjs_jsonly/ws/frameworks/themes/Spark>

stage-source:

clean-temp:
Build step 'Invoke Ant' marked build as failure
Skipped archiving because build is not successful

Build failed in Jenkins: royale-asjs_jsonly #1115

Posted by ap...@gmail.com.
See <http://apacheroyaleci2.westus2.cloudapp.azure.com:8080/job/royale-asjs_jsonly/1115/display/redirect?page=changes>

Changes:

[piotrzarzycki21] Adjust ant build after moving TourDeJewel to different folder


------------------------------------------
Started by user Apache Royale
Running as SYSTEM
[EnvInject] - Loading node environment variables.
Building remotely on agent1 in workspace <http://apacheroyaleci2.westus2.cloudapp.azure.com:8080/job/royale-asjs_jsonly/ws/>
No credentials specified
 > C:\Program Files\Git\cmd\git.exe rev-parse --is-inside-work-tree # timeout=10
Fetching changes from the remote Git repository
 > C:\Program Files\Git\cmd\git.exe config remote.origin.url https://github.com/apache/royale-asjs # timeout=10
Fetching upstream changes from https://github.com/apache/royale-asjs
 > C:\Program Files\Git\cmd\git.exe --version # timeout=10
 > C:\Program Files\Git\cmd\git.exe fetch --tags --force --progress -- https://github.com/apache/royale-asjs +refs/heads/*:refs/remotes/origin/*
 > C:\Program Files\Git\cmd\git.exe rev-parse "refs/remotes/origin/develop^{commit}" # timeout=10
 > C:\Program Files\Git\cmd\git.exe rev-parse "refs/remotes/origin/origin/develop^{commit}" # timeout=10
Checking out Revision 151571cf6cbcae6412c7aff3e089cfd032f6bd6e (refs/remotes/origin/develop)
 > C:\Program Files\Git\cmd\git.exe config core.sparsecheckout # timeout=10
 > C:\Program Files\Git\cmd\git.exe checkout -f 151571cf6cbcae6412c7aff3e089cfd032f6bd6e
Commit message: "Adjust ant build after moving TourDeJewel to different folder"
 > C:\Program Files\Git\cmd\git.exe rev-list --no-walk 8a2aa8a421e4766fb9d2f19b2be92673588a23e3 # timeout=10
[royale-asjs_jsonly] $ cmd.exe /C "C:\apache\apache-ant-1.9.9\bin\ant.bat -DROYALE_COMPILER_REPO=C:\jenkins\workspace\royale-compiler -Denv.ROYALE_TRANSPILER_HOME=C:\jenkins\workspace\royale-compiler\compiler-jx '"-Dbrowser=C:\Program Files\Mozilla Firefox\firefox.exe"' -DROYALE_TYPEDEFS_HOME=C:\jenkins\workspace\royale-typedefs -Dbuild.noprompt=true -Dplayerglobal.version=11.7 -Denv.ROYALE_COMPILER_HOME=C:\jenkins\workspace\royale-compiler\compiler release create-SHA-512 create-SHA-512-jsonly && exit %%ERRORLEVEL%%"
Buildfile: <http://apacheroyaleci2.westus2.cloudapp.azure.com:8080/job/royale-asjs_jsonly/ws/build.xml>

block-flat-fonts:

check-compiler-home:

check-typedefs-home:

thirdparty-clean:

thirdparty-clean:

pixelbender-clean:

swfobject-clean:

flat-ui-clean:

gcl-clean:
     [echo] Deleting Google Closure Library

clean:

examples-clean:

clean:

clean:

clean:

clean:

clean:

clean:

clean:

clean:

clean:

clean:

clean:

clean:

clean:

clean:

clean:

clean:

clean:

clean:

clean:

clean:

clean:

clean:

clean:

BUILD FAILED
<http://apacheroyaleci2.westus2.cloudapp.azure.com:8080/job/royale-asjs_jsonly/ws/build.xml>:630: The following error occurred while executing this line:
<http://apacheroyaleci2.westus2.cloudapp.azure.com:8080/job/royale-asjs_jsonly/ws/examples/build.xml>:163: Basedir <http://apacheroyaleci2.westus2.cloudapp.azure.com:8080/job/royale-asjs_jsonly/ws/examples/royale/TourDeJewel> does not exist

Total time: 1 second
Picked up JAVA_TOOL_OPTIONS: -Dfile.encoding=UTF-8 -Xms384m -Xmx2g
Build step 'Invoke Ant' marked build as failure
Skipped archiving because build is not successful

Build failed in Jenkins: royale-asjs_jsonly #1114

Posted by ap...@gmail.com.
See <http://apacheroyaleci2.westus2.cloudapp.azure.com:8080/job/royale-asjs_jsonly/1114/display/redirect>

Changes:


------------------------------------------
Started by upstream project "royale-typedefs" build number 450
originally caused by:
 Started by an SCM change
Running as SYSTEM
[EnvInject] - Loading node environment variables.
Building remotely on agent1 in workspace <http://apacheroyaleci2.westus2.cloudapp.azure.com:8080/job/royale-asjs_jsonly/ws/>
No credentials specified
 > C:\Program Files\Git\cmd\git.exe rev-parse --is-inside-work-tree # timeout=10
Fetching changes from the remote Git repository
 > C:\Program Files\Git\cmd\git.exe config remote.origin.url https://github.com/apache/royale-asjs # timeout=10
Fetching upstream changes from https://github.com/apache/royale-asjs
 > C:\Program Files\Git\cmd\git.exe --version # timeout=10
 > C:\Program Files\Git\cmd\git.exe fetch --tags --force --progress -- https://github.com/apache/royale-asjs +refs/heads/*:refs/remotes/origin/*
 > C:\Program Files\Git\cmd\git.exe rev-parse "refs/remotes/origin/develop^{commit}" # timeout=10
 > C:\Program Files\Git\cmd\git.exe rev-parse "refs/remotes/origin/origin/develop^{commit}" # timeout=10
Checking out Revision 8a2aa8a421e4766fb9d2f19b2be92673588a23e3 (refs/remotes/origin/develop)
 > C:\Program Files\Git\cmd\git.exe config core.sparsecheckout # timeout=10
 > C:\Program Files\Git\cmd\git.exe checkout -f 8a2aa8a421e4766fb9d2f19b2be92673588a23e3
Commit message: "tour-de-jewel: update all examples to use itemsVerticalAlign="itemsCenter""
 > C:\Program Files\Git\cmd\git.exe rev-list --no-walk 8a2aa8a421e4766fb9d2f19b2be92673588a23e3 # timeout=10
[royale-asjs_jsonly] $ cmd.exe /C "C:\apache\apache-ant-1.9.9\bin\ant.bat -DROYALE_COMPILER_REPO=C:\jenkins\workspace\royale-compiler -Denv.ROYALE_TRANSPILER_HOME=C:\jenkins\workspace\royale-compiler\compiler-jx '"-Dbrowser=C:\Program Files\Mozilla Firefox\firefox.exe"' -DROYALE_TYPEDEFS_HOME=C:\jenkins\workspace\royale-typedefs -Dbuild.noprompt=true -Dplayerglobal.version=11.7 -Denv.ROYALE_COMPILER_HOME=C:\jenkins\workspace\royale-compiler\compiler release create-SHA-512 create-SHA-512-jsonly && exit %%ERRORLEVEL%%"
Buildfile: <http://apacheroyaleci2.westus2.cloudapp.azure.com:8080/job/royale-asjs_jsonly/ws/build.xml>

block-flat-fonts:

check-compiler-home:

check-typedefs-home:

thirdparty-clean:

thirdparty-clean:

pixelbender-clean:

swfobject-clean:

flat-ui-clean:

gcl-clean:
     [echo] Deleting Google Closure Library

clean:

examples-clean:

clean:

clean:

clean:

clean:

clean:

clean:

clean:

clean:

clean:

clean:

clean:

clean:

clean:

clean:

clean:

clean:

clean:

clean:

clean:

clean:

clean:

clean:

clean:

BUILD FAILED
<http://apacheroyaleci2.westus2.cloudapp.azure.com:8080/job/royale-asjs_jsonly/ws/build.xml>:630: The following error occurred while executing this line:
<http://apacheroyaleci2.westus2.cloudapp.azure.com:8080/job/royale-asjs_jsonly/ws/examples/build.xml>:163: Basedir <http://apacheroyaleci2.westus2.cloudapp.azure.com:8080/job/royale-asjs_jsonly/ws/examples/royale/TourDeJewel> does not exist

Total time: 0 seconds
Picked up JAVA_TOOL_OPTIONS: -Dfile.encoding=UTF-8 -Xms384m -Xmx2g
Build step 'Invoke Ant' marked build as failure
Skipped archiving because build is not successful

Build failed in Jenkins: royale-asjs_jsonly #1113

Posted by ap...@gmail.com.
See <http://apacheroyaleci2.westus2.cloudapp.azure.com:8080/job/royale-asjs_jsonly/1113/display/redirect>

Changes:


------------------------------------------
Started by upstream project "royale-typedefs" build number 449
originally caused by:
 Started by an SCM change
Running as SYSTEM
[EnvInject] - Loading node environment variables.
Building remotely on agent1 in workspace <http://apacheroyaleci2.westus2.cloudapp.azure.com:8080/job/royale-asjs_jsonly/ws/>
No credentials specified
 > C:\Program Files\Git\cmd\git.exe rev-parse --is-inside-work-tree # timeout=10
Fetching changes from the remote Git repository
 > C:\Program Files\Git\cmd\git.exe config remote.origin.url https://github.com/apache/royale-asjs # timeout=10
Fetching upstream changes from https://github.com/apache/royale-asjs
 > C:\Program Files\Git\cmd\git.exe --version # timeout=10
 > C:\Program Files\Git\cmd\git.exe fetch --tags --force --progress -- https://github.com/apache/royale-asjs +refs/heads/*:refs/remotes/origin/*
 > C:\Program Files\Git\cmd\git.exe rev-parse "refs/remotes/origin/develop^{commit}" # timeout=10
 > C:\Program Files\Git\cmd\git.exe rev-parse "refs/remotes/origin/origin/develop^{commit}" # timeout=10
Checking out Revision 8a2aa8a421e4766fb9d2f19b2be92673588a23e3 (refs/remotes/origin/develop)
 > C:\Program Files\Git\cmd\git.exe config core.sparsecheckout # timeout=10
 > C:\Program Files\Git\cmd\git.exe checkout -f 8a2aa8a421e4766fb9d2f19b2be92673588a23e3
Commit message: "tour-de-jewel: update all examples to use itemsVerticalAlign="itemsCenter""
 > C:\Program Files\Git\cmd\git.exe rev-list --no-walk 8a2aa8a421e4766fb9d2f19b2be92673588a23e3 # timeout=10
[royale-asjs_jsonly] $ cmd.exe /C "C:\apache\apache-ant-1.9.9\bin\ant.bat -DROYALE_COMPILER_REPO=C:\jenkins\workspace\royale-compiler -Denv.ROYALE_TRANSPILER_HOME=C:\jenkins\workspace\royale-compiler\compiler-jx '"-Dbrowser=C:\Program Files\Mozilla Firefox\firefox.exe"' -DROYALE_TYPEDEFS_HOME=C:\jenkins\workspace\royale-typedefs -Dbuild.noprompt=true -Dplayerglobal.version=11.7 -Denv.ROYALE_COMPILER_HOME=C:\jenkins\workspace\royale-compiler\compiler release create-SHA-512 create-SHA-512-jsonly && exit %%ERRORLEVEL%%"
Buildfile: <http://apacheroyaleci2.westus2.cloudapp.azure.com:8080/job/royale-asjs_jsonly/ws/build.xml>

block-flat-fonts:

check-compiler-home:

check-typedefs-home:

thirdparty-clean:

thirdparty-clean:

pixelbender-clean:

swfobject-clean:

flat-ui-clean:

gcl-clean:
     [echo] Deleting Google Closure Library

clean:

examples-clean:

clean:

clean:

clean:

clean:

clean:

clean:

clean:

clean:

clean:

clean:

clean:

clean:

clean:

clean:

clean:

clean:

clean:

clean:

clean:

clean:

clean:

clean:

clean:

BUILD FAILED
<http://apacheroyaleci2.westus2.cloudapp.azure.com:8080/job/royale-asjs_jsonly/ws/build.xml>:630: The following error occurred while executing this line:
<http://apacheroyaleci2.westus2.cloudapp.azure.com:8080/job/royale-asjs_jsonly/ws/examples/build.xml>:163: Basedir <http://apacheroyaleci2.westus2.cloudapp.azure.com:8080/job/royale-asjs_jsonly/ws/examples/royale/TourDeJewel> does not exist

Total time: 0 seconds
Picked up JAVA_TOOL_OPTIONS: -Dfile.encoding=UTF-8 -Xms384m -Xmx2g
Build step 'Invoke Ant' marked build as failure
Skipped archiving because build is not successful

Build failed in Jenkins: royale-asjs_jsonly #1112

Posted by ap...@gmail.com.
See <http://apacheroyaleci2.westus2.cloudapp.azure.com:8080/job/royale-asjs_jsonly/1112/display/redirect?page=changes>

Changes:

[carlosrovira] jewel-layouts: make itemsVerticalAlign accept "itemCenter" (instead

[carlosrovira] tour-de-jewel: update all examples to use


------------------------------------------
Started by an SCM change
Running as SYSTEM
[EnvInject] - Loading node environment variables.
Building remotely on agent1 in workspace <http://apacheroyaleci2.westus2.cloudapp.azure.com:8080/job/royale-asjs_jsonly/ws/>
No credentials specified
 > C:\Program Files\Git\cmd\git.exe rev-parse --is-inside-work-tree # timeout=10
Fetching changes from the remote Git repository
 > C:\Program Files\Git\cmd\git.exe config remote.origin.url https://github.com/apache/royale-asjs # timeout=10
Fetching upstream changes from https://github.com/apache/royale-asjs
 > C:\Program Files\Git\cmd\git.exe --version # timeout=10
 > C:\Program Files\Git\cmd\git.exe fetch --tags --force --progress -- https://github.com/apache/royale-asjs +refs/heads/*:refs/remotes/origin/*
 > C:\Program Files\Git\cmd\git.exe rev-parse "refs/remotes/origin/develop^{commit}" # timeout=10
 > C:\Program Files\Git\cmd\git.exe rev-parse "refs/remotes/origin/origin/develop^{commit}" # timeout=10
Checking out Revision 8a2aa8a421e4766fb9d2f19b2be92673588a23e3 (refs/remotes/origin/develop)
 > C:\Program Files\Git\cmd\git.exe config core.sparsecheckout # timeout=10
 > C:\Program Files\Git\cmd\git.exe checkout -f 8a2aa8a421e4766fb9d2f19b2be92673588a23e3
Commit message: "tour-de-jewel: update all examples to use itemsVerticalAlign="itemsCenter""
 > C:\Program Files\Git\cmd\git.exe rev-list --no-walk a538c215fb055da027ac815e0386bc2432a8aa1b # timeout=10
[royale-asjs_jsonly] $ cmd.exe /C "C:\apache\apache-ant-1.9.9\bin\ant.bat -DROYALE_COMPILER_REPO=C:\jenkins\workspace\royale-compiler -Denv.ROYALE_TRANSPILER_HOME=C:\jenkins\workspace\royale-compiler\compiler-jx '"-Dbrowser=C:\Program Files\Mozilla Firefox\firefox.exe"' -DROYALE_TYPEDEFS_HOME=C:\jenkins\workspace\royale-typedefs -Dbuild.noprompt=true -Dplayerglobal.version=11.7 -Denv.ROYALE_COMPILER_HOME=C:\jenkins\workspace\royale-compiler\compiler release create-SHA-512 create-SHA-512-jsonly && exit %%ERRORLEVEL%%"
Buildfile: <http://apacheroyaleci2.westus2.cloudapp.azure.com:8080/job/royale-asjs_jsonly/ws/build.xml>

block-flat-fonts:

check-compiler-home:

check-typedefs-home:

thirdparty-clean:

thirdparty-clean:

pixelbender-clean:

swfobject-clean:

flat-ui-clean:

gcl-clean:
     [echo] Deleting Google Closure Library

clean:

examples-clean:

clean:

clean:

clean:

clean:

clean:

clean:

clean:

clean:

clean:

clean:

clean:

clean:

clean:

clean:

clean:

clean:

clean:

clean:

clean:

clean:

clean:

clean:

clean:

BUILD FAILED
<http://apacheroyaleci2.westus2.cloudapp.azure.com:8080/job/royale-asjs_jsonly/ws/build.xml>:630: The following error occurred while executing this line:
<http://apacheroyaleci2.westus2.cloudapp.azure.com:8080/job/royale-asjs_jsonly/ws/examples/build.xml>:163: Basedir <http://apacheroyaleci2.westus2.cloudapp.azure.com:8080/job/royale-asjs_jsonly/ws/examples/royale/TourDeJewel> does not exist

Total time: 0 seconds
Picked up JAVA_TOOL_OPTIONS: -Dfile.encoding=UTF-8 -Xms384m -Xmx2g
Build step 'Invoke Ant' marked build as failure
Skipped archiving because build is not successful

Build failed in Jenkins: royale-asjs_jsonly #1111

Posted by ap...@gmail.com.
See <http://apacheroyaleci2.westus2.cloudapp.azure.com:8080/job/royale-asjs_jsonly/1111/display/redirect>

Changes:


------------------------------------------
Started by upstream project "royale-typedefs" build number 448
originally caused by:
 Started by upstream project "royale-compiler" build number 279
 originally caused by:
  Started by timer
Running as SYSTEM
[EnvInject] - Loading node environment variables.
Building remotely on agent1 in workspace <http://apacheroyaleci2.westus2.cloudapp.azure.com:8080/job/royale-asjs_jsonly/ws/>
No credentials specified
 > C:\Program Files\Git\cmd\git.exe rev-parse --is-inside-work-tree # timeout=10
Fetching changes from the remote Git repository
 > C:\Program Files\Git\cmd\git.exe config remote.origin.url https://github.com/apache/royale-asjs # timeout=10
Fetching upstream changes from https://github.com/apache/royale-asjs
 > C:\Program Files\Git\cmd\git.exe --version # timeout=10
 > C:\Program Files\Git\cmd\git.exe fetch --tags --force --progress -- https://github.com/apache/royale-asjs +refs/heads/*:refs/remotes/origin/*
 > C:\Program Files\Git\cmd\git.exe rev-parse "refs/remotes/origin/develop^{commit}" # timeout=10
 > C:\Program Files\Git\cmd\git.exe rev-parse "refs/remotes/origin/origin/develop^{commit}" # timeout=10
Checking out Revision a538c215fb055da027ac815e0386bc2432a8aa1b (refs/remotes/origin/develop)
 > C:\Program Files\Git\cmd\git.exe config core.sparsecheckout # timeout=10
 > C:\Program Files\Git\cmd\git.exe checkout -f a538c215fb055da027ac815e0386bc2432a8aa1b
Commit message: "jewel-button: css was left"
 > C:\Program Files\Git\cmd\git.exe rev-list --no-walk a538c215fb055da027ac815e0386bc2432a8aa1b # timeout=10
[royale-asjs_jsonly] $ cmd.exe /C "C:\apache\apache-ant-1.9.9\bin\ant.bat -DROYALE_COMPILER_REPO=C:\jenkins\workspace\royale-compiler -Denv.ROYALE_TRANSPILER_HOME=C:\jenkins\workspace\royale-compiler\compiler-jx '"-Dbrowser=C:\Program Files\Mozilla Firefox\firefox.exe"' -DROYALE_TYPEDEFS_HOME=C:\jenkins\workspace\royale-typedefs -Dbuild.noprompt=true -Dplayerglobal.version=11.7 -Denv.ROYALE_COMPILER_HOME=C:\jenkins\workspace\royale-compiler\compiler release create-SHA-512 create-SHA-512-jsonly && exit %%ERRORLEVEL%%"
Buildfile: <http://apacheroyaleci2.westus2.cloudapp.azure.com:8080/job/royale-asjs_jsonly/ws/build.xml>

block-flat-fonts:

check-compiler-home:

check-typedefs-home:

thirdparty-clean:

thirdparty-clean:

pixelbender-clean:

swfobject-clean:

flat-ui-clean:

gcl-clean:
     [echo] Deleting Google Closure Library

clean:

examples-clean:

clean:

clean:

clean:

clean:

clean:

clean:

clean:

clean:

clean:

clean:

clean:

clean:

clean:

clean:

clean:

clean:

clean:

clean:

clean:

clean:

clean:

clean:

clean:

BUILD FAILED
<http://apacheroyaleci2.westus2.cloudapp.azure.com:8080/job/royale-asjs_jsonly/ws/build.xml>:630: The following error occurred while executing this line:
<http://apacheroyaleci2.westus2.cloudapp.azure.com:8080/job/royale-asjs_jsonly/ws/examples/build.xml>:163: Basedir <http://apacheroyaleci2.westus2.cloudapp.azure.com:8080/job/royale-asjs_jsonly/ws/examples/royale/TourDeJewel> does not exist

Total time: 2 seconds
Picked up JAVA_TOOL_OPTIONS: -Dfile.encoding=UTF-8 -Xms384m -Xmx2g
Build step 'Invoke Ant' marked build as failure
Skipped archiving because build is not successful

Build failed in Jenkins: royale-asjs_jsonly #1110

Posted by ap...@gmail.com.
See <http://apacheroyaleci2.westus2.cloudapp.azure.com:8080/job/royale-asjs_jsonly/1110/display/redirect>

Changes:


------------------------------------------
Started by upstream project "royale-typedefs" build number 447
originally caused by:
 Started by an SCM change
Running as SYSTEM
[EnvInject] - Loading node environment variables.
Building remotely on agent1 in workspace <http://apacheroyaleci2.westus2.cloudapp.azure.com:8080/job/royale-asjs_jsonly/ws/>
No credentials specified
 > C:\Program Files\Git\cmd\git.exe rev-parse --is-inside-work-tree # timeout=10
Fetching changes from the remote Git repository
 > C:\Program Files\Git\cmd\git.exe config remote.origin.url https://github.com/apache/royale-asjs # timeout=10
Fetching upstream changes from https://github.com/apache/royale-asjs
 > C:\Program Files\Git\cmd\git.exe --version # timeout=10
 > C:\Program Files\Git\cmd\git.exe fetch --tags --force --progress -- https://github.com/apache/royale-asjs +refs/heads/*:refs/remotes/origin/*
 > C:\Program Files\Git\cmd\git.exe rev-parse "refs/remotes/origin/develop^{commit}" # timeout=10
 > C:\Program Files\Git\cmd\git.exe rev-parse "refs/remotes/origin/origin/develop^{commit}" # timeout=10
Checking out Revision a538c215fb055da027ac815e0386bc2432a8aa1b (refs/remotes/origin/develop)
 > C:\Program Files\Git\cmd\git.exe config core.sparsecheckout # timeout=10
 > C:\Program Files\Git\cmd\git.exe checkout -f a538c215fb055da027ac815e0386bc2432a8aa1b
Commit message: "jewel-button: css was left"
 > C:\Program Files\Git\cmd\git.exe rev-list --no-walk a538c215fb055da027ac815e0386bc2432a8aa1b # timeout=10
[royale-asjs_jsonly] $ cmd.exe /C "C:\apache\apache-ant-1.9.9\bin\ant.bat -DROYALE_COMPILER_REPO=C:\jenkins\workspace\royale-compiler -Denv.ROYALE_TRANSPILER_HOME=C:\jenkins\workspace\royale-compiler\compiler-jx '"-Dbrowser=C:\Program Files\Mozilla Firefox\firefox.exe"' -DROYALE_TYPEDEFS_HOME=C:\jenkins\workspace\royale-typedefs -Dbuild.noprompt=true -Dplayerglobal.version=11.7 -Denv.ROYALE_COMPILER_HOME=C:\jenkins\workspace\royale-compiler\compiler release create-SHA-512 create-SHA-512-jsonly && exit %%ERRORLEVEL%%"
Buildfile: <http://apacheroyaleci2.westus2.cloudapp.azure.com:8080/job/royale-asjs_jsonly/ws/build.xml>

block-flat-fonts:

check-compiler-home:

check-typedefs-home:

thirdparty-clean:

thirdparty-clean:

pixelbender-clean:

swfobject-clean:

flat-ui-clean:

gcl-clean:
     [echo] Deleting Google Closure Library

clean:

examples-clean:

clean:

clean:

clean:

clean:

clean:

clean:

clean:

clean:

clean:

clean:

clean:

clean:

clean:

clean:

clean:

clean:

clean:

clean:

clean:

clean:

clean:

clean:

clean:

BUILD FAILED
<http://apacheroyaleci2.westus2.cloudapp.azure.com:8080/job/royale-asjs_jsonly/ws/build.xml>:630: The following error occurred while executing this line:
<http://apacheroyaleci2.westus2.cloudapp.azure.com:8080/job/royale-asjs_jsonly/ws/examples/build.xml>:163: Basedir <http://apacheroyaleci2.westus2.cloudapp.azure.com:8080/job/royale-asjs_jsonly/ws/examples/royale/TourDeJewel> does not exist

Total time: 0 seconds
Picked up JAVA_TOOL_OPTIONS: -Dfile.encoding=UTF-8 -Xms384m -Xmx2g
Build step 'Invoke Ant' marked build as failure
Skipped archiving because build is not successful

Build failed in Jenkins: royale-asjs_jsonly #1109

Posted by ap...@gmail.com.
See <http://apacheroyaleci2.westus2.cloudapp.azure.com:8080/job/royale-asjs_jsonly/1109/display/redirect?page=changes>

Changes:

[carlosrovira] jewel-button: css was left


------------------------------------------
Started by an SCM change
Running as SYSTEM
[EnvInject] - Loading node environment variables.
Building remotely on agent1 in workspace <http://apacheroyaleci2.westus2.cloudapp.azure.com:8080/job/royale-asjs_jsonly/ws/>
No credentials specified
 > C:\Program Files\Git\cmd\git.exe rev-parse --is-inside-work-tree # timeout=10
Fetching changes from the remote Git repository
 > C:\Program Files\Git\cmd\git.exe config remote.origin.url https://github.com/apache/royale-asjs # timeout=10
Fetching upstream changes from https://github.com/apache/royale-asjs
 > C:\Program Files\Git\cmd\git.exe --version # timeout=10
 > C:\Program Files\Git\cmd\git.exe fetch --tags --force --progress -- https://github.com/apache/royale-asjs +refs/heads/*:refs/remotes/origin/*
 > C:\Program Files\Git\cmd\git.exe rev-parse "refs/remotes/origin/develop^{commit}" # timeout=10
 > C:\Program Files\Git\cmd\git.exe rev-parse "refs/remotes/origin/origin/develop^{commit}" # timeout=10
Checking out Revision a538c215fb055da027ac815e0386bc2432a8aa1b (refs/remotes/origin/develop)
 > C:\Program Files\Git\cmd\git.exe config core.sparsecheckout # timeout=10
 > C:\Program Files\Git\cmd\git.exe checkout -f a538c215fb055da027ac815e0386bc2432a8aa1b
Commit message: "jewel-button: css was left"
 > C:\Program Files\Git\cmd\git.exe rev-list --no-walk 5bc0782f905e10d6153d2dbc3ac7736fb6e6a121 # timeout=10
[royale-asjs_jsonly] $ cmd.exe /C "C:\apache\apache-ant-1.9.9\bin\ant.bat -DROYALE_COMPILER_REPO=C:\jenkins\workspace\royale-compiler -Denv.ROYALE_TRANSPILER_HOME=C:\jenkins\workspace\royale-compiler\compiler-jx '"-Dbrowser=C:\Program Files\Mozilla Firefox\firefox.exe"' -DROYALE_TYPEDEFS_HOME=C:\jenkins\workspace\royale-typedefs -Dbuild.noprompt=true -Dplayerglobal.version=11.7 -Denv.ROYALE_COMPILER_HOME=C:\jenkins\workspace\royale-compiler\compiler release create-SHA-512 create-SHA-512-jsonly && exit %%ERRORLEVEL%%"
Buildfile: <http://apacheroyaleci2.westus2.cloudapp.azure.com:8080/job/royale-asjs_jsonly/ws/build.xml>

block-flat-fonts:

check-compiler-home:

check-typedefs-home:

thirdparty-clean:

thirdparty-clean:

pixelbender-clean:

swfobject-clean:

flat-ui-clean:

gcl-clean:
     [echo] Deleting Google Closure Library

clean:

examples-clean:

clean:

clean:

clean:

clean:

clean:

clean:

clean:

clean:

clean:

clean:

clean:

clean:

clean:

clean:

clean:

clean:

clean:

clean:

clean:

clean:

clean:

clean:

clean:

BUILD FAILED
<http://apacheroyaleci2.westus2.cloudapp.azure.com:8080/job/royale-asjs_jsonly/ws/build.xml>:630: The following error occurred while executing this line:
<http://apacheroyaleci2.westus2.cloudapp.azure.com:8080/job/royale-asjs_jsonly/ws/examples/build.xml>:163: Basedir <http://apacheroyaleci2.westus2.cloudapp.azure.com:8080/job/royale-asjs_jsonly/ws/examples/royale/TourDeJewel> does not exist

Total time: 0 seconds
Picked up JAVA_TOOL_OPTIONS: -Dfile.encoding=UTF-8 -Xms384m -Xmx2g
Build step 'Invoke Ant' marked build as failure
Skipped archiving because build is not successful

Build failed in Jenkins: royale-asjs_jsonly #1108

Posted by ap...@gmail.com.
See <http://apacheroyaleci2.westus2.cloudapp.azure.com:8080/job/royale-asjs_jsonly/1108/display/redirect>

Changes:


------------------------------------------
Started by upstream project "royale-typedefs" build number 446
originally caused by:
 Started by an SCM change
Running as SYSTEM
[EnvInject] - Loading node environment variables.
Building remotely on agent1 in workspace <http://apacheroyaleci2.westus2.cloudapp.azure.com:8080/job/royale-asjs_jsonly/ws/>
No credentials specified
 > C:\Program Files\Git\cmd\git.exe rev-parse --is-inside-work-tree # timeout=10
Fetching changes from the remote Git repository
 > C:\Program Files\Git\cmd\git.exe config remote.origin.url https://github.com/apache/royale-asjs # timeout=10
Fetching upstream changes from https://github.com/apache/royale-asjs
 > C:\Program Files\Git\cmd\git.exe --version # timeout=10
 > C:\Program Files\Git\cmd\git.exe fetch --tags --force --progress -- https://github.com/apache/royale-asjs +refs/heads/*:refs/remotes/origin/*
 > C:\Program Files\Git\cmd\git.exe rev-parse "refs/remotes/origin/develop^{commit}" # timeout=10
 > C:\Program Files\Git\cmd\git.exe rev-parse "refs/remotes/origin/origin/develop^{commit}" # timeout=10
Checking out Revision 5bc0782f905e10d6153d2dbc3ac7736fb6e6a121 (refs/remotes/origin/develop)
 > C:\Program Files\Git\cmd\git.exe config core.sparsecheckout # timeout=10
 > C:\Program Files\Git\cmd\git.exe checkout -f 5bc0782f905e10d6153d2dbc3ac7736fb6e6a121
Commit message: "Merge pull request #786 from chrisdutz/develop"
 > C:\Program Files\Git\cmd\git.exe rev-list --no-walk 5bc0782f905e10d6153d2dbc3ac7736fb6e6a121 # timeout=10
[royale-asjs_jsonly] $ cmd.exe /C "C:\apache\apache-ant-1.9.9\bin\ant.bat -DROYALE_COMPILER_REPO=C:\jenkins\workspace\royale-compiler -Denv.ROYALE_TRANSPILER_HOME=C:\jenkins\workspace\royale-compiler\compiler-jx '"-Dbrowser=C:\Program Files\Mozilla Firefox\firefox.exe"' -DROYALE_TYPEDEFS_HOME=C:\jenkins\workspace\royale-typedefs -Dbuild.noprompt=true -Dplayerglobal.version=11.7 -Denv.ROYALE_COMPILER_HOME=C:\jenkins\workspace\royale-compiler\compiler release create-SHA-512 create-SHA-512-jsonly && exit %%ERRORLEVEL%%"
Buildfile: <http://apacheroyaleci2.westus2.cloudapp.azure.com:8080/job/royale-asjs_jsonly/ws/build.xml>

block-flat-fonts:

check-compiler-home:

check-typedefs-home:

thirdparty-clean:

thirdparty-clean:

pixelbender-clean:

swfobject-clean:

flat-ui-clean:

gcl-clean:
     [echo] Deleting Google Closure Library

clean:

examples-clean:

clean:

clean:

clean:

clean:

clean:

clean:

clean:

clean:

clean:

clean:

clean:

clean:

clean:

clean:

clean:

clean:

clean:

clean:

clean:

clean:

clean:

clean:

clean:

BUILD FAILED
<http://apacheroyaleci2.westus2.cloudapp.azure.com:8080/job/royale-asjs_jsonly/ws/build.xml>:630: The following error occurred while executing this line:
<http://apacheroyaleci2.westus2.cloudapp.azure.com:8080/job/royale-asjs_jsonly/ws/examples/build.xml>:163: Basedir <http://apacheroyaleci2.westus2.cloudapp.azure.com:8080/job/royale-asjs_jsonly/ws/examples/royale/TourDeJewel> does not exist

Total time: 1 second
Picked up JAVA_TOOL_OPTIONS: -Dfile.encoding=UTF-8 -Xms384m -Xmx2g
Build step 'Invoke Ant' marked build as failure
Skipped archiving because build is not successful

Build failed in Jenkins: royale-asjs_jsonly #1107

Posted by ap...@gmail.com.
See <http://apacheroyaleci2.westus2.cloudapp.azure.com:8080/job/royale-asjs_jsonly/1107/display/redirect?page=changes>

Changes:

[carlosrovira] tour-de-jewel: fix urls to source code now that TDJ is in jewel folder

[christofer.dutz] - Changed the developbranchname setting to "develop"


------------------------------------------
Started by an SCM change
Running as SYSTEM
[EnvInject] - Loading node environment variables.
Building remotely on agent1 in workspace <http://apacheroyaleci2.westus2.cloudapp.azure.com:8080/job/royale-asjs_jsonly/ws/>
No credentials specified
 > C:\Program Files\Git\cmd\git.exe rev-parse --is-inside-work-tree # timeout=10
Fetching changes from the remote Git repository
 > C:\Program Files\Git\cmd\git.exe config remote.origin.url https://github.com/apache/royale-asjs # timeout=10
Fetching upstream changes from https://github.com/apache/royale-asjs
 > C:\Program Files\Git\cmd\git.exe --version # timeout=10
 > C:\Program Files\Git\cmd\git.exe fetch --tags --force --progress -- https://github.com/apache/royale-asjs +refs/heads/*:refs/remotes/origin/*
 > C:\Program Files\Git\cmd\git.exe rev-parse "refs/remotes/origin/develop^{commit}" # timeout=10
 > C:\Program Files\Git\cmd\git.exe rev-parse "refs/remotes/origin/origin/develop^{commit}" # timeout=10
Checking out Revision 5bc0782f905e10d6153d2dbc3ac7736fb6e6a121 (refs/remotes/origin/develop)
 > C:\Program Files\Git\cmd\git.exe config core.sparsecheckout # timeout=10
 > C:\Program Files\Git\cmd\git.exe checkout -f 5bc0782f905e10d6153d2dbc3ac7736fb6e6a121
Commit message: "Merge pull request #786 from chrisdutz/develop"
 > C:\Program Files\Git\cmd\git.exe rev-list --no-walk c009fb5cbbbfe457a9175ba2ff09da552c8ad000 # timeout=10
[royale-asjs_jsonly] $ cmd.exe /C "C:\apache\apache-ant-1.9.9\bin\ant.bat -DROYALE_COMPILER_REPO=C:\jenkins\workspace\royale-compiler -Denv.ROYALE_TRANSPILER_HOME=C:\jenkins\workspace\royale-compiler\compiler-jx '"-Dbrowser=C:\Program Files\Mozilla Firefox\firefox.exe"' -DROYALE_TYPEDEFS_HOME=C:\jenkins\workspace\royale-typedefs -Dbuild.noprompt=true -Dplayerglobal.version=11.7 -Denv.ROYALE_COMPILER_HOME=C:\jenkins\workspace\royale-compiler\compiler release create-SHA-512 create-SHA-512-jsonly && exit %%ERRORLEVEL%%"
Buildfile: <http://apacheroyaleci2.westus2.cloudapp.azure.com:8080/job/royale-asjs_jsonly/ws/build.xml>

block-flat-fonts:

check-compiler-home:

check-typedefs-home:

thirdparty-clean:

thirdparty-clean:

pixelbender-clean:

swfobject-clean:

flat-ui-clean:

gcl-clean:
     [echo] Deleting Google Closure Library

clean:

examples-clean:

clean:

clean:

clean:

clean:

clean:

clean:

clean:

clean:

clean:

clean:

clean:

clean:

clean:

clean:

clean:

clean:

clean:

clean:

clean:

clean:

clean:

clean:

clean:

BUILD FAILED
<http://apacheroyaleci2.westus2.cloudapp.azure.com:8080/job/royale-asjs_jsonly/ws/build.xml>:630: The following error occurred while executing this line:
<http://apacheroyaleci2.westus2.cloudapp.azure.com:8080/job/royale-asjs_jsonly/ws/examples/build.xml>:163: Basedir <http://apacheroyaleci2.westus2.cloudapp.azure.com:8080/job/royale-asjs_jsonly/ws/examples/royale/TourDeJewel> does not exist

Total time: 0 seconds
Picked up JAVA_TOOL_OPTIONS: -Dfile.encoding=UTF-8 -Xms384m -Xmx2g
Build step 'Invoke Ant' marked build as failure
Skipped archiving because build is not successful

Build failed in Jenkins: royale-asjs_jsonly #1106

Posted by ap...@gmail.com.
See <http://apacheroyaleci2.westus2.cloudapp.azure.com:8080/job/royale-asjs_jsonly/1106/display/redirect>

Changes:


------------------------------------------
Started by upstream project "royale-typedefs" build number 445
originally caused by:
 Started by upstream project "royale-compiler" build number 277
 originally caused by:
  Started by an SCM change
Running as SYSTEM
[EnvInject] - Loading node environment variables.
Building remotely on agent1 in workspace <http://apacheroyaleci2.westus2.cloudapp.azure.com:8080/job/royale-asjs_jsonly/ws/>
No credentials specified
 > C:\Program Files\Git\cmd\git.exe rev-parse --is-inside-work-tree # timeout=10
Fetching changes from the remote Git repository
 > C:\Program Files\Git\cmd\git.exe config remote.origin.url https://github.com/apache/royale-asjs # timeout=10
Fetching upstream changes from https://github.com/apache/royale-asjs
 > C:\Program Files\Git\cmd\git.exe --version # timeout=10
 > C:\Program Files\Git\cmd\git.exe fetch --tags --force --progress -- https://github.com/apache/royale-asjs +refs/heads/*:refs/remotes/origin/*
 > C:\Program Files\Git\cmd\git.exe rev-parse "refs/remotes/origin/develop^{commit}" # timeout=10
 > C:\Program Files\Git\cmd\git.exe rev-parse "refs/remotes/origin/origin/develop^{commit}" # timeout=10
Checking out Revision c009fb5cbbbfe457a9175ba2ff09da552c8ad000 (refs/remotes/origin/develop)
 > C:\Program Files\Git\cmd\git.exe config core.sparsecheckout # timeout=10
 > C:\Program Files\Git\cmd\git.exe checkout -f c009fb5cbbbfe457a9175ba2ff09da552c8ad000
Commit message: "Merge pull request #782 from chrisdutz/develop"
 > C:\Program Files\Git\cmd\git.exe rev-list --no-walk c009fb5cbbbfe457a9175ba2ff09da552c8ad000 # timeout=10
[royale-asjs_jsonly] $ cmd.exe /C "C:\apache\apache-ant-1.9.9\bin\ant.bat -DROYALE_COMPILER_REPO=C:\jenkins\workspace\royale-compiler -Denv.ROYALE_TRANSPILER_HOME=C:\jenkins\workspace\royale-compiler\compiler-jx '"-Dbrowser=C:\Program Files\Mozilla Firefox\firefox.exe"' -DROYALE_TYPEDEFS_HOME=C:\jenkins\workspace\royale-typedefs -Dbuild.noprompt=true -Dplayerglobal.version=11.7 -Denv.ROYALE_COMPILER_HOME=C:\jenkins\workspace\royale-compiler\compiler release create-SHA-512 create-SHA-512-jsonly && exit %%ERRORLEVEL%%"
Buildfile: <http://apacheroyaleci2.westus2.cloudapp.azure.com:8080/job/royale-asjs_jsonly/ws/build.xml>

block-flat-fonts:

check-compiler-home:

check-typedefs-home:

thirdparty-clean:

thirdparty-clean:

pixelbender-clean:

swfobject-clean:

flat-ui-clean:

gcl-clean:
     [echo] Deleting Google Closure Library

clean:

examples-clean:

clean:

clean:

clean:

clean:

clean:

clean:

clean:

clean:

clean:

clean:

clean:

clean:

clean:

clean:

clean:

clean:

clean:

clean:

clean:

clean:

clean:

clean:

clean:

BUILD FAILED
<http://apacheroyaleci2.westus2.cloudapp.azure.com:8080/job/royale-asjs_jsonly/ws/build.xml>:630: The following error occurred while executing this line:
<http://apacheroyaleci2.westus2.cloudapp.azure.com:8080/job/royale-asjs_jsonly/ws/examples/build.xml>:163: Basedir <http://apacheroyaleci2.westus2.cloudapp.azure.com:8080/job/royale-asjs_jsonly/ws/examples/royale/TourDeJewel> does not exist

Total time: 1 second
Picked up JAVA_TOOL_OPTIONS: -Dfile.encoding=UTF-8 -Xms384m -Xmx2g
Build step 'Invoke Ant' marked build as failure
Skipped archiving because build is not successful

Build failed in Jenkins: royale-asjs_jsonly #1105

Posted by ap...@gmail.com.
See <http://apacheroyaleci2.westus2.cloudapp.azure.com:8080/job/royale-asjs_jsonly/1105/display/redirect>

Changes:


------------------------------------------
Started by upstream project "royale-typedefs" build number 444
originally caused by:
 Started by upstream project "royale-compiler" build number 276
 originally caused by:
  Started by an SCM change
Running as SYSTEM
[EnvInject] - Loading node environment variables.
Building remotely on agent1 in workspace <http://apacheroyaleci2.westus2.cloudapp.azure.com:8080/job/royale-asjs_jsonly/ws/>
No credentials specified
 > C:\Program Files\Git\cmd\git.exe rev-parse --is-inside-work-tree # timeout=10
Fetching changes from the remote Git repository
 > C:\Program Files\Git\cmd\git.exe config remote.origin.url https://github.com/apache/royale-asjs # timeout=10
Fetching upstream changes from https://github.com/apache/royale-asjs
 > C:\Program Files\Git\cmd\git.exe --version # timeout=10
 > C:\Program Files\Git\cmd\git.exe fetch --tags --force --progress -- https://github.com/apache/royale-asjs +refs/heads/*:refs/remotes/origin/*
 > C:\Program Files\Git\cmd\git.exe rev-parse "refs/remotes/origin/develop^{commit}" # timeout=10
 > C:\Program Files\Git\cmd\git.exe rev-parse "refs/remotes/origin/origin/develop^{commit}" # timeout=10
Checking out Revision c009fb5cbbbfe457a9175ba2ff09da552c8ad000 (refs/remotes/origin/develop)
 > C:\Program Files\Git\cmd\git.exe config core.sparsecheckout # timeout=10
 > C:\Program Files\Git\cmd\git.exe checkout -f c009fb5cbbbfe457a9175ba2ff09da552c8ad000
Commit message: "Merge pull request #782 from chrisdutz/develop"
 > C:\Program Files\Git\cmd\git.exe rev-list --no-walk c009fb5cbbbfe457a9175ba2ff09da552c8ad000 # timeout=10
[royale-asjs_jsonly] $ cmd.exe /C "C:\apache\apache-ant-1.9.9\bin\ant.bat -DROYALE_COMPILER_REPO=C:\jenkins\workspace\royale-compiler -Denv.ROYALE_TRANSPILER_HOME=C:\jenkins\workspace\royale-compiler\compiler-jx '"-Dbrowser=C:\Program Files\Mozilla Firefox\firefox.exe"' -DROYALE_TYPEDEFS_HOME=C:\jenkins\workspace\royale-typedefs -Dbuild.noprompt=true -Dplayerglobal.version=11.7 -Denv.ROYALE_COMPILER_HOME=C:\jenkins\workspace\royale-compiler\compiler release create-SHA-512 create-SHA-512-jsonly && exit %%ERRORLEVEL%%"
Buildfile: <http://apacheroyaleci2.westus2.cloudapp.azure.com:8080/job/royale-asjs_jsonly/ws/build.xml>

block-flat-fonts:

check-compiler-home:

check-typedefs-home:

thirdparty-clean:

thirdparty-clean:

pixelbender-clean:

swfobject-clean:

flat-ui-clean:

gcl-clean:
     [echo] Deleting Google Closure Library

clean:

examples-clean:

clean:

clean:

clean:

clean:

clean:

clean:

clean:

clean:

clean:

clean:

clean:

clean:

clean:

clean:

clean:

clean:

clean:

clean:

clean:

clean:

clean:

clean:

clean:

BUILD FAILED
<http://apacheroyaleci2.westus2.cloudapp.azure.com:8080/job/royale-asjs_jsonly/ws/build.xml>:630: The following error occurred while executing this line:
<http://apacheroyaleci2.westus2.cloudapp.azure.com:8080/job/royale-asjs_jsonly/ws/examples/build.xml>:163: Basedir <http://apacheroyaleci2.westus2.cloudapp.azure.com:8080/job/royale-asjs_jsonly/ws/examples/royale/TourDeJewel> does not exist

Total time: 1 second
Picked up JAVA_TOOL_OPTIONS: -Dfile.encoding=UTF-8 -Xms384m -Xmx2g
Build step 'Invoke Ant' marked build as failure
Skipped archiving because build is not successful

Build failed in Jenkins: royale-asjs_jsonly #1104

Posted by ap...@gmail.com.
See <http://apacheroyaleci2.westus2.cloudapp.azure.com:8080/job/royale-asjs_jsonly/1104/display/redirect?page=changes>

Changes:

[christofer.dutz] - Added a previously existing profile back which is used by the ant


------------------------------------------
Started by an SCM change
Running as SYSTEM
[EnvInject] - Loading node environment variables.
Building remotely on agent1 in workspace <http://apacheroyaleci2.westus2.cloudapp.azure.com:8080/job/royale-asjs_jsonly/ws/>
No credentials specified
 > C:\Program Files\Git\cmd\git.exe rev-parse --is-inside-work-tree # timeout=10
Fetching changes from the remote Git repository
 > C:\Program Files\Git\cmd\git.exe config remote.origin.url https://github.com/apache/royale-asjs # timeout=10
Fetching upstream changes from https://github.com/apache/royale-asjs
 > C:\Program Files\Git\cmd\git.exe --version # timeout=10
 > C:\Program Files\Git\cmd\git.exe fetch --tags --force --progress -- https://github.com/apache/royale-asjs +refs/heads/*:refs/remotes/origin/*
 > C:\Program Files\Git\cmd\git.exe rev-parse "refs/remotes/origin/develop^{commit}" # timeout=10
 > C:\Program Files\Git\cmd\git.exe rev-parse "refs/remotes/origin/origin/develop^{commit}" # timeout=10
Checking out Revision c009fb5cbbbfe457a9175ba2ff09da552c8ad000 (refs/remotes/origin/develop)
 > C:\Program Files\Git\cmd\git.exe config core.sparsecheckout # timeout=10
 > C:\Program Files\Git\cmd\git.exe checkout -f c009fb5cbbbfe457a9175ba2ff09da552c8ad000
Commit message: "Merge pull request #782 from chrisdutz/develop"
 > C:\Program Files\Git\cmd\git.exe rev-list --no-walk bf8a9ffb84f4a306f37306e12f87743a4aeb77e4 # timeout=10
[royale-asjs_jsonly] $ cmd.exe /C "C:\apache\apache-ant-1.9.9\bin\ant.bat -DROYALE_COMPILER_REPO=C:\jenkins\workspace\royale-compiler -Denv.ROYALE_TRANSPILER_HOME=C:\jenkins\workspace\royale-compiler\compiler-jx '"-Dbrowser=C:\Program Files\Mozilla Firefox\firefox.exe"' -DROYALE_TYPEDEFS_HOME=C:\jenkins\workspace\royale-typedefs -Dbuild.noprompt=true -Dplayerglobal.version=11.7 -Denv.ROYALE_COMPILER_HOME=C:\jenkins\workspace\royale-compiler\compiler release create-SHA-512 create-SHA-512-jsonly && exit %%ERRORLEVEL%%"
Buildfile: <http://apacheroyaleci2.westus2.cloudapp.azure.com:8080/job/royale-asjs_jsonly/ws/build.xml>

block-flat-fonts:

check-compiler-home:

check-typedefs-home:

thirdparty-clean:

thirdparty-clean:

pixelbender-clean:

swfobject-clean:

flat-ui-clean:

gcl-clean:
     [echo] Deleting Google Closure Library

clean:

examples-clean:

clean:

clean:

clean:

clean:

clean:

clean:

clean:

clean:

clean:

clean:

clean:

clean:

clean:

clean:

clean:

clean:

clean:

clean:

clean:

clean:

clean:

clean:

clean:

BUILD FAILED
<http://apacheroyaleci2.westus2.cloudapp.azure.com:8080/job/royale-asjs_jsonly/ws/build.xml>:630: The following error occurred while executing this line:
<http://apacheroyaleci2.westus2.cloudapp.azure.com:8080/job/royale-asjs_jsonly/ws/examples/build.xml>:163: Basedir <http://apacheroyaleci2.westus2.cloudapp.azure.com:8080/job/royale-asjs_jsonly/ws/examples/royale/TourDeJewel> does not exist

Total time: 0 seconds
Picked up JAVA_TOOL_OPTIONS: -Dfile.encoding=UTF-8 -Xms384m -Xmx2g
Build step 'Invoke Ant' marked build as failure
Skipped archiving because build is not successful

Build failed in Jenkins: royale-asjs_jsonly #1103

Posted by ap...@gmail.com.
See <http://apacheroyaleci2.westus2.cloudapp.azure.com:8080/job/royale-asjs_jsonly/1103/display/redirect>

Changes:


------------------------------------------
Started by timer
Running as SYSTEM
[EnvInject] - Loading node environment variables.
Building remotely on agent1 in workspace <http://apacheroyaleci2.westus2.cloudapp.azure.com:8080/job/royale-asjs_jsonly/ws/>
No credentials specified
 > C:\Program Files\Git\cmd\git.exe rev-parse --is-inside-work-tree # timeout=10
Fetching changes from the remote Git repository
 > C:\Program Files\Git\cmd\git.exe config remote.origin.url https://github.com/apache/royale-asjs # timeout=10
Fetching upstream changes from https://github.com/apache/royale-asjs
 > C:\Program Files\Git\cmd\git.exe --version # timeout=10
 > C:\Program Files\Git\cmd\git.exe fetch --tags --force --progress -- https://github.com/apache/royale-asjs +refs/heads/*:refs/remotes/origin/*
 > C:\Program Files\Git\cmd\git.exe rev-parse "refs/remotes/origin/develop^{commit}" # timeout=10
 > C:\Program Files\Git\cmd\git.exe rev-parse "refs/remotes/origin/origin/develop^{commit}" # timeout=10
Checking out Revision bf8a9ffb84f4a306f37306e12f87743a4aeb77e4 (refs/remotes/origin/develop)
 > C:\Program Files\Git\cmd\git.exe config core.sparsecheckout # timeout=10
 > C:\Program Files\Git\cmd\git.exe checkout -f bf8a9ffb84f4a306f37306e12f87743a4aeb77e4
Commit message: "SetFocus: fix _strand. Warning this bead is still not working as expected"
 > C:\Program Files\Git\cmd\git.exe rev-list --no-walk bf8a9ffb84f4a306f37306e12f87743a4aeb77e4 # timeout=10
[royale-asjs_jsonly] $ cmd.exe /C "C:\apache\apache-ant-1.9.9\bin\ant.bat -DROYALE_COMPILER_REPO=C:\jenkins\workspace\royale-compiler -Denv.ROYALE_TRANSPILER_HOME=C:\jenkins\workspace\royale-compiler\compiler-jx '"-Dbrowser=C:\Program Files\Mozilla Firefox\firefox.exe"' -DROYALE_TYPEDEFS_HOME=C:\jenkins\workspace\royale-typedefs -Dbuild.noprompt=true -Dplayerglobal.version=11.7 -Denv.ROYALE_COMPILER_HOME=C:\jenkins\workspace\royale-compiler\compiler release create-SHA-512 create-SHA-512-jsonly && exit %%ERRORLEVEL%%"
Buildfile: <http://apacheroyaleci2.westus2.cloudapp.azure.com:8080/job/royale-asjs_jsonly/ws/build.xml>

block-flat-fonts:

check-compiler-home:

check-typedefs-home:

thirdparty-clean:

thirdparty-clean:

pixelbender-clean:

swfobject-clean:

flat-ui-clean:

gcl-clean:
     [echo] Deleting Google Closure Library

clean:

examples-clean:

clean:

clean:

clean:

clean:

clean:

clean:

clean:

clean:

clean:

clean:

clean:

clean:

clean:

clean:

clean:

clean:

clean:

clean:

clean:

clean:

clean:

clean:

clean:

BUILD FAILED
<http://apacheroyaleci2.westus2.cloudapp.azure.com:8080/job/royale-asjs_jsonly/ws/build.xml>:630: The following error occurred while executing this line:
<http://apacheroyaleci2.westus2.cloudapp.azure.com:8080/job/royale-asjs_jsonly/ws/examples/build.xml>:163: Basedir <http://apacheroyaleci2.westus2.cloudapp.azure.com:8080/job/royale-asjs_jsonly/ws/examples/royale/TourDeJewel> does not exist

Total time: 1 second
Picked up JAVA_TOOL_OPTIONS: -Dfile.encoding=UTF-8 -Xms384m -Xmx2g
Build step 'Invoke Ant' marked build as failure
Skipped archiving because build is not successful

Build failed in Jenkins: royale-asjs_jsonly #1102

Posted by ap...@gmail.com.
See <http://apacheroyaleci2.westus2.cloudapp.azure.com:8080/job/royale-asjs_jsonly/1102/display/redirect?page=changes>

Changes:

[carlosrovira] SetFocus: fix _strand. Warning this bead is still not working as


------------------------------------------
Started by an SCM change
Running as SYSTEM
[EnvInject] - Loading node environment variables.
Building remotely on agent1 in workspace <http://apacheroyaleci2.westus2.cloudapp.azure.com:8080/job/royale-asjs_jsonly/ws/>
No credentials specified
 > C:\Program Files\Git\cmd\git.exe rev-parse --is-inside-work-tree # timeout=10
Fetching changes from the remote Git repository
 > C:\Program Files\Git\cmd\git.exe config remote.origin.url https://github.com/apache/royale-asjs # timeout=10
Fetching upstream changes from https://github.com/apache/royale-asjs
 > C:\Program Files\Git\cmd\git.exe --version # timeout=10
 > C:\Program Files\Git\cmd\git.exe fetch --tags --force --progress -- https://github.com/apache/royale-asjs +refs/heads/*:refs/remotes/origin/*
 > C:\Program Files\Git\cmd\git.exe rev-parse "refs/remotes/origin/develop^{commit}" # timeout=10
 > C:\Program Files\Git\cmd\git.exe rev-parse "refs/remotes/origin/origin/develop^{commit}" # timeout=10
Checking out Revision bf8a9ffb84f4a306f37306e12f87743a4aeb77e4 (refs/remotes/origin/develop)
 > C:\Program Files\Git\cmd\git.exe config core.sparsecheckout # timeout=10
 > C:\Program Files\Git\cmd\git.exe checkout -f bf8a9ffb84f4a306f37306e12f87743a4aeb77e4
Commit message: "SetFocus: fix _strand. Warning this bead is still not working as expected"
 > C:\Program Files\Git\cmd\git.exe rev-list --no-walk 91036b3335538a27c63e225987bb2dc792ca62af # timeout=10
[royale-asjs_jsonly] $ cmd.exe /C "C:\apache\apache-ant-1.9.9\bin\ant.bat -DROYALE_COMPILER_REPO=C:\jenkins\workspace\royale-compiler -Denv.ROYALE_TRANSPILER_HOME=C:\jenkins\workspace\royale-compiler\compiler-jx '"-Dbrowser=C:\Program Files\Mozilla Firefox\firefox.exe"' -DROYALE_TYPEDEFS_HOME=C:\jenkins\workspace\royale-typedefs -Dbuild.noprompt=true -Dplayerglobal.version=11.7 -Denv.ROYALE_COMPILER_HOME=C:\jenkins\workspace\royale-compiler\compiler release create-SHA-512 create-SHA-512-jsonly && exit %%ERRORLEVEL%%"
Buildfile: <http://apacheroyaleci2.westus2.cloudapp.azure.com:8080/job/royale-asjs_jsonly/ws/build.xml>

block-flat-fonts:

check-compiler-home:

check-typedefs-home:

thirdparty-clean:

thirdparty-clean:

pixelbender-clean:

swfobject-clean:

flat-ui-clean:

gcl-clean:
     [echo] Deleting Google Closure Library

clean:

examples-clean:

clean:

clean:

clean:

clean:

clean:

clean:

clean:

clean:

clean:

clean:

clean:

clean:

clean:

clean:

clean:

clean:

clean:

clean:

clean:

clean:

clean:

clean:

clean:

BUILD FAILED
<http://apacheroyaleci2.westus2.cloudapp.azure.com:8080/job/royale-asjs_jsonly/ws/build.xml>:630: The following error occurred while executing this line:
<http://apacheroyaleci2.westus2.cloudapp.azure.com:8080/job/royale-asjs_jsonly/ws/examples/build.xml>:163: Basedir <http://apacheroyaleci2.westus2.cloudapp.azure.com:8080/job/royale-asjs_jsonly/ws/examples/royale/TourDeJewel> does not exist

Total time: 0 seconds
Picked up JAVA_TOOL_OPTIONS: -Dfile.encoding=UTF-8 -Xms384m -Xmx2g
Build step 'Invoke Ant' marked build as failure
Skipped archiving because build is not successful

Build failed in Jenkins: royale-asjs_jsonly #1101

Posted by ap...@gmail.com.
See <http://apacheroyaleci2.westus2.cloudapp.azure.com:8080/job/royale-asjs_jsonly/1101/display/redirect?page=changes>

Changes:

[christofer.dutz] - Adjusted the git plugin settings to the same ones in the compiler

[christofer.dutz] - Adjusted the releasesteps.xml files to the new server name and

[carlosrovira] basic: add SetFocus bead to allow components to get focus using the


------------------------------------------
Started by an SCM change
Running as SYSTEM
[EnvInject] - Loading node environment variables.
Building remotely on agent1 in workspace <http://apacheroyaleci2.westus2.cloudapp.azure.com:8080/job/royale-asjs_jsonly/ws/>
No credentials specified
 > C:\Program Files\Git\cmd\git.exe rev-parse --is-inside-work-tree # timeout=10
Fetching changes from the remote Git repository
 > C:\Program Files\Git\cmd\git.exe config remote.origin.url https://github.com/apache/royale-asjs # timeout=10
Fetching upstream changes from https://github.com/apache/royale-asjs
 > C:\Program Files\Git\cmd\git.exe --version # timeout=10
 > C:\Program Files\Git\cmd\git.exe fetch --tags --force --progress -- https://github.com/apache/royale-asjs +refs/heads/*:refs/remotes/origin/*
 > C:\Program Files\Git\cmd\git.exe rev-parse "refs/remotes/origin/develop^{commit}" # timeout=10
 > C:\Program Files\Git\cmd\git.exe rev-parse "refs/remotes/origin/origin/develop^{commit}" # timeout=10
Checking out Revision 91036b3335538a27c63e225987bb2dc792ca62af (refs/remotes/origin/develop)
 > C:\Program Files\Git\cmd\git.exe config core.sparsecheckout # timeout=10
 > C:\Program Files\Git\cmd\git.exe checkout -f 91036b3335538a27c63e225987bb2dc792ca62af
Commit message: "basic: add SetFocus bead to allow components to get focus using the bindable enableFocus property. This bead could be enhanced to remove focus when enableFocus is turn to false"
 > C:\Program Files\Git\cmd\git.exe rev-list --no-walk 8f641f79c57552b859f7057064c7593624233265 # timeout=10
[royale-asjs_jsonly] $ cmd.exe /C "C:\apache\apache-ant-1.9.9\bin\ant.bat -DROYALE_COMPILER_REPO=C:\jenkins\workspace\royale-compiler -Denv.ROYALE_TRANSPILER_HOME=C:\jenkins\workspace\royale-compiler\compiler-jx '"-Dbrowser=C:\Program Files\Mozilla Firefox\firefox.exe"' -DROYALE_TYPEDEFS_HOME=C:\jenkins\workspace\royale-typedefs -Dbuild.noprompt=true -Dplayerglobal.version=11.7 -Denv.ROYALE_COMPILER_HOME=C:\jenkins\workspace\royale-compiler\compiler release create-SHA-512 create-SHA-512-jsonly && exit %%ERRORLEVEL%%"
Buildfile: <http://apacheroyaleci2.westus2.cloudapp.azure.com:8080/job/royale-asjs_jsonly/ws/build.xml>

block-flat-fonts:

check-compiler-home:

check-typedefs-home:

thirdparty-clean:

thirdparty-clean:

pixelbender-clean:

swfobject-clean:

flat-ui-clean:

gcl-clean:
     [echo] Deleting Google Closure Library

clean:

examples-clean:

clean:

clean:

clean:

clean:

clean:

clean:

clean:

clean:

clean:

clean:

clean:

clean:

clean:

clean:

clean:

clean:

clean:

clean:

clean:

clean:

clean:

clean:

clean:

BUILD FAILED
<http://apacheroyaleci2.westus2.cloudapp.azure.com:8080/job/royale-asjs_jsonly/ws/build.xml>:630: The following error occurred while executing this line:
<http://apacheroyaleci2.westus2.cloudapp.azure.com:8080/job/royale-asjs_jsonly/ws/examples/build.xml>:163: Basedir <http://apacheroyaleci2.westus2.cloudapp.azure.com:8080/job/royale-asjs_jsonly/ws/examples/royale/TourDeJewel> does not exist

Total time: 0 seconds
Picked up JAVA_TOOL_OPTIONS: -Dfile.encoding=UTF-8 -Xms384m -Xmx2g
Build step 'Invoke Ant' marked build as failure
Skipped archiving because build is not successful

Build failed in Jenkins: royale-asjs_jsonly #1100

Posted by ap...@gmail.com.
See <http://apacheroyaleci2.westus2.cloudapp.azure.com:8080/job/royale-asjs_jsonly/1100/display/redirect>

Changes:


------------------------------------------
Started by upstream project "royale-typedefs" build number 439
originally caused by:
 Started by upstream project "royale-compiler" build number 273
 originally caused by:
  Started by an SCM change
Running as SYSTEM
[EnvInject] - Loading node environment variables.
Building remotely on agent1 in workspace <http://apacheroyaleci2.westus2.cloudapp.azure.com:8080/job/royale-asjs_jsonly/ws/>
No credentials specified
 > C:\Program Files\Git\cmd\git.exe rev-parse --is-inside-work-tree # timeout=10
Fetching changes from the remote Git repository
 > C:\Program Files\Git\cmd\git.exe config remote.origin.url https://github.com/apache/royale-asjs # timeout=10
Fetching upstream changes from https://github.com/apache/royale-asjs
 > C:\Program Files\Git\cmd\git.exe --version # timeout=10
 > C:\Program Files\Git\cmd\git.exe fetch --tags --force --progress -- https://github.com/apache/royale-asjs +refs/heads/*:refs/remotes/origin/*
 > C:\Program Files\Git\cmd\git.exe rev-parse "refs/remotes/origin/develop^{commit}" # timeout=10
 > C:\Program Files\Git\cmd\git.exe rev-parse "refs/remotes/origin/origin/develop^{commit}" # timeout=10
Checking out Revision 8f641f79c57552b859f7057064c7593624233265 (refs/remotes/origin/develop)
 > C:\Program Files\Git\cmd\git.exe config core.sparsecheckout # timeout=10
 > C:\Program Files\Git\cmd\git.exe checkout -f 8f641f79c57552b859f7057064c7593624233265
Commit message: "Adding some small changes to support porting. MX Fade is a placeholder. Will be tested/matched for api."
 > C:\Program Files\Git\cmd\git.exe rev-list --no-walk 8f641f79c57552b859f7057064c7593624233265 # timeout=10
[royale-asjs_jsonly] $ cmd.exe /C "C:\apache\apache-ant-1.9.9\bin\ant.bat -DROYALE_COMPILER_REPO=C:\jenkins\workspace\royale-compiler -Denv.ROYALE_TRANSPILER_HOME=C:\jenkins\workspace\royale-compiler\compiler-jx '"-Dbrowser=C:\Program Files\Mozilla Firefox\firefox.exe"' -DROYALE_TYPEDEFS_HOME=C:\jenkins\workspace\royale-typedefs -Dbuild.noprompt=true -Dplayerglobal.version=11.7 -Denv.ROYALE_COMPILER_HOME=C:\jenkins\workspace\royale-compiler\compiler release create-SHA-512 create-SHA-512-jsonly && exit %%ERRORLEVEL%%"
Buildfile: <http://apacheroyaleci2.westus2.cloudapp.azure.com:8080/job/royale-asjs_jsonly/ws/build.xml>

block-flat-fonts:

check-compiler-home:

check-typedefs-home:

thirdparty-clean:

thirdparty-clean:

pixelbender-clean:

swfobject-clean:

flat-ui-clean:

gcl-clean:
     [echo] Deleting Google Closure Library

clean:

examples-clean:

clean:

clean:

clean:

clean:

clean:

clean:

clean:

clean:

clean:

clean:

clean:

clean:

clean:

clean:

clean:

clean:

clean:

clean:

clean:

clean:

clean:

clean:

clean:

BUILD FAILED
<http://apacheroyaleci2.westus2.cloudapp.azure.com:8080/job/royale-asjs_jsonly/ws/build.xml>:630: The following error occurred while executing this line:
<http://apacheroyaleci2.westus2.cloudapp.azure.com:8080/job/royale-asjs_jsonly/ws/examples/build.xml>:163: Basedir <http://apacheroyaleci2.westus2.cloudapp.azure.com:8080/job/royale-asjs_jsonly/ws/examples/royale/TourDeJewel> does not exist

Total time: 0 seconds
Picked up JAVA_TOOL_OPTIONS: -Dfile.encoding=UTF-8 -Xms384m -Xmx2g
Build step 'Invoke Ant' marked build as failure
Skipped archiving because build is not successful

Build failed in Jenkins: royale-asjs_jsonly #1099

Posted by ap...@gmail.com.
See <http://apacheroyaleci2.westus2.cloudapp.azure.com:8080/job/royale-asjs_jsonly/1099/display/redirect>

Changes:


------------------------------------------
Started by upstream project "royale-typedefs" build number 438
originally caused by:
 Started by upstream project "royale-compiler" build number 272
 originally caused by:
  Started by an SCM change
Running as SYSTEM
[EnvInject] - Loading node environment variables.
Building remotely on agent1 in workspace <http://apacheroyaleci2.westus2.cloudapp.azure.com:8080/job/royale-asjs_jsonly/ws/>
No credentials specified
 > C:\Program Files\Git\cmd\git.exe rev-parse --is-inside-work-tree # timeout=10
Fetching changes from the remote Git repository
 > C:\Program Files\Git\cmd\git.exe config remote.origin.url https://github.com/apache/royale-asjs # timeout=10
Fetching upstream changes from https://github.com/apache/royale-asjs
 > C:\Program Files\Git\cmd\git.exe --version # timeout=10
 > C:\Program Files\Git\cmd\git.exe fetch --tags --force --progress -- https://github.com/apache/royale-asjs +refs/heads/*:refs/remotes/origin/*
 > C:\Program Files\Git\cmd\git.exe rev-parse "refs/remotes/origin/develop^{commit}" # timeout=10
 > C:\Program Files\Git\cmd\git.exe rev-parse "refs/remotes/origin/origin/develop^{commit}" # timeout=10
Checking out Revision 8f641f79c57552b859f7057064c7593624233265 (refs/remotes/origin/develop)
 > C:\Program Files\Git\cmd\git.exe config core.sparsecheckout # timeout=10
 > C:\Program Files\Git\cmd\git.exe checkout -f 8f641f79c57552b859f7057064c7593624233265
Commit message: "Adding some small changes to support porting. MX Fade is a placeholder. Will be tested/matched for api."
 > C:\Program Files\Git\cmd\git.exe rev-list --no-walk 8f641f79c57552b859f7057064c7593624233265 # timeout=10
[royale-asjs_jsonly] $ cmd.exe /C "C:\apache\apache-ant-1.9.9\bin\ant.bat -DROYALE_COMPILER_REPO=C:\jenkins\workspace\royale-compiler -Denv.ROYALE_TRANSPILER_HOME=C:\jenkins\workspace\royale-compiler\compiler-jx '"-Dbrowser=C:\Program Files\Mozilla Firefox\firefox.exe"' -DROYALE_TYPEDEFS_HOME=C:\jenkins\workspace\royale-typedefs -Dbuild.noprompt=true -Dplayerglobal.version=11.7 -Denv.ROYALE_COMPILER_HOME=C:\jenkins\workspace\royale-compiler\compiler release create-SHA-512 create-SHA-512-jsonly && exit %%ERRORLEVEL%%"
Buildfile: <http://apacheroyaleci2.westus2.cloudapp.azure.com:8080/job/royale-asjs_jsonly/ws/build.xml>

block-flat-fonts:

check-compiler-home:

check-typedefs-home:

thirdparty-clean:

thirdparty-clean:

pixelbender-clean:

swfobject-clean:

flat-ui-clean:

gcl-clean:
     [echo] Deleting Google Closure Library

clean:

examples-clean:

clean:

clean:

clean:

clean:

clean:

clean:

clean:

clean:

clean:

clean:

clean:

clean:

clean:

clean:

clean:

clean:

clean:

clean:

clean:

clean:

clean:

clean:

clean:

BUILD FAILED
<http://apacheroyaleci2.westus2.cloudapp.azure.com:8080/job/royale-asjs_jsonly/ws/build.xml>:630: The following error occurred while executing this line:
<http://apacheroyaleci2.westus2.cloudapp.azure.com:8080/job/royale-asjs_jsonly/ws/examples/build.xml>:163: Basedir <http://apacheroyaleci2.westus2.cloudapp.azure.com:8080/job/royale-asjs_jsonly/ws/examples/royale/TourDeJewel> does not exist

Total time: 2 seconds
Picked up JAVA_TOOL_OPTIONS: -Dfile.encoding=UTF-8 -Xms384m -Xmx2g
Build step 'Invoke Ant' marked build as failure
Skipped archiving because build is not successful

Build failed in Jenkins: royale-asjs_jsonly #1098

Posted by ap...@gmail.com.
See <http://apacheroyaleci2.westus2.cloudapp.azure.com:8080/job/royale-asjs_jsonly/1098/display/redirect>

Changes:


------------------------------------------
Started by upstream project "royale-typedefs" build number 437
originally caused by:
 Started by upstream project "royale-compiler" build number 271
 originally caused by:
  Started by an SCM change
Running as SYSTEM
[EnvInject] - Loading node environment variables.
Building remotely on agent1 in workspace <http://apacheroyaleci2.westus2.cloudapp.azure.com:8080/job/royale-asjs_jsonly/ws/>
No credentials specified
 > C:\Program Files\Git\cmd\git.exe rev-parse --is-inside-work-tree # timeout=10
Fetching changes from the remote Git repository
 > C:\Program Files\Git\cmd\git.exe config remote.origin.url https://github.com/apache/royale-asjs # timeout=10
Fetching upstream changes from https://github.com/apache/royale-asjs
 > C:\Program Files\Git\cmd\git.exe --version # timeout=10
 > C:\Program Files\Git\cmd\git.exe fetch --tags --force --progress -- https://github.com/apache/royale-asjs +refs/heads/*:refs/remotes/origin/*
 > C:\Program Files\Git\cmd\git.exe rev-parse "refs/remotes/origin/develop^{commit}" # timeout=10
 > C:\Program Files\Git\cmd\git.exe rev-parse "refs/remotes/origin/origin/develop^{commit}" # timeout=10
Checking out Revision 8f641f79c57552b859f7057064c7593624233265 (refs/remotes/origin/develop)
 > C:\Program Files\Git\cmd\git.exe config core.sparsecheckout # timeout=10
 > C:\Program Files\Git\cmd\git.exe checkout -f 8f641f79c57552b859f7057064c7593624233265
Commit message: "Adding some small changes to support porting. MX Fade is a placeholder. Will be tested/matched for api."
 > C:\Program Files\Git\cmd\git.exe rev-list --no-walk 8f641f79c57552b859f7057064c7593624233265 # timeout=10
[royale-asjs_jsonly] $ cmd.exe /C "C:\apache\apache-ant-1.9.9\bin\ant.bat -DROYALE_COMPILER_REPO=C:\jenkins\workspace\royale-compiler -Denv.ROYALE_TRANSPILER_HOME=C:\jenkins\workspace\royale-compiler\compiler-jx '"-Dbrowser=C:\Program Files\Mozilla Firefox\firefox.exe"' -DROYALE_TYPEDEFS_HOME=C:\jenkins\workspace\royale-typedefs -Dbuild.noprompt=true -Dplayerglobal.version=11.7 -Denv.ROYALE_COMPILER_HOME=C:\jenkins\workspace\royale-compiler\compiler release create-SHA-512 create-SHA-512-jsonly && exit %%ERRORLEVEL%%"
Buildfile: <http://apacheroyaleci2.westus2.cloudapp.azure.com:8080/job/royale-asjs_jsonly/ws/build.xml>

block-flat-fonts:

check-compiler-home:

check-typedefs-home:

thirdparty-clean:

thirdparty-clean:

pixelbender-clean:

swfobject-clean:

flat-ui-clean:

gcl-clean:
     [echo] Deleting Google Closure Library

clean:

examples-clean:

clean:

clean:

clean:

clean:

clean:

clean:

clean:

clean:

clean:

clean:

clean:

clean:

clean:

clean:

clean:

clean:

clean:

clean:

clean:

clean:

clean:

clean:

clean:

BUILD FAILED
<http://apacheroyaleci2.westus2.cloudapp.azure.com:8080/job/royale-asjs_jsonly/ws/build.xml>:630: The following error occurred while executing this line:
<http://apacheroyaleci2.westus2.cloudapp.azure.com:8080/job/royale-asjs_jsonly/ws/examples/build.xml>:163: Basedir <http://apacheroyaleci2.westus2.cloudapp.azure.com:8080/job/royale-asjs_jsonly/ws/examples/royale/TourDeJewel> does not exist

Total time: 0 seconds
Picked up JAVA_TOOL_OPTIONS: -Dfile.encoding=UTF-8 -Xms384m -Xmx2g
Build step 'Invoke Ant' marked build as failure
Skipped archiving because build is not successful

Build failed in Jenkins: royale-asjs_jsonly #1097

Posted by ap...@gmail.com.
See <http://apacheroyaleci2.westus2.cloudapp.azure.com:8080/job/royale-asjs_jsonly/1097/display/redirect?page=changes>

Changes:

[greg.dove] Adding some small changes to support porting. MX Fade is a placeholder.


------------------------------------------
Started by an SCM change
Running as SYSTEM
[EnvInject] - Loading node environment variables.
Building remotely on agent1 in workspace <http://apacheroyaleci2.westus2.cloudapp.azure.com:8080/job/royale-asjs_jsonly/ws/>
No credentials specified
 > C:\Program Files\Git\cmd\git.exe rev-parse --is-inside-work-tree # timeout=10
Fetching changes from the remote Git repository
 > C:\Program Files\Git\cmd\git.exe config remote.origin.url https://github.com/apache/royale-asjs # timeout=10
Fetching upstream changes from https://github.com/apache/royale-asjs
 > C:\Program Files\Git\cmd\git.exe --version # timeout=10
 > C:\Program Files\Git\cmd\git.exe fetch --tags --force --progress -- https://github.com/apache/royale-asjs +refs/heads/*:refs/remotes/origin/*
 > C:\Program Files\Git\cmd\git.exe rev-parse "refs/remotes/origin/develop^{commit}" # timeout=10
 > C:\Program Files\Git\cmd\git.exe rev-parse "refs/remotes/origin/origin/develop^{commit}" # timeout=10
Checking out Revision 8f641f79c57552b859f7057064c7593624233265 (refs/remotes/origin/develop)
 > C:\Program Files\Git\cmd\git.exe config core.sparsecheckout # timeout=10
 > C:\Program Files\Git\cmd\git.exe checkout -f 8f641f79c57552b859f7057064c7593624233265
Commit message: "Adding some small changes to support porting. MX Fade is a placeholder. Will be tested/matched for api."
 > C:\Program Files\Git\cmd\git.exe rev-list --no-walk 9cd53a93ead0c8f283816c6aa9d1d411780eb8a8 # timeout=10
[royale-asjs_jsonly] $ cmd.exe /C "C:\apache\apache-ant-1.9.9\bin\ant.bat -DROYALE_COMPILER_REPO=C:\jenkins\workspace\royale-compiler -Denv.ROYALE_TRANSPILER_HOME=C:\jenkins\workspace\royale-compiler\compiler-jx '"-Dbrowser=C:\Program Files\Mozilla Firefox\firefox.exe"' -DROYALE_TYPEDEFS_HOME=C:\jenkins\workspace\royale-typedefs -Dbuild.noprompt=true -Dplayerglobal.version=11.7 -Denv.ROYALE_COMPILER_HOME=C:\jenkins\workspace\royale-compiler\compiler release create-SHA-512 create-SHA-512-jsonly && exit %%ERRORLEVEL%%"
Buildfile: <http://apacheroyaleci2.westus2.cloudapp.azure.com:8080/job/royale-asjs_jsonly/ws/build.xml>

block-flat-fonts:

check-compiler-home:

check-typedefs-home:

thirdparty-clean:

thirdparty-clean:

pixelbender-clean:

swfobject-clean:

flat-ui-clean:

gcl-clean:
     [echo] Deleting Google Closure Library

clean:

examples-clean:

clean:

clean:

clean:

clean:

clean:

clean:

clean:

clean:

clean:

clean:

clean:

clean:

clean:

clean:

clean:

clean:

clean:

clean:

clean:

clean:

clean:

clean:

clean:

BUILD FAILED
<http://apacheroyaleci2.westus2.cloudapp.azure.com:8080/job/royale-asjs_jsonly/ws/build.xml>:630: The following error occurred while executing this line:
<http://apacheroyaleci2.westus2.cloudapp.azure.com:8080/job/royale-asjs_jsonly/ws/examples/build.xml>:163: Basedir <http://apacheroyaleci2.westus2.cloudapp.azure.com:8080/job/royale-asjs_jsonly/ws/examples/royale/TourDeJewel> does not exist

Total time: 2 seconds
Picked up JAVA_TOOL_OPTIONS: -Dfile.encoding=UTF-8 -Xms384m -Xmx2g
Build step 'Invoke Ant' marked build as failure
Skipped archiving because build is not successful

Build failed in Jenkins: royale-asjs_jsonly #1096

Posted by ap...@gmail.com.
See <http://apacheroyaleci2.westus2.cloudapp.azure.com:8080/job/royale-asjs_jsonly/1096/display/redirect?page=changes>

Changes:

[greg.dove] quick sweep through manualtests

[greg.dove] Sidestepping a few issues with swf html-template stuff to get past upper


------------------------------------------
Started by an SCM change
Running as SYSTEM
[EnvInject] - Loading node environment variables.
Building remotely on agent1 in workspace <http://apacheroyaleci2.westus2.cloudapp.azure.com:8080/job/royale-asjs_jsonly/ws/>
No credentials specified
 > C:\Program Files\Git\cmd\git.exe rev-parse --is-inside-work-tree # timeout=10
Fetching changes from the remote Git repository
 > C:\Program Files\Git\cmd\git.exe config remote.origin.url https://github.com/apache/royale-asjs # timeout=10
Fetching upstream changes from https://github.com/apache/royale-asjs
 > C:\Program Files\Git\cmd\git.exe --version # timeout=10
 > C:\Program Files\Git\cmd\git.exe fetch --tags --force --progress -- https://github.com/apache/royale-asjs +refs/heads/*:refs/remotes/origin/*
 > C:\Program Files\Git\cmd\git.exe rev-parse "refs/remotes/origin/develop^{commit}" # timeout=10
 > C:\Program Files\Git\cmd\git.exe rev-parse "refs/remotes/origin/origin/develop^{commit}" # timeout=10
Checking out Revision 9cd53a93ead0c8f283816c6aa9d1d411780eb8a8 (refs/remotes/origin/develop)
 > C:\Program Files\Git\cmd\git.exe config core.sparsecheckout # timeout=10
 > C:\Program Files\Git\cmd\git.exe checkout -f 9cd53a93ead0c8f283816c6aa9d1d411780eb8a8
Commit message: "Sidestepping a few issues with swf html-template stuff to get past upper level gitignore rules."
 > C:\Program Files\Git\cmd\git.exe rev-list --no-walk ecd7312c2073ba5fe78ae06b0bd44b1111d855b8 # timeout=10
[royale-asjs_jsonly] $ cmd.exe /C "C:\apache\apache-ant-1.9.9\bin\ant.bat -DROYALE_COMPILER_REPO=C:\jenkins\workspace\royale-compiler -Denv.ROYALE_TRANSPILER_HOME=C:\jenkins\workspace\royale-compiler\compiler-jx '"-Dbrowser=C:\Program Files\Mozilla Firefox\firefox.exe"' -DROYALE_TYPEDEFS_HOME=C:\jenkins\workspace\royale-typedefs -Dbuild.noprompt=true -Dplayerglobal.version=11.7 -Denv.ROYALE_COMPILER_HOME=C:\jenkins\workspace\royale-compiler\compiler release create-SHA-512 create-SHA-512-jsonly && exit %%ERRORLEVEL%%"
Buildfile: <http://apacheroyaleci2.westus2.cloudapp.azure.com:8080/job/royale-asjs_jsonly/ws/build.xml>

block-flat-fonts:

check-compiler-home:

check-typedefs-home:

thirdparty-clean:

thirdparty-clean:

pixelbender-clean:

swfobject-clean:

flat-ui-clean:

gcl-clean:
     [echo] Deleting Google Closure Library

clean:

examples-clean:

clean:

clean:

clean:

clean:

clean:

clean:

clean:

clean:

clean:

clean:

clean:

clean:

clean:

clean:

clean:

clean:

clean:

clean:

clean:

clean:

clean:

clean:

clean:

BUILD FAILED
<http://apacheroyaleci2.westus2.cloudapp.azure.com:8080/job/royale-asjs_jsonly/ws/build.xml>:630: The following error occurred while executing this line:
<http://apacheroyaleci2.westus2.cloudapp.azure.com:8080/job/royale-asjs_jsonly/ws/examples/build.xml>:163: Basedir <http://apacheroyaleci2.westus2.cloudapp.azure.com:8080/job/royale-asjs_jsonly/ws/examples/royale/TourDeJewel> does not exist

Total time: 0 seconds
Picked up JAVA_TOOL_OPTIONS: -Dfile.encoding=UTF-8 -Xms384m -Xmx2g
Build step 'Invoke Ant' marked build as failure
Skipped archiving because build is not successful

Build failed in Jenkins: royale-asjs_jsonly #1095

Posted by ap...@gmail.com.
See <http://apacheroyaleci2.westus2.cloudapp.azure.com:8080/job/royale-asjs_jsonly/1095/display/redirect>

Changes:


------------------------------------------
Started by upstream project "royale-typedefs" build number 436
originally caused by:
 Started by timer
Running as SYSTEM
[EnvInject] - Loading node environment variables.
Building remotely on agent1 in workspace <http://apacheroyaleci2.westus2.cloudapp.azure.com:8080/job/royale-asjs_jsonly/ws/>
No credentials specified
 > C:\Program Files\Git\cmd\git.exe rev-parse --is-inside-work-tree # timeout=10
Fetching changes from the remote Git repository
 > C:\Program Files\Git\cmd\git.exe config remote.origin.url https://github.com/apache/royale-asjs # timeout=10
Fetching upstream changes from https://github.com/apache/royale-asjs
 > C:\Program Files\Git\cmd\git.exe --version # timeout=10
 > C:\Program Files\Git\cmd\git.exe fetch --tags --force --progress -- https://github.com/apache/royale-asjs +refs/heads/*:refs/remotes/origin/*
 > C:\Program Files\Git\cmd\git.exe rev-parse "refs/remotes/origin/develop^{commit}" # timeout=10
 > C:\Program Files\Git\cmd\git.exe rev-parse "refs/remotes/origin/origin/develop^{commit}" # timeout=10
Checking out Revision ecd7312c2073ba5fe78ae06b0bd44b1111d855b8 (refs/remotes/origin/develop)
 > C:\Program Files\Git\cmd\git.exe config core.sparsecheckout # timeout=10
 > C:\Program Files\Git\cmd\git.exe checkout -f ecd7312c2073ba5fe78ae06b0bd44b1111d855b8
Commit message: "jewel-badge: temporal fix for badges clipped"
 > C:\Program Files\Git\cmd\git.exe rev-list --no-walk ecd7312c2073ba5fe78ae06b0bd44b1111d855b8 # timeout=10
[royale-asjs_jsonly] $ cmd.exe /C "C:\apache\apache-ant-1.9.9\bin\ant.bat -DROYALE_COMPILER_REPO=C:\jenkins\workspace\royale-compiler -Denv.ROYALE_TRANSPILER_HOME=C:\jenkins\workspace\royale-compiler\compiler-jx '"-Dbrowser=C:\Program Files\Mozilla Firefox\firefox.exe"' -DROYALE_TYPEDEFS_HOME=C:\jenkins\workspace\royale-typedefs -Dbuild.noprompt=true -Dplayerglobal.version=11.7 -Denv.ROYALE_COMPILER_HOME=C:\jenkins\workspace\royale-compiler\compiler release create-SHA-512 create-SHA-512-jsonly && exit %%ERRORLEVEL%%"
Buildfile: <http://apacheroyaleci2.westus2.cloudapp.azure.com:8080/job/royale-asjs_jsonly/ws/build.xml>

block-flat-fonts:

check-compiler-home:

check-typedefs-home:

thirdparty-clean:

thirdparty-clean:

pixelbender-clean:

swfobject-clean:

flat-ui-clean:

gcl-clean:
     [echo] Deleting Google Closure Library

clean:

examples-clean:

clean:

clean:

clean:

clean:

clean:

clean:

clean:

clean:

clean:

clean:

clean:

clean:

clean:

clean:

clean:

clean:

clean:

clean:

clean:

clean:

clean:

clean:

clean:

BUILD FAILED
<http://apacheroyaleci2.westus2.cloudapp.azure.com:8080/job/royale-asjs_jsonly/ws/build.xml>:630: The following error occurred while executing this line:
<http://apacheroyaleci2.westus2.cloudapp.azure.com:8080/job/royale-asjs_jsonly/ws/examples/build.xml>:163: Basedir <http://apacheroyaleci2.westus2.cloudapp.azure.com:8080/job/royale-asjs_jsonly/ws/examples/royale/TourDeJewel> does not exist

Total time: 0 seconds
Picked up JAVA_TOOL_OPTIONS: -Dfile.encoding=UTF-8 -Xms384m -Xmx2g
Build step 'Invoke Ant' marked build as failure
Skipped archiving because build is not successful

Build failed in Jenkins: royale-asjs_jsonly #1094

Posted by ap...@gmail.com.
See <http://apacheroyaleci2.westus2.cloudapp.azure.com:8080/job/royale-asjs_jsonly/1094/display/redirect>

Changes:


------------------------------------------
Started by timer
Running as SYSTEM
[EnvInject] - Loading node environment variables.
Building remotely on agent1 in workspace <http://apacheroyaleci2.westus2.cloudapp.azure.com:8080/job/royale-asjs_jsonly/ws/>
No credentials specified
 > C:\Program Files\Git\cmd\git.exe rev-parse --is-inside-work-tree # timeout=10
Fetching changes from the remote Git repository
 > C:\Program Files\Git\cmd\git.exe config remote.origin.url https://github.com/apache/royale-asjs # timeout=10
Fetching upstream changes from https://github.com/apache/royale-asjs
 > C:\Program Files\Git\cmd\git.exe --version # timeout=10
 > C:\Program Files\Git\cmd\git.exe fetch --tags --force --progress -- https://github.com/apache/royale-asjs +refs/heads/*:refs/remotes/origin/*
 > C:\Program Files\Git\cmd\git.exe rev-parse "refs/remotes/origin/develop^{commit}" # timeout=10
 > C:\Program Files\Git\cmd\git.exe rev-parse "refs/remotes/origin/origin/develop^{commit}" # timeout=10
Checking out Revision ecd7312c2073ba5fe78ae06b0bd44b1111d855b8 (refs/remotes/origin/develop)
 > C:\Program Files\Git\cmd\git.exe config core.sparsecheckout # timeout=10
 > C:\Program Files\Git\cmd\git.exe checkout -f ecd7312c2073ba5fe78ae06b0bd44b1111d855b8
Commit message: "jewel-badge: temporal fix for badges clipped"
 > C:\Program Files\Git\cmd\git.exe rev-list --no-walk ecd7312c2073ba5fe78ae06b0bd44b1111d855b8 # timeout=10
[royale-asjs_jsonly] $ cmd.exe /C "C:\apache\apache-ant-1.9.9\bin\ant.bat -DROYALE_COMPILER_REPO=C:\jenkins\workspace\royale-compiler -Denv.ROYALE_TRANSPILER_HOME=C:\jenkins\workspace\royale-compiler\compiler-jx '"-Dbrowser=C:\Program Files\Mozilla Firefox\firefox.exe"' -DROYALE_TYPEDEFS_HOME=C:\jenkins\workspace\royale-typedefs -Dbuild.noprompt=true -Dplayerglobal.version=11.7 -Denv.ROYALE_COMPILER_HOME=C:\jenkins\workspace\royale-compiler\compiler release create-SHA-512 create-SHA-512-jsonly && exit %%ERRORLEVEL%%"
Buildfile: <http://apacheroyaleci2.westus2.cloudapp.azure.com:8080/job/royale-asjs_jsonly/ws/build.xml>

block-flat-fonts:

check-compiler-home:

check-typedefs-home:

thirdparty-clean:

thirdparty-clean:

pixelbender-clean:

swfobject-clean:

flat-ui-clean:

gcl-clean:
     [echo] Deleting Google Closure Library

clean:

examples-clean:

clean:

clean:

clean:

clean:

clean:

clean:

clean:

clean:

clean:

clean:

clean:

clean:

clean:

clean:

clean:

clean:

clean:

clean:

clean:

clean:

clean:

clean:

clean:

BUILD FAILED
<http://apacheroyaleci2.westus2.cloudapp.azure.com:8080/job/royale-asjs_jsonly/ws/build.xml>:630: The following error occurred while executing this line:
<http://apacheroyaleci2.westus2.cloudapp.azure.com:8080/job/royale-asjs_jsonly/ws/examples/build.xml>:163: Basedir <http://apacheroyaleci2.westus2.cloudapp.azure.com:8080/job/royale-asjs_jsonly/ws/examples/royale/TourDeJewel> does not exist

Total time: 0 seconds
Picked up JAVA_TOOL_OPTIONS: -Dfile.encoding=UTF-8 -Xms384m -Xmx2g
Build step 'Invoke Ant' marked build as failure
Skipped archiving because build is not successful