You are viewing a plain text version of this content. The canonical link for it is here.
Posted to dev@kafka.apache.org by Apache Jenkins Server <je...@builds.apache.org> on 2016/08/20 07:42:28 UTC
Build failed in Jenkins: kafka-trunk-jdk7 #1488
See <https://builds.apache.org/job/kafka-trunk-jdk7/1488/changes>
Changes:
[wangguoz] KAFKA-3949: Fix race condition when metadata update arrives during
------------------------------------------
[...truncated 12056 lines...]
org.apache.kafka.streams.processor.internals.assignment.AssignmentInfoTest > shouldDecodePreviousVersion PASSED
org.apache.kafka.streams.processor.internals.assignment.SubscriptionInfoTest > testEncodeDecode STARTED
org.apache.kafka.streams.processor.internals.assignment.SubscriptionInfoTest > testEncodeDecode PASSED
org.apache.kafka.streams.processor.internals.assignment.SubscriptionInfoTest > shouldEncodeDecodeWithUserEndPoint STARTED
org.apache.kafka.streams.processor.internals.assignment.SubscriptionInfoTest > shouldEncodeDecodeWithUserEndPoint PASSED
org.apache.kafka.streams.processor.internals.assignment.SubscriptionInfoTest > shouldBeBackwardCompatible STARTED
org.apache.kafka.streams.processor.internals.assignment.SubscriptionInfoTest > shouldBeBackwardCompatible PASSED
org.apache.kafka.streams.processor.internals.StreamThreadTest > testInjectClients STARTED
org.apache.kafka.streams.processor.internals.StreamThreadTest > testInjectClients PASSED
org.apache.kafka.streams.processor.internals.StreamThreadTest > testMaybeCommit STARTED
org.apache.kafka.streams.processor.internals.StreamThreadTest > testMaybeCommit PASSED
org.apache.kafka.streams.processor.internals.StreamThreadTest > testPartitionAssignmentChange STARTED
org.apache.kafka.streams.processor.internals.StreamThreadTest > testPartitionAssignmentChange PASSED
org.apache.kafka.streams.processor.internals.StreamThreadTest > testMaybeClean STARTED
org.apache.kafka.streams.processor.internals.StreamThreadTest > testMaybeClean PASSED
org.apache.kafka.streams.processor.internals.PunctuationQueueTest > testPunctuationInterval STARTED
org.apache.kafka.streams.processor.internals.PunctuationQueueTest > testPunctuationInterval PASSED
org.apache.kafka.streams.processor.internals.RecordQueueTest > testTimeTracking STARTED
org.apache.kafka.streams.processor.internals.RecordQueueTest > testTimeTracking PASSED
org.apache.kafka.streams.processor.internals.ProcessorStateManagerTest > testRegisterNonPersistentStore STARTED
org.apache.kafka.streams.processor.internals.ProcessorStateManagerTest > testRegisterNonPersistentStore PASSED
org.apache.kafka.streams.processor.internals.ProcessorStateManagerTest > testGetStore STARTED
org.apache.kafka.streams.processor.internals.ProcessorStateManagerTest > testGetStore PASSED
org.apache.kafka.streams.processor.internals.ProcessorStateManagerTest > testClose STARTED
org.apache.kafka.streams.processor.internals.ProcessorStateManagerTest > testClose PASSED
org.apache.kafka.streams.processor.internals.ProcessorStateManagerTest > testChangeLogOffsets STARTED
org.apache.kafka.streams.processor.internals.ProcessorStateManagerTest > testChangeLogOffsets PASSED
org.apache.kafka.streams.processor.internals.ProcessorStateManagerTest > testRegisterPersistentStore STARTED
org.apache.kafka.streams.processor.internals.ProcessorStateManagerTest > testRegisterPersistentStore PASSED
org.apache.kafka.streams.processor.internals.ProcessorStateManagerTest > testNoTopic STARTED
org.apache.kafka.streams.processor.internals.ProcessorStateManagerTest > testNoTopic PASSED
org.apache.kafka.streams.processor.internals.StreamTaskTest > testProcessOrder STARTED
org.apache.kafka.streams.processor.internals.StreamTaskTest > testProcessOrder PASSED
org.apache.kafka.streams.processor.internals.StreamTaskTest > testPauseResume STARTED
org.apache.kafka.streams.processor.internals.StreamTaskTest > testPauseResume PASSED
org.apache.kafka.streams.processor.internals.StreamTaskTest > testMaybePunctuate STARTED
org.apache.kafka.streams.processor.internals.StreamTaskTest > testMaybePunctuate PASSED
org.apache.kafka.streams.processor.internals.QuickUnionTest > testUnite STARTED
org.apache.kafka.streams.processor.internals.QuickUnionTest > testUnite PASSED
org.apache.kafka.streams.processor.internals.QuickUnionTest > testUniteMany STARTED
org.apache.kafka.streams.processor.internals.QuickUnionTest > testUniteMany PASSED
org.apache.kafka.streams.processor.TopologyBuilderTest > shouldNotAllowNullProcessorSupplier STARTED
org.apache.kafka.streams.processor.TopologyBuilderTest > shouldNotAllowNullProcessorSupplier PASSED
org.apache.kafka.streams.processor.TopologyBuilderTest > shouldNotSetApplicationIdToNull STARTED
org.apache.kafka.streams.processor.TopologyBuilderTest > shouldNotSetApplicationIdToNull PASSED
org.apache.kafka.streams.processor.TopologyBuilderTest > shouldNotAllowNullApplicationIdOnBuild STARTED
org.apache.kafka.streams.processor.TopologyBuilderTest > shouldNotAllowNullApplicationIdOnBuild PASSED
org.apache.kafka.streams.processor.TopologyBuilderTest > testSourceTopics STARTED
org.apache.kafka.streams.processor.TopologyBuilderTest > testSourceTopics PASSED
org.apache.kafka.streams.processor.TopologyBuilderTest > shouldNotAllowNullNameWhenAddingSink STARTED
org.apache.kafka.streams.processor.TopologyBuilderTest > shouldNotAllowNullNameWhenAddingSink PASSED
org.apache.kafka.streams.processor.TopologyBuilderTest > testNamedTopicMatchesAlreadyProvidedPattern STARTED
org.apache.kafka.streams.processor.TopologyBuilderTest > testNamedTopicMatchesAlreadyProvidedPattern PASSED
org.apache.kafka.streams.processor.TopologyBuilderTest > testAddSinkWithSameName STARTED
org.apache.kafka.streams.processor.TopologyBuilderTest > testAddSinkWithSameName PASSED
org.apache.kafka.streams.processor.TopologyBuilderTest > testAddSinkWithSelfParent STARTED
org.apache.kafka.streams.processor.TopologyBuilderTest > testAddSinkWithSelfParent PASSED
org.apache.kafka.streams.processor.TopologyBuilderTest > testAddProcessorWithSelfParent STARTED
org.apache.kafka.streams.processor.TopologyBuilderTest > testAddProcessorWithSelfParent PASSED
org.apache.kafka.streams.processor.TopologyBuilderTest > shouldAssociateStateStoreNameWhenStateStoreSupplierIsInternal STARTED
org.apache.kafka.streams.processor.TopologyBuilderTest > shouldAssociateStateStoreNameWhenStateStoreSupplierIsInternal PASSED
org.apache.kafka.streams.processor.TopologyBuilderTest > testAddStateStoreWithSink STARTED
org.apache.kafka.streams.processor.TopologyBuilderTest > testAddStateStoreWithSink PASSED
org.apache.kafka.streams.processor.TopologyBuilderTest > testTopicGroups STARTED
org.apache.kafka.streams.processor.TopologyBuilderTest > testTopicGroups PASSED
org.apache.kafka.streams.processor.TopologyBuilderTest > testBuild STARTED
org.apache.kafka.streams.processor.TopologyBuilderTest > testBuild PASSED
org.apache.kafka.streams.processor.TopologyBuilderTest > shouldNotAddNullStateStoreSupplier STARTED
org.apache.kafka.streams.processor.TopologyBuilderTest > shouldNotAddNullStateStoreSupplier PASSED
org.apache.kafka.streams.processor.TopologyBuilderTest > shouldNotAllowNullNameWhenAddingSource STARTED
org.apache.kafka.streams.processor.TopologyBuilderTest > shouldNotAllowNullNameWhenAddingSource PASSED
org.apache.kafka.streams.processor.TopologyBuilderTest > shouldNotAllowNullTopicWhenAddingSink STARTED
org.apache.kafka.streams.processor.TopologyBuilderTest > shouldNotAllowNullTopicWhenAddingSink PASSED
org.apache.kafka.streams.processor.TopologyBuilderTest > testAddStateStoreWithSource STARTED
org.apache.kafka.streams.processor.TopologyBuilderTest > testAddStateStoreWithSource PASSED
org.apache.kafka.streams.processor.TopologyBuilderTest > shouldNotAllowNullProcessorNameWhenConnectingProcessorAndStateStores STARTED
org.apache.kafka.streams.processor.TopologyBuilderTest > shouldNotAllowNullProcessorNameWhenConnectingProcessorAndStateStores PASSED
org.apache.kafka.streams.processor.TopologyBuilderTest > testAddSourceWithSameName STARTED
org.apache.kafka.streams.processor.TopologyBuilderTest > testAddSourceWithSameName PASSED
org.apache.kafka.streams.processor.TopologyBuilderTest > testAddMoreThanOnePatternSourceNode STARTED
org.apache.kafka.streams.processor.TopologyBuilderTest > testAddMoreThanOnePatternSourceNode PASSED
org.apache.kafka.streams.processor.TopologyBuilderTest > testAddProcessorWithSameName STARTED
org.apache.kafka.streams.processor.TopologyBuilderTest > testAddProcessorWithSameName PASSED
org.apache.kafka.streams.processor.TopologyBuilderTest > testAddSourceWithSameTopic STARTED
org.apache.kafka.streams.processor.TopologyBuilderTest > testAddSourceWithSameTopic PASSED
org.apache.kafka.streams.processor.TopologyBuilderTest > testTopicGroupsByStateStore STARTED
org.apache.kafka.streams.processor.TopologyBuilderTest > testTopicGroupsByStateStore PASSED
org.apache.kafka.streams.processor.TopologyBuilderTest > testAddStateStoreWithDuplicates STARTED
org.apache.kafka.streams.processor.TopologyBuilderTest > testAddStateStoreWithDuplicates PASSED
org.apache.kafka.streams.processor.TopologyBuilderTest > testPatternSourceTopic STARTED
org.apache.kafka.streams.processor.TopologyBuilderTest > testPatternSourceTopic PASSED
org.apache.kafka.streams.processor.TopologyBuilderTest > shouldAssociateStateStoreNameWhenStateStoreSupplierIsExternal STARTED
org.apache.kafka.streams.processor.TopologyBuilderTest > shouldAssociateStateStoreNameWhenStateStoreSupplierIsExternal PASSED
org.apache.kafka.streams.processor.TopologyBuilderTest > testAddSinkWithWrongParent STARTED
org.apache.kafka.streams.processor.TopologyBuilderTest > testAddSinkWithWrongParent PASSED
org.apache.kafka.streams.processor.TopologyBuilderTest > testPatternMatchesAlreadyProvidedTopicSource STARTED
org.apache.kafka.streams.processor.TopologyBuilderTest > testPatternMatchesAlreadyProvidedTopicSource PASSED
org.apache.kafka.streams.processor.TopologyBuilderTest > testAddSinkConnectedWithMultipleParent STARTED
org.apache.kafka.streams.processor.TopologyBuilderTest > testAddSinkConnectedWithMultipleParent PASSED
org.apache.kafka.streams.processor.TopologyBuilderTest > testSubscribeTopicNameAndPattern STARTED
org.apache.kafka.streams.processor.TopologyBuilderTest > testSubscribeTopicNameAndPattern PASSED
org.apache.kafka.streams.processor.TopologyBuilderTest > shouldNotAddNullInternalTopic STARTED
org.apache.kafka.streams.processor.TopologyBuilderTest > shouldNotAddNullInternalTopic PASSED
org.apache.kafka.streams.processor.TopologyBuilderTest > testAddProcessorWithWrongParent STARTED
org.apache.kafka.streams.processor.TopologyBuilderTest > testAddProcessorWithWrongParent PASSED
org.apache.kafka.streams.processor.TopologyBuilderTest > shouldNotAllowNullNameWhenAddingProcessor STARTED
org.apache.kafka.streams.processor.TopologyBuilderTest > shouldNotAllowNullNameWhenAddingProcessor PASSED
org.apache.kafka.streams.processor.TopologyBuilderTest > testAddStateStore STARTED
org.apache.kafka.streams.processor.TopologyBuilderTest > testAddStateStore PASSED
org.apache.kafka.streams.processor.TopologyBuilderTest > testAddSinkConnectedWithParent STARTED
org.apache.kafka.streams.processor.TopologyBuilderTest > testAddSinkConnectedWithParent PASSED
org.apache.kafka.streams.processor.TopologyBuilderTest > testAddStateStoreWithNonExistingProcessor STARTED
org.apache.kafka.streams.processor.TopologyBuilderTest > testAddStateStoreWithNonExistingProcessor PASSED
org.apache.kafka.streams.processor.TopologyBuilderTest > shouldCorrectlyMapStateStoreToInternalTopics STARTED
org.apache.kafka.streams.processor.TopologyBuilderTest > shouldCorrectlyMapStateStoreToInternalTopics PASSED
354 tests completed, 1 failed
:streams:test FAILED
FAILURE: Build failed with an exception.
* What went wrong:
Execution failed for task ':streams:test'.
> There were failing tests. See the report at: file://<https://builds.apache.org/job/kafka-trunk-jdk7/ws/streams/build/reports/tests/index.html>
* Try:
Run with --stacktrace option to get the stack trace. Run with --info or --debug option to get more log output.
BUILD FAILED
Total time: 2 hrs 0 mins 54.696 secs
Build step 'Execute shell' marked build as failure
Recording test results
Setting GRADLE_2_4_RC_2_HOME=/home/jenkins/jenkins-slave/tools/hudson.plugins.gradle.GradleInstallation/Gradle_2.4-rc-2
Setting GRADLE_2_4_RC_2_HOME=/home/jenkins/jenkins-slave/tools/hudson.plugins.gradle.GradleInstallation/Gradle_2.4-rc-2
Jenkins build is back to normal : kafka-trunk-jdk7 #1498
Posted by Apache Jenkins Server <je...@builds.apache.org>.
See <https://builds.apache.org/job/kafka-trunk-jdk7/1498/changes>
Build failed in Jenkins: kafka-trunk-jdk7 #1497
Posted by Apache Jenkins Server <je...@builds.apache.org>.
See <https://builds.apache.org/job/kafka-trunk-jdk7/1497/>
------------------------------------------
[...truncated 6771 lines...]
kafka.coordinator.GroupMetadataManagerTest > testStoreNonEmptyGroup STARTED
kafka.coordinator.GroupMetadataManagerTest > testStoreNonEmptyGroup PASSED
kafka.coordinator.GroupMetadataManagerTest > testExpireGroup STARTED
kafka.coordinator.GroupMetadataManagerTest > testExpireGroup PASSED
kafka.coordinator.GroupMetadataManagerTest > testAddGroup STARTED
kafka.coordinator.GroupMetadataManagerTest > testAddGroup PASSED
kafka.coordinator.GroupMetadataManagerTest > testCommitOffset STARTED
kafka.coordinator.GroupMetadataManagerTest > testCommitOffset PASSED
kafka.coordinator.GroupMetadataManagerTest > testCommitOffsetFailure STARTED
kafka.coordinator.GroupMetadataManagerTest > testCommitOffsetFailure PASSED
kafka.coordinator.GroupMetadataManagerTest > testExpireOffset STARTED
kafka.coordinator.GroupMetadataManagerTest > testExpireOffset PASSED
kafka.coordinator.GroupMetadataManagerTest > testExpireOffsetsWithActiveGroup STARTED
kafka.coordinator.GroupMetadataManagerTest > testExpireOffsetsWithActiveGroup PASSED
kafka.coordinator.GroupMetadataManagerTest > testStoreEmptyGroup STARTED
kafka.coordinator.GroupMetadataManagerTest > testStoreEmptyGroup PASSED
kafka.coordinator.MemberMetadataTest > testMatchesSupportedProtocols STARTED
kafka.coordinator.MemberMetadataTest > testMatchesSupportedProtocols PASSED
kafka.coordinator.MemberMetadataTest > testMetadata STARTED
kafka.coordinator.MemberMetadataTest > testMetadata PASSED
kafka.coordinator.MemberMetadataTest > testMetadataRaisesOnUnsupportedProtocol STARTED
kafka.coordinator.MemberMetadataTest > testMetadataRaisesOnUnsupportedProtocol PASSED
kafka.coordinator.MemberMetadataTest > testVoteForPreferredProtocol STARTED
kafka.coordinator.MemberMetadataTest > testVoteForPreferredProtocol PASSED
kafka.coordinator.MemberMetadataTest > testVoteRaisesOnNoSupportedProtocols STARTED
kafka.coordinator.MemberMetadataTest > testVoteRaisesOnNoSupportedProtocols PASSED
kafka.coordinator.GroupMetadataTest > testDeadToAwaitingSyncIllegalTransition STARTED
kafka.coordinator.GroupMetadataTest > testDeadToAwaitingSyncIllegalTransition PASSED
kafka.coordinator.GroupMetadataTest > testOffsetCommitFailure STARTED
kafka.coordinator.GroupMetadataTest > testOffsetCommitFailure PASSED
kafka.coordinator.GroupMetadataTest > testPreparingRebalanceToStableIllegalTransition STARTED
kafka.coordinator.GroupMetadataTest > testPreparingRebalanceToStableIllegalTransition PASSED
kafka.coordinator.GroupMetadataTest > testStableToDeadTransition STARTED
kafka.coordinator.GroupMetadataTest > testStableToDeadTransition PASSED
kafka.coordinator.GroupMetadataTest > testInitNextGenerationEmptyGroup STARTED
kafka.coordinator.GroupMetadataTest > testInitNextGenerationEmptyGroup PASSED
kafka.coordinator.GroupMetadataTest > testCannotRebalanceWhenDead STARTED
kafka.coordinator.GroupMetadataTest > testCannotRebalanceWhenDead PASSED
kafka.coordinator.GroupMetadataTest > testInitNextGeneration STARTED
kafka.coordinator.GroupMetadataTest > testInitNextGeneration PASSED
kafka.coordinator.GroupMetadataTest > testPreparingRebalanceToEmptyTransition STARTED
kafka.coordinator.GroupMetadataTest > testPreparingRebalanceToEmptyTransition PASSED
kafka.coordinator.GroupMetadataTest > testSelectProtocol STARTED
kafka.coordinator.GroupMetadataTest > testSelectProtocol PASSED
kafka.coordinator.GroupMetadataTest > testCannotRebalanceWhenPreparingRebalance STARTED
kafka.coordinator.GroupMetadataTest > testCannotRebalanceWhenPreparingRebalance PASSED
kafka.coordinator.GroupMetadataTest > testDeadToPreparingRebalanceIllegalTransition STARTED
kafka.coordinator.GroupMetadataTest > testDeadToPreparingRebalanceIllegalTransition PASSED
kafka.coordinator.GroupMetadataTest > testCanRebalanceWhenAwaitingSync STARTED
kafka.coordinator.GroupMetadataTest > testCanRebalanceWhenAwaitingSync PASSED
kafka.coordinator.GroupMetadataTest > testAwaitingSyncToPreparingRebalanceTransition STARTED
kafka.coordinator.GroupMetadataTest > testAwaitingSyncToPreparingRebalanceTransition PASSED
kafka.coordinator.GroupMetadataTest > testStableToAwaitingSyncIllegalTransition STARTED
kafka.coordinator.GroupMetadataTest > testStableToAwaitingSyncIllegalTransition PASSED
kafka.coordinator.GroupMetadataTest > testEmptyToDeadTransition STARTED
kafka.coordinator.GroupMetadataTest > testEmptyToDeadTransition PASSED
kafka.coordinator.GroupMetadataTest > testSelectProtocolRaisesIfNoMembers STARTED
kafka.coordinator.GroupMetadataTest > testSelectProtocolRaisesIfNoMembers PASSED
kafka.coordinator.GroupMetadataTest > testStableToPreparingRebalanceTransition STARTED
kafka.coordinator.GroupMetadataTest > testStableToPreparingRebalanceTransition PASSED
kafka.coordinator.GroupMetadataTest > testPreparingRebalanceToDeadTransition STARTED
kafka.coordinator.GroupMetadataTest > testPreparingRebalanceToDeadTransition PASSED
kafka.coordinator.GroupMetadataTest > testStableToStableIllegalTransition STARTED
kafka.coordinator.GroupMetadataTest > testStableToStableIllegalTransition PASSED
kafka.coordinator.GroupMetadataTest > testAwaitingSyncToStableTransition STARTED
kafka.coordinator.GroupMetadataTest > testAwaitingSyncToStableTransition PASSED
kafka.coordinator.GroupMetadataTest > testOffsetCommitFailureWithAnotherPending STARTED
kafka.coordinator.GroupMetadataTest > testOffsetCommitFailureWithAnotherPending PASSED
kafka.coordinator.GroupMetadataTest > testDeadToStableIllegalTransition STARTED
kafka.coordinator.GroupMetadataTest > testDeadToStableIllegalTransition PASSED
kafka.coordinator.GroupMetadataTest > testOffsetCommit STARTED
kafka.coordinator.GroupMetadataTest > testOffsetCommit PASSED
kafka.coordinator.GroupMetadataTest > testAwaitingSyncToAwaitingSyncIllegalTransition STARTED
kafka.coordinator.GroupMetadataTest > testAwaitingSyncToAwaitingSyncIllegalTransition PASSED
kafka.coordinator.GroupMetadataTest > testSupportsProtocols STARTED
kafka.coordinator.GroupMetadataTest > testSupportsProtocols PASSED
kafka.coordinator.GroupMetadataTest > testCanRebalanceWhenStable STARTED
kafka.coordinator.GroupMetadataTest > testCanRebalanceWhenStable PASSED
kafka.coordinator.GroupMetadataTest > testOffsetCommitWithAnotherPending STARTED
kafka.coordinator.GroupMetadataTest > testOffsetCommitWithAnotherPending PASSED
kafka.coordinator.GroupMetadataTest > testPreparingRebalanceToPreparingRebalanceIllegalTransition STARTED
kafka.coordinator.GroupMetadataTest > testPreparingRebalanceToPreparingRebalanceIllegalTransition PASSED
kafka.coordinator.GroupMetadataTest > testSelectProtocolChoosesCompatibleProtocol STARTED
kafka.coordinator.GroupMetadataTest > testSelectProtocolChoosesCompatibleProtocol PASSED
kafka.javaapi.message.ByteBufferMessageSetTest > testSizeInBytesWithCompression STARTED
kafka.javaapi.message.ByteBufferMessageSetTest > testSizeInBytesWithCompression PASSED
kafka.javaapi.message.ByteBufferMessageSetTest > testIteratorIsConsistentWithCompression STARTED
kafka.javaapi.message.ByteBufferMessageSetTest > testIteratorIsConsistentWithCompression PASSED
kafka.javaapi.message.ByteBufferMessageSetTest > testIteratorIsConsistent STARTED
kafka.javaapi.message.ByteBufferMessageSetTest > testIteratorIsConsistent PASSED
kafka.javaapi.message.ByteBufferMessageSetTest > testEqualsWithCompression STARTED
kafka.javaapi.message.ByteBufferMessageSetTest > testEqualsWithCompression PASSED
kafka.javaapi.message.ByteBufferMessageSetTest > testWrittenEqualsRead STARTED
kafka.javaapi.message.ByteBufferMessageSetTest > testWrittenEqualsRead PASSED
kafka.javaapi.message.ByteBufferMessageSetTest > testEquals STARTED
kafka.javaapi.message.ByteBufferMessageSetTest > testEquals PASSED
kafka.javaapi.message.ByteBufferMessageSetTest > testSizeInBytes STARTED
kafka.javaapi.message.ByteBufferMessageSetTest > testSizeInBytes PASSED
kafka.javaapi.consumer.ZookeeperConsumerConnectorTest > testBasic STARTED
kafka.javaapi.consumer.ZookeeperConsumerConnectorTest > testBasic PASSED
kafka.KafkaTest > testGetKafkaConfigFromArgsWrongSetValue STARTED
kafka.KafkaTest > testGetKafkaConfigFromArgsWrongSetValue PASSED
kafka.KafkaTest > testKafkaSslPasswords STARTED
kafka.KafkaTest > testKafkaSslPasswords PASSED
kafka.KafkaTest > testGetKafkaConfigFromArgs STARTED
kafka.KafkaTest > testGetKafkaConfigFromArgs PASSED
kafka.KafkaTest > testGetKafkaConfigFromArgsNonArgsAtTheEnd STARTED
kafka.KafkaTest > testGetKafkaConfigFromArgsNonArgsAtTheEnd PASSED
kafka.KafkaTest > testGetKafkaConfigFromArgsNonArgsOnly STARTED
kafka.KafkaTest > testGetKafkaConfigFromArgsNonArgsOnly PASSED
kafka.KafkaTest > testGetKafkaConfigFromArgsNonArgsAtTheBegging STARTED
kafka.KafkaTest > testGetKafkaConfigFromArgsNonArgsAtTheBegging PASSED
kafka.controller.ControllerFailoverTest > testMetadataUpdate STARTED
kafka.controller.ControllerFailoverTest > testMetadataUpdate PASSED
818 tests completed, 1 failed
:kafka-trunk-jdk7:core:test FAILED
:test_core_2_11 FAILED
FAILURE: Build failed with an exception.
* What went wrong:
Execution failed for task ':core:test'.
> There were failing tests. See the report at: file://<https://builds.apache.org/job/kafka-trunk-jdk7/ws/core/build/reports/tests/test/index.html>
* Try:
Run with --stacktrace option to get the stack trace. Run with --info or --debug option to get more log output.
BUILD FAILED
Total time: 2 hrs 53 mins 18.98 secs
Build step 'Execute shell' marked build as failure
Recording test results
Setting GRADLE_2_4_RC_2_HOME=/home/jenkins/jenkins-slave/tools/hudson.plugins.gradle.GradleInstallation/Gradle_2.4-rc-2
ERROR: Step ?Publish JUnit test result report? failed: No test report files were found. Configuration error?
Setting GRADLE_2_4_RC_2_HOME=/home/jenkins/jenkins-slave/tools/hudson.plugins.gradle.GradleInstallation/Gradle_2.4-rc-2
Build failed in Jenkins: kafka-trunk-jdk7 #1496
Posted by Apache Jenkins Server <je...@builds.apache.org>.
See <https://builds.apache.org/job/kafka-trunk-jdk7/1496/changes>
Changes:
[ismael] KAFKA-3937; Kafka Clients Leak Native Memory For Longer Than Needed With
[ismael] KAFKA-4082; Upgrade to Gradle 3.0
------------------------------------------
[...truncated 13496 lines...]
org.apache.kafka.connect.runtime.distributed.DistributedHerderTest > testRestartTaskRedirectToOwner PASSED
org.apache.kafka.connect.runtime.distributed.DistributedHerderTest > testConnectorConfigAdded STARTED
org.apache.kafka.connect.runtime.distributed.DistributedHerderTest > testConnectorConfigAdded PASSED
org.apache.kafka.connect.runtime.distributed.DistributedHerderTest > testConnectorConfigUpdate STARTED
org.apache.kafka.connect.runtime.distributed.DistributedHerderTest > testConnectorConfigUpdate PASSED
org.apache.kafka.connect.runtime.distributed.DistributedHerderTest > testConnectorPaused STARTED
org.apache.kafka.connect.runtime.distributed.DistributedHerderTest > testConnectorPaused PASSED
org.apache.kafka.connect.runtime.distributed.DistributedHerderTest > testConnectorResumed STARTED
org.apache.kafka.connect.runtime.distributed.DistributedHerderTest > testConnectorResumed PASSED
org.apache.kafka.connect.runtime.distributed.DistributedHerderTest > testUnknownConnectorPaused STARTED
org.apache.kafka.connect.runtime.distributed.DistributedHerderTest > testUnknownConnectorPaused PASSED
org.apache.kafka.connect.runtime.distributed.DistributedHerderTest > testConnectorPausedRunningTaskOnly STARTED
org.apache.kafka.connect.runtime.distributed.DistributedHerderTest > testConnectorPausedRunningTaskOnly PASSED
org.apache.kafka.connect.runtime.distributed.DistributedHerderTest > testConnectorResumedRunningTaskOnly STARTED
org.apache.kafka.connect.runtime.distributed.DistributedHerderTest > testConnectorResumedRunningTaskOnly PASSED
org.apache.kafka.connect.runtime.distributed.DistributedHerderTest > testTaskConfigAdded STARTED
org.apache.kafka.connect.runtime.distributed.DistributedHerderTest > testTaskConfigAdded PASSED
org.apache.kafka.connect.runtime.distributed.DistributedHerderTest > testJoinLeaderCatchUpFails STARTED
org.apache.kafka.connect.runtime.distributed.DistributedHerderTest > testJoinLeaderCatchUpFails PASSED
org.apache.kafka.connect.runtime.distributed.DistributedHerderTest > testInconsistentConfigs STARTED
org.apache.kafka.connect.runtime.distributed.DistributedHerderTest > testInconsistentConfigs PASSED
org.apache.kafka.connect.runtime.WorkerSinkTaskTest > testErrorInRebalancePartitionAssignment STARTED
org.apache.kafka.connect.runtime.WorkerSinkTaskTest > testErrorInRebalancePartitionAssignment PASSED
org.apache.kafka.connect.runtime.WorkerSinkTaskTest > testPollRedelivery STARTED
org.apache.kafka.connect.runtime.WorkerSinkTaskTest > testPollRedelivery PASSED
org.apache.kafka.connect.runtime.WorkerSinkTaskTest > testStartPaused STARTED
org.apache.kafka.connect.runtime.WorkerSinkTaskTest > testStartPaused PASSED
org.apache.kafka.connect.runtime.WorkerSinkTaskTest > testPause STARTED
org.apache.kafka.connect.runtime.WorkerSinkTaskTest > testPause PASSED
org.apache.kafka.connect.runtime.WorkerSinkTaskTest > testWakeupInCommitSyncCausesRetry STARTED
org.apache.kafka.connect.runtime.WorkerSinkTaskTest > testWakeupInCommitSyncCausesRetry PASSED
org.apache.kafka.connect.runtime.WorkerSinkTaskTest > testErrorInRebalancePartitionRevocation STARTED
org.apache.kafka.connect.runtime.WorkerSinkTaskTest > testErrorInRebalancePartitionRevocation PASSED
org.apache.kafka.connect.runtime.WorkerSinkTaskTest > testMissingTimestampPropagation STARTED
org.apache.kafka.connect.runtime.WorkerSinkTaskTest > testMissingTimestampPropagation PASSED
org.apache.kafka.connect.runtime.WorkerSinkTaskTest > testTimestampPropagation STARTED
org.apache.kafka.connect.runtime.WorkerSinkTaskTest > testTimestampPropagation PASSED
org.apache.kafka.connect.storage.FileOffsetBackingStoreTest > testSaveRestore STARTED
org.apache.kafka.connect.storage.FileOffsetBackingStoreTest > testSaveRestore PASSED
org.apache.kafka.connect.storage.FileOffsetBackingStoreTest > testGetSet STARTED
org.apache.kafka.connect.storage.FileOffsetBackingStoreTest > testGetSet PASSED
org.apache.kafka.connect.storage.KafkaConfigBackingStoreTest > testStartStop STARTED
org.apache.kafka.connect.storage.KafkaConfigBackingStoreTest > testStartStop PASSED
org.apache.kafka.connect.storage.KafkaConfigBackingStoreTest > testBackgroundConnectorDeletion STARTED
org.apache.kafka.connect.storage.KafkaConfigBackingStoreTest > testBackgroundConnectorDeletion PASSED
org.apache.kafka.connect.storage.KafkaConfigBackingStoreTest > testPutConnectorConfig STARTED
org.apache.kafka.connect.storage.KafkaConfigBackingStoreTest > testPutConnectorConfig PASSED
org.apache.kafka.connect.storage.KafkaConfigBackingStoreTest > testRestoreTargetState STARTED
org.apache.kafka.connect.storage.KafkaConfigBackingStoreTest > testRestoreTargetState PASSED
org.apache.kafka.connect.storage.KafkaConfigBackingStoreTest > testBackgroundUpdateTargetState STARTED
org.apache.kafka.connect.storage.KafkaConfigBackingStoreTest > testBackgroundUpdateTargetState PASSED
org.apache.kafka.connect.storage.KafkaConfigBackingStoreTest > testPutTaskConfigsDoesNotResolveAllInconsistencies STARTED
org.apache.kafka.connect.storage.KafkaConfigBackingStoreTest > testPutTaskConfigsDoesNotResolveAllInconsistencies PASSED
org.apache.kafka.connect.storage.KafkaConfigBackingStoreTest > testPutTaskConfigs STARTED
org.apache.kafka.connect.storage.KafkaConfigBackingStoreTest > testPutTaskConfigs PASSED
org.apache.kafka.connect.storage.KafkaConfigBackingStoreTest > testPutTaskConfigsZeroTasks STARTED
org.apache.kafka.connect.storage.KafkaConfigBackingStoreTest > testPutTaskConfigsZeroTasks PASSED
org.apache.kafka.connect.storage.KafkaConfigBackingStoreTest > testRestore STARTED
org.apache.kafka.connect.storage.KafkaConfigBackingStoreTest > testRestore PASSED
org.apache.kafka.connect.storage.KafkaConfigBackingStoreTest > testRestoreTargetStateUnexpectedDeletion STARTED
org.apache.kafka.connect.storage.KafkaConfigBackingStoreTest > testRestoreTargetStateUnexpectedDeletion PASSED
org.apache.kafka.connect.storage.KafkaConfigBackingStoreTest > testRestoreConnectorDeletion STARTED
org.apache.kafka.connect.storage.KafkaConfigBackingStoreTest > testRestoreConnectorDeletion PASSED
org.apache.kafka.connect.storage.KafkaConfigBackingStoreTest > testRestoreZeroTasks STARTED
org.apache.kafka.connect.storage.KafkaConfigBackingStoreTest > testRestoreZeroTasks PASSED
org.apache.kafka.connect.storage.KafkaOffsetBackingStoreTest > testStartStop STARTED
org.apache.kafka.connect.storage.KafkaOffsetBackingStoreTest > testStartStop PASSED
org.apache.kafka.connect.storage.KafkaOffsetBackingStoreTest > testReloadOnStart STARTED
org.apache.kafka.connect.storage.KafkaOffsetBackingStoreTest > testReloadOnStart PASSED
org.apache.kafka.connect.storage.KafkaOffsetBackingStoreTest > testGetSet STARTED
org.apache.kafka.connect.storage.KafkaOffsetBackingStoreTest > testGetSet PASSED
org.apache.kafka.connect.storage.KafkaOffsetBackingStoreTest > testGetSetNull STARTED
org.apache.kafka.connect.storage.KafkaOffsetBackingStoreTest > testGetSetNull PASSED
org.apache.kafka.connect.storage.KafkaOffsetBackingStoreTest > testSetFailure STARTED
org.apache.kafka.connect.storage.KafkaOffsetBackingStoreTest > testSetFailure PASSED
org.apache.kafka.connect.storage.OffsetStorageWriterTest > testWriteFlush STARTED
org.apache.kafka.connect.storage.OffsetStorageWriterTest > testWriteFlush PASSED
org.apache.kafka.connect.storage.OffsetStorageWriterTest > testWriteNullValueFlush STARTED
org.apache.kafka.connect.storage.OffsetStorageWriterTest > testWriteNullValueFlush PASSED
org.apache.kafka.connect.storage.OffsetStorageWriterTest > testWriteNullKeyFlush STARTED
org.apache.kafka.connect.storage.OffsetStorageWriterTest > testWriteNullKeyFlush PASSED
org.apache.kafka.connect.storage.OffsetStorageWriterTest > testNoOffsetsToFlush STARTED
org.apache.kafka.connect.storage.OffsetStorageWriterTest > testNoOffsetsToFlush PASSED
org.apache.kafka.connect.storage.OffsetStorageWriterTest > testAlreadyFlushing STARTED
org.apache.kafka.connect.storage.OffsetStorageWriterTest > testAlreadyFlushing PASSED
org.apache.kafka.connect.storage.OffsetStorageWriterTest > testCancelBeforeAwaitFlush STARTED
org.apache.kafka.connect.storage.OffsetStorageWriterTest > testCancelBeforeAwaitFlush PASSED
org.apache.kafka.connect.storage.OffsetStorageWriterTest > testCancelAfterAwaitFlush STARTED
org.apache.kafka.connect.storage.OffsetStorageWriterTest > testCancelAfterAwaitFlush PASSED
org.apache.kafka.connect.storage.OffsetStorageWriterTest > testFlushFailureReplacesOffsets STARTED
org.apache.kafka.connect.storage.OffsetStorageWriterTest > testFlushFailureReplacesOffsets PASSED
org.apache.kafka.connect.storage.KafkaStatusBackingStoreTest > readTaskState STARTED
org.apache.kafka.connect.storage.KafkaStatusBackingStoreTest > readTaskState PASSED
org.apache.kafka.connect.storage.KafkaStatusBackingStoreTest > putTaskState STARTED
org.apache.kafka.connect.storage.KafkaStatusBackingStoreTest > putTaskState PASSED
org.apache.kafka.connect.storage.KafkaStatusBackingStoreTest > putConnectorStateNonRetriableFailure STARTED
org.apache.kafka.connect.storage.KafkaStatusBackingStoreTest > putConnectorStateNonRetriableFailure PASSED
org.apache.kafka.connect.storage.KafkaStatusBackingStoreTest > putConnectorStateShouldOverride STARTED
org.apache.kafka.connect.storage.KafkaStatusBackingStoreTest > putConnectorStateShouldOverride PASSED
org.apache.kafka.connect.storage.KafkaStatusBackingStoreTest > putConnectorStateRetriableFailure STARTED
org.apache.kafka.connect.storage.KafkaStatusBackingStoreTest > putConnectorStateRetriableFailure PASSED
org.apache.kafka.connect.storage.KafkaStatusBackingStoreTest > putSafeOverridesValueSetBySameWorker STARTED
org.apache.kafka.connect.storage.KafkaStatusBackingStoreTest > putSafeOverridesValueSetBySameWorker PASSED
org.apache.kafka.connect.storage.KafkaStatusBackingStoreTest > readConnectorState STARTED
org.apache.kafka.connect.storage.KafkaStatusBackingStoreTest > readConnectorState PASSED
org.apache.kafka.connect.storage.KafkaStatusBackingStoreTest > putSafeConnectorIgnoresStaleStatus STARTED
org.apache.kafka.connect.storage.KafkaStatusBackingStoreTest > putSafeConnectorIgnoresStaleStatus PASSED
org.apache.kafka.connect.storage.KafkaStatusBackingStoreTest > putConnectorState STARTED
org.apache.kafka.connect.storage.KafkaStatusBackingStoreTest > putConnectorState PASSED
org.apache.kafka.connect.storage.MemoryStatusBackingStoreTest > putAndGetConnectorStatus STARTED
org.apache.kafka.connect.storage.MemoryStatusBackingStoreTest > putAndGetConnectorStatus PASSED
org.apache.kafka.connect.storage.MemoryStatusBackingStoreTest > putAndGetTaskStatus STARTED
org.apache.kafka.connect.storage.MemoryStatusBackingStoreTest > putAndGetTaskStatus PASSED
org.apache.kafka.connect.storage.MemoryStatusBackingStoreTest > deleteTaskStatus STARTED
org.apache.kafka.connect.storage.MemoryStatusBackingStoreTest > deleteTaskStatus PASSED
org.apache.kafka.connect.storage.MemoryStatusBackingStoreTest > deleteConnectorStatus STARTED
org.apache.kafka.connect.storage.MemoryStatusBackingStoreTest > deleteConnectorStatus PASSED
:streams:examples:checkstyleMain
:streams:examples:compileTestJava UP-TO-DATE
:streams:examples:processTestResources UP-TO-DATE
:streams:examples:testClasses UP-TO-DATE
:streams:examples:checkstyleTest UP-TO-DATE
:streams:examples:test UP-TO-DATE
:testAll
BUILD SUCCESSFUL
Total time: 1 hrs 9 mins 0.772 secs
Recording test results
Setting GRADLE_2_4_RC_2_HOME=/home/jenkins/jenkins-slave/tools/hudson.plugins.gradle.GradleInstallation/Gradle_2.4-rc-2
ERROR: Step ?Publish JUnit test result report? failed: No test report files were found. Configuration error?
Setting GRADLE_2_4_RC_2_HOME=/home/jenkins/jenkins-slave/tools/hudson.plugins.gradle.GradleInstallation/Gradle_2.4-rc-2
Build failed in Jenkins: kafka-trunk-jdk7 #1495
Posted by Apache Jenkins Server <je...@builds.apache.org>.
See <https://builds.apache.org/job/kafka-trunk-jdk7/1495/changes>
Changes:
[me] KAFKA-2894: WorkerSinkTask should rewind offsets on rebalance
------------------------------------------
[...truncated 3385 lines...]
kafka.coordinator.GroupMetadataManagerTest > testStoreNonEmptyGroup STARTED
kafka.coordinator.GroupMetadataManagerTest > testStoreNonEmptyGroup PASSED
kafka.coordinator.GroupMetadataManagerTest > testExpireGroup STARTED
kafka.coordinator.GroupMetadataManagerTest > testExpireGroup PASSED
kafka.coordinator.GroupMetadataManagerTest > testAddGroup STARTED
kafka.coordinator.GroupMetadataManagerTest > testAddGroup PASSED
kafka.coordinator.GroupMetadataManagerTest > testCommitOffset STARTED
kafka.coordinator.GroupMetadataManagerTest > testCommitOffset PASSED
kafka.coordinator.GroupMetadataManagerTest > testCommitOffsetFailure STARTED
kafka.coordinator.GroupMetadataManagerTest > testCommitOffsetFailure PASSED
kafka.coordinator.GroupMetadataManagerTest > testExpireOffset STARTED
kafka.coordinator.GroupMetadataManagerTest > testExpireOffset PASSED
kafka.coordinator.GroupMetadataManagerTest > testExpireOffsetsWithActiveGroup STARTED
kafka.coordinator.GroupMetadataManagerTest > testExpireOffsetsWithActiveGroup PASSED
kafka.coordinator.GroupMetadataManagerTest > testStoreEmptyGroup STARTED
kafka.coordinator.GroupMetadataManagerTest > testStoreEmptyGroup PASSED
kafka.coordinator.MemberMetadataTest > testMatchesSupportedProtocols STARTED
kafka.coordinator.MemberMetadataTest > testMatchesSupportedProtocols PASSED
kafka.coordinator.MemberMetadataTest > testMetadata STARTED
kafka.coordinator.MemberMetadataTest > testMetadata PASSED
kafka.coordinator.MemberMetadataTest > testMetadataRaisesOnUnsupportedProtocol STARTED
kafka.coordinator.MemberMetadataTest > testMetadataRaisesOnUnsupportedProtocol PASSED
kafka.coordinator.MemberMetadataTest > testVoteForPreferredProtocol STARTED
kafka.coordinator.MemberMetadataTest > testVoteForPreferredProtocol PASSED
kafka.coordinator.MemberMetadataTest > testVoteRaisesOnNoSupportedProtocols STARTED
kafka.coordinator.MemberMetadataTest > testVoteRaisesOnNoSupportedProtocols PASSED
kafka.coordinator.GroupMetadataTest > testDeadToAwaitingSyncIllegalTransition STARTED
kafka.coordinator.GroupMetadataTest > testDeadToAwaitingSyncIllegalTransition PASSED
kafka.coordinator.GroupMetadataTest > testOffsetCommitFailure STARTED
kafka.coordinator.GroupMetadataTest > testOffsetCommitFailure PASSED
kafka.coordinator.GroupMetadataTest > testPreparingRebalanceToStableIllegalTransition STARTED
kafka.coordinator.GroupMetadataTest > testPreparingRebalanceToStableIllegalTransition PASSED
kafka.coordinator.GroupMetadataTest > testStableToDeadTransition STARTED
kafka.coordinator.GroupMetadataTest > testStableToDeadTransition PASSED
kafka.coordinator.GroupMetadataTest > testInitNextGenerationEmptyGroup STARTED
kafka.coordinator.GroupMetadataTest > testInitNextGenerationEmptyGroup PASSED
kafka.coordinator.GroupMetadataTest > testCannotRebalanceWhenDead STARTED
kafka.coordinator.GroupMetadataTest > testCannotRebalanceWhenDead PASSED
kafka.coordinator.GroupMetadataTest > testInitNextGeneration STARTED
kafka.coordinator.GroupMetadataTest > testInitNextGeneration PASSED
kafka.coordinator.GroupMetadataTest > testPreparingRebalanceToEmptyTransition STARTED
kafka.coordinator.GroupMetadataTest > testPreparingRebalanceToEmptyTransition PASSED
kafka.coordinator.GroupMetadataTest > testSelectProtocol STARTED
kafka.coordinator.GroupMetadataTest > testSelectProtocol PASSED
kafka.coordinator.GroupMetadataTest > testCannotRebalanceWhenPreparingRebalance STARTED
kafka.coordinator.GroupMetadataTest > testCannotRebalanceWhenPreparingRebalance PASSED
kafka.coordinator.GroupMetadataTest > testDeadToPreparingRebalanceIllegalTransition STARTED
kafka.coordinator.GroupMetadataTest > testDeadToPreparingRebalanceIllegalTransition PASSED
kafka.coordinator.GroupMetadataTest > testCanRebalanceWhenAwaitingSync STARTED
kafka.coordinator.GroupMetadataTest > testCanRebalanceWhenAwaitingSync PASSED
kafka.coordinator.GroupMetadataTest > testAwaitingSyncToPreparingRebalanceTransition STARTED
kafka.coordinator.GroupMetadataTest > testAwaitingSyncToPreparingRebalanceTransition PASSED
kafka.coordinator.GroupMetadataTest > testStableToAwaitingSyncIllegalTransition STARTED
kafka.coordinator.GroupMetadataTest > testStableToAwaitingSyncIllegalTransition PASSED
kafka.coordinator.GroupMetadataTest > testEmptyToDeadTransition STARTED
kafka.coordinator.GroupMetadataTest > testEmptyToDeadTransition PASSED
kafka.coordinator.GroupMetadataTest > testSelectProtocolRaisesIfNoMembers STARTED
kafka.coordinator.GroupMetadataTest > testSelectProtocolRaisesIfNoMembers PASSED
kafka.coordinator.GroupMetadataTest > testStableToPreparingRebalanceTransition STARTED
kafka.coordinator.GroupMetadataTest > testStableToPreparingRebalanceTransition PASSED
kafka.coordinator.GroupMetadataTest > testPreparingRebalanceToDeadTransition STARTED
kafka.coordinator.GroupMetadataTest > testPreparingRebalanceToDeadTransition PASSED
kafka.coordinator.GroupMetadataTest > testStableToStableIllegalTransition STARTED
kafka.coordinator.GroupMetadataTest > testStableToStableIllegalTransition PASSED
kafka.coordinator.GroupMetadataTest > testAwaitingSyncToStableTransition STARTED
kafka.coordinator.GroupMetadataTest > testAwaitingSyncToStableTransition PASSED
kafka.coordinator.GroupMetadataTest > testOffsetCommitFailureWithAnotherPending STARTED
kafka.coordinator.GroupMetadataTest > testOffsetCommitFailureWithAnotherPending PASSED
kafka.coordinator.GroupMetadataTest > testDeadToStableIllegalTransition STARTED
kafka.coordinator.GroupMetadataTest > testDeadToStableIllegalTransition PASSED
kafka.coordinator.GroupMetadataTest > testOffsetCommit STARTED
kafka.coordinator.GroupMetadataTest > testOffsetCommit PASSED
kafka.coordinator.GroupMetadataTest > testAwaitingSyncToAwaitingSyncIllegalTransition STARTED
kafka.coordinator.GroupMetadataTest > testAwaitingSyncToAwaitingSyncIllegalTransition PASSED
kafka.coordinator.GroupMetadataTest > testSupportsProtocols STARTED
kafka.coordinator.GroupMetadataTest > testSupportsProtocols PASSED
kafka.coordinator.GroupMetadataTest > testCanRebalanceWhenStable STARTED
kafka.coordinator.GroupMetadataTest > testCanRebalanceWhenStable PASSED
kafka.coordinator.GroupMetadataTest > testOffsetCommitWithAnotherPending STARTED
kafka.coordinator.GroupMetadataTest > testOffsetCommitWithAnotherPending PASSED
kafka.coordinator.GroupMetadataTest > testPreparingRebalanceToPreparingRebalanceIllegalTransition STARTED
kafka.coordinator.GroupMetadataTest > testPreparingRebalanceToPreparingRebalanceIllegalTransition PASSED
kafka.coordinator.GroupMetadataTest > testSelectProtocolChoosesCompatibleProtocol STARTED
kafka.coordinator.GroupMetadataTest > testSelectProtocolChoosesCompatibleProtocol PASSED
kafka.javaapi.message.ByteBufferMessageSetTest > testSizeInBytesWithCompression STARTED
kafka.javaapi.message.ByteBufferMessageSetTest > testSizeInBytesWithCompression PASSED
kafka.javaapi.message.ByteBufferMessageSetTest > testIteratorIsConsistentWithCompression STARTED
kafka.javaapi.message.ByteBufferMessageSetTest > testIteratorIsConsistentWithCompression PASSED
kafka.javaapi.message.ByteBufferMessageSetTest > testIteratorIsConsistent STARTED
kafka.javaapi.message.ByteBufferMessageSetTest > testIteratorIsConsistent PASSED
kafka.javaapi.message.ByteBufferMessageSetTest > testEqualsWithCompression STARTED
kafka.javaapi.message.ByteBufferMessageSetTest > testEqualsWithCompression PASSED
kafka.javaapi.message.ByteBufferMessageSetTest > testWrittenEqualsRead STARTED
kafka.javaapi.message.ByteBufferMessageSetTest > testWrittenEqualsRead PASSED
kafka.javaapi.message.ByteBufferMessageSetTest > testEquals STARTED
kafka.javaapi.message.ByteBufferMessageSetTest > testEquals PASSED
kafka.javaapi.message.ByteBufferMessageSetTest > testSizeInBytes STARTED
kafka.javaapi.message.ByteBufferMessageSetTest > testSizeInBytes PASSED
kafka.javaapi.consumer.ZookeeperConsumerConnectorTest > testBasic STARTED
kafka.javaapi.consumer.ZookeeperConsumerConnectorTest > testBasic PASSED
kafka.KafkaTest > testGetKafkaConfigFromArgsWrongSetValue STARTED
kafka.KafkaTest > testGetKafkaConfigFromArgsWrongSetValue PASSED
kafka.KafkaTest > testKafkaSslPasswords STARTED
kafka.KafkaTest > testKafkaSslPasswords PASSED
kafka.KafkaTest > testGetKafkaConfigFromArgs STARTED
kafka.KafkaTest > testGetKafkaConfigFromArgs PASSED
kafka.KafkaTest > testGetKafkaConfigFromArgsNonArgsAtTheEnd STARTED
kafka.KafkaTest > testGetKafkaConfigFromArgsNonArgsAtTheEnd PASSED
kafka.KafkaTest > testGetKafkaConfigFromArgsNonArgsOnly STARTED
kafka.KafkaTest > testGetKafkaConfigFromArgsNonArgsOnly PASSED
kafka.KafkaTest > testGetKafkaConfigFromArgsNonArgsAtTheBegging STARTED
kafka.KafkaTest > testGetKafkaConfigFromArgsNonArgsAtTheBegging PASSED
kafka.controller.ControllerFailoverTest > testMetadataUpdate STARTED
kafka.controller.ControllerFailoverTest > testMetadataUpdate PASSED
818 tests completed, 1 failed
:kafka-trunk-jdk7:core:test FAILED
:test_core_2_10 FAILED
FAILURE: Build failed with an exception.
* What went wrong:
Execution failed for task ':core:test'.
> There were failing tests. See the report at: file://<https://builds.apache.org/job/kafka-trunk-jdk7/ws/core/build/reports/tests/index.html>
* Try:
Run with --stacktrace option to get the stack trace. Run with --info or --debug option to get more log output.
BUILD FAILED
Total time: 1 hrs 2 mins 33.476 secs
Build step 'Execute shell' marked build as failure
Recording test results
Setting GRADLE_2_4_RC_2_HOME=/home/jenkins/jenkins-slave/tools/hudson.plugins.gradle.GradleInstallation/Gradle_2.4-rc-2
Setting GRADLE_2_4_RC_2_HOME=/home/jenkins/jenkins-slave/tools/hudson.plugins.gradle.GradleInstallation/Gradle_2.4-rc-2
Build failed in Jenkins: kafka-trunk-jdk7 #1494
Posted by Apache Jenkins Server <je...@builds.apache.org>.
See <https://builds.apache.org/job/kafka-trunk-jdk7/1494/changes>
Changes:
[ismael] KAFKA-3680; Enable Kafka clients to run in any classloader env
------------------------------------------
[...truncated 12108 lines...]
org.apache.kafka.streams.processor.internals.MinTimestampTrackerTest > testTracking PASSED
org.apache.kafka.streams.processor.internals.StreamTaskTest > testProcessOrder STARTED
org.apache.kafka.streams.processor.internals.StreamTaskTest > testProcessOrder PASSED
org.apache.kafka.streams.processor.internals.StreamTaskTest > testPauseResume STARTED
org.apache.kafka.streams.processor.internals.StreamTaskTest > testPauseResume PASSED
org.apache.kafka.streams.processor.internals.StreamTaskTest > testMaybePunctuate STARTED
org.apache.kafka.streams.processor.internals.StreamTaskTest > testMaybePunctuate PASSED
org.apache.kafka.streams.processor.internals.assignment.AssignmentInfoTest > testEncodeDecode STARTED
org.apache.kafka.streams.processor.internals.assignment.AssignmentInfoTest > testEncodeDecode PASSED
org.apache.kafka.streams.processor.internals.assignment.AssignmentInfoTest > shouldDecodePreviousVersion STARTED
org.apache.kafka.streams.processor.internals.assignment.AssignmentInfoTest > shouldDecodePreviousVersion PASSED
org.apache.kafka.streams.processor.internals.assignment.SubscriptionInfoTest > testEncodeDecode STARTED
org.apache.kafka.streams.processor.internals.assignment.SubscriptionInfoTest > testEncodeDecode PASSED
org.apache.kafka.streams.processor.internals.assignment.SubscriptionInfoTest > shouldEncodeDecodeWithUserEndPoint STARTED
org.apache.kafka.streams.processor.internals.assignment.SubscriptionInfoTest > shouldEncodeDecodeWithUserEndPoint PASSED
org.apache.kafka.streams.processor.internals.assignment.SubscriptionInfoTest > shouldBeBackwardCompatible STARTED
org.apache.kafka.streams.processor.internals.assignment.SubscriptionInfoTest > shouldBeBackwardCompatible PASSED
org.apache.kafka.streams.processor.internals.assignment.TaskAssignorTest > testStickiness STARTED
org.apache.kafka.streams.processor.internals.assignment.TaskAssignorTest > testStickiness PASSED
org.apache.kafka.streams.processor.internals.assignment.TaskAssignorTest > testAssignWithStandby STARTED
org.apache.kafka.streams.processor.internals.assignment.TaskAssignorTest > testAssignWithStandby PASSED
org.apache.kafka.streams.processor.internals.assignment.TaskAssignorTest > testAssignWithoutStandby STARTED
org.apache.kafka.streams.processor.internals.assignment.TaskAssignorTest > testAssignWithoutStandby PASSED
org.apache.kafka.streams.processor.internals.ProcessorTopologyTest > testDrivingMultiplexingTopology STARTED
org.apache.kafka.streams.processor.internals.ProcessorTopologyTest > testDrivingMultiplexingTopology PASSED
org.apache.kafka.streams.processor.internals.ProcessorTopologyTest > testDrivingStatefulTopology STARTED
org.apache.kafka.streams.processor.internals.ProcessorTopologyTest > testDrivingStatefulTopology PASSED
org.apache.kafka.streams.processor.internals.ProcessorTopologyTest > testDrivingSimpleTopology STARTED
org.apache.kafka.streams.processor.internals.ProcessorTopologyTest > testDrivingSimpleTopology PASSED
org.apache.kafka.streams.processor.internals.ProcessorTopologyTest > testTopologyMetadata STARTED
org.apache.kafka.streams.processor.internals.ProcessorTopologyTest > testTopologyMetadata PASSED
org.apache.kafka.streams.processor.internals.ProcessorTopologyTest > testDrivingMultiplexByNameTopology STARTED
org.apache.kafka.streams.processor.internals.ProcessorTopologyTest > testDrivingMultiplexByNameTopology PASSED
org.apache.kafka.streams.processor.internals.RecordCollectorTest > testSpecificPartition STARTED
org.apache.kafka.streams.processor.internals.RecordCollectorTest > testSpecificPartition PASSED
org.apache.kafka.streams.processor.internals.RecordCollectorTest > testStreamPartitioner STARTED
org.apache.kafka.streams.processor.internals.RecordCollectorTest > testStreamPartitioner PASSED
org.apache.kafka.streams.processor.internals.PunctuationQueueTest > testPunctuationInterval STARTED
org.apache.kafka.streams.processor.internals.PunctuationQueueTest > testPunctuationInterval PASSED
org.apache.kafka.streams.processor.internals.StreamPartitionAssignorTest > shouldThrowExceptionIfApplicationServerConfigIsNotHostPortPair STARTED
org.apache.kafka.streams.processor.internals.StreamPartitionAssignorTest > shouldThrowExceptionIfApplicationServerConfigIsNotHostPortPair PASSED
org.apache.kafka.streams.processor.internals.StreamPartitionAssignorTest > shouldMapUserEndPointToTopicPartitions STARTED
org.apache.kafka.streams.processor.internals.StreamPartitionAssignorTest > shouldMapUserEndPointToTopicPartitions PASSED
org.apache.kafka.streams.processor.internals.StreamPartitionAssignorTest > shouldAddUserDefinedEndPointToSubscription STARTED
org.apache.kafka.streams.processor.internals.StreamPartitionAssignorTest > shouldAddUserDefinedEndPointToSubscription PASSED
org.apache.kafka.streams.processor.internals.StreamPartitionAssignorTest > testAssignWithStandbyReplicas STARTED
org.apache.kafka.streams.processor.internals.StreamPartitionAssignorTest > testAssignWithStandbyReplicas PASSED
org.apache.kafka.streams.processor.internals.StreamPartitionAssignorTest > testAssignWithNewTasks STARTED
org.apache.kafka.streams.processor.internals.StreamPartitionAssignorTest > testAssignWithNewTasks PASSED
org.apache.kafka.streams.processor.internals.StreamPartitionAssignorTest > shouldExposeHostStateToTopicPartitionsOnAssignment STARTED
org.apache.kafka.streams.processor.internals.StreamPartitionAssignorTest > shouldExposeHostStateToTopicPartitionsOnAssignment PASSED
org.apache.kafka.streams.processor.internals.StreamPartitionAssignorTest > testAssignWithStates STARTED
org.apache.kafka.streams.processor.internals.StreamPartitionAssignorTest > testAssignWithStates PASSED
org.apache.kafka.streams.processor.internals.StreamPartitionAssignorTest > shouldThrowExceptionIfApplicationServerConfigPortIsNotAnInteger STARTED
org.apache.kafka.streams.processor.internals.StreamPartitionAssignorTest > shouldThrowExceptionIfApplicationServerConfigPortIsNotAnInteger PASSED
org.apache.kafka.streams.processor.internals.StreamPartitionAssignorTest > testAssignBasic STARTED
org.apache.kafka.streams.processor.internals.StreamPartitionAssignorTest > testAssignBasic PASSED
org.apache.kafka.streams.processor.internals.StreamPartitionAssignorTest > testOnAssignment STARTED
org.apache.kafka.streams.processor.internals.StreamPartitionAssignorTest > testOnAssignment PASSED
org.apache.kafka.streams.processor.internals.StreamPartitionAssignorTest > testAssignWithInternalTopicThatsSourceIsAnotherInternalTopic STARTED
org.apache.kafka.streams.processor.internals.StreamPartitionAssignorTest > testAssignWithInternalTopicThatsSourceIsAnotherInternalTopic PASSED
org.apache.kafka.streams.processor.internals.StreamPartitionAssignorTest > testSubscription STARTED
org.apache.kafka.streams.processor.internals.StreamPartitionAssignorTest > testSubscription PASSED
org.apache.kafka.streams.processor.internals.StreamPartitionAssignorTest > testAssignWithInternalTopics STARTED
org.apache.kafka.streams.processor.internals.StreamPartitionAssignorTest > testAssignWithInternalTopics PASSED
org.apache.kafka.streams.processor.internals.StreamsMetadataStateTest > shouldGetInstancesForStoreName STARTED
org.apache.kafka.streams.processor.internals.StreamsMetadataStateTest > shouldGetInstancesForStoreName PASSED
org.apache.kafka.streams.processor.internals.StreamsMetadataStateTest > shouldThrowWhenSerializerIsNull STARTED
org.apache.kafka.streams.processor.internals.StreamsMetadataStateTest > shouldThrowWhenSerializerIsNull PASSED
org.apache.kafka.streams.processor.internals.StreamsMetadataStateTest > shouldGetAllStreamInstances STARTED
org.apache.kafka.streams.processor.internals.StreamsMetadataStateTest > shouldGetAllStreamInstances PASSED
org.apache.kafka.streams.processor.internals.StreamsMetadataStateTest > shouldGetInstanceWithKey STARTED
org.apache.kafka.streams.processor.internals.StreamsMetadataStateTest > shouldGetInstanceWithKey PASSED
org.apache.kafka.streams.processor.internals.StreamsMetadataStateTest > shouldGetAllStreamsInstancesWithNoStores STARTED
org.apache.kafka.streams.processor.internals.StreamsMetadataStateTest > shouldGetAllStreamsInstancesWithNoStores PASSED
org.apache.kafka.streams.processor.internals.StreamsMetadataStateTest > shouldThrowWhenKeyIsNull STARTED
org.apache.kafka.streams.processor.internals.StreamsMetadataStateTest > shouldThrowWhenKeyIsNull PASSED
org.apache.kafka.streams.processor.internals.StreamsMetadataStateTest > shouldGetInstanceWithKeyWithMergedStreams STARTED
org.apache.kafka.streams.processor.internals.StreamsMetadataStateTest > shouldGetInstanceWithKeyWithMergedStreams PASSED
org.apache.kafka.streams.processor.internals.StreamsMetadataStateTest > shouldThrowIfStoreNameIsNull STARTED
org.apache.kafka.streams.processor.internals.StreamsMetadataStateTest > shouldThrowIfStoreNameIsNull PASSED
org.apache.kafka.streams.processor.internals.StreamsMetadataStateTest > shouldReturnEmptyCollectionOnGetAllInstancesWithStoreWhenStoreDoesntExist STARTED
org.apache.kafka.streams.processor.internals.StreamsMetadataStateTest > shouldReturnEmptyCollectionOnGetAllInstancesWithStoreWhenStoreDoesntExist PASSED
org.apache.kafka.streams.processor.internals.StreamsMetadataStateTest > shouldReturnNullOnGetWithKeyWhenStoreDoesntExist STARTED
org.apache.kafka.streams.processor.internals.StreamsMetadataStateTest > shouldReturnNullOnGetWithKeyWhenStoreDoesntExist PASSED
org.apache.kafka.streams.processor.internals.StreamsMetadataStateTest > shouldThrowIfStreamPartitionerIsNull STARTED
org.apache.kafka.streams.processor.internals.StreamsMetadataStateTest > shouldThrowIfStreamPartitionerIsNull PASSED
org.apache.kafka.streams.processor.internals.StreamsMetadataStateTest > shouldGetInstanceWithKeyAndCustomPartitioner STARTED
org.apache.kafka.streams.processor.internals.StreamsMetadataStateTest > shouldGetInstanceWithKeyAndCustomPartitioner PASSED
org.apache.kafka.streams.processor.internals.StreamsMetadataStateTest > shouldThrowIfStoreNameIsNullOnGetAllInstancesWithStore STARTED
org.apache.kafka.streams.processor.internals.StreamsMetadataStateTest > shouldThrowIfStoreNameIsNullOnGetAllInstancesWithStore PASSED
org.apache.kafka.streams.KafkaStreamsTest > shouldNotGetAllTasksWhenNotRunning STARTED
org.apache.kafka.streams.KafkaStreamsTest > shouldNotGetAllTasksWhenNotRunning PASSED
org.apache.kafka.streams.KafkaStreamsTest > shouldNotGetTaskWithKeyAndPartitionerWhenNotRunning STARTED
org.apache.kafka.streams.KafkaStreamsTest > shouldNotGetTaskWithKeyAndPartitionerWhenNotRunning PASSED
org.apache.kafka.streams.KafkaStreamsTest > shouldNotGetTaskWithKeyAndSerializerWhenNotRunning STARTED
org.apache.kafka.streams.KafkaStreamsTest > shouldNotGetTaskWithKeyAndSerializerWhenNotRunning PASSED
org.apache.kafka.streams.KafkaStreamsTest > shouldNotGetAllTasksWithStoreWhenNotRunning STARTED
org.apache.kafka.streams.KafkaStreamsTest > shouldNotGetAllTasksWithStoreWhenNotRunning PASSED
org.apache.kafka.streams.KafkaStreamsTest > testCannotStartOnceClosed STARTED
org.apache.kafka.streams.KafkaStreamsTest > testCannotStartOnceClosed PASSED
org.apache.kafka.streams.KafkaStreamsTest > testCleanup STARTED
org.apache.kafka.streams.KafkaStreamsTest > testCleanup PASSED
org.apache.kafka.streams.KafkaStreamsTest > testCleanupIsolation STARTED
org.apache.kafka.streams.KafkaStreamsTest > testCleanupIsolation PASSED
org.apache.kafka.streams.KafkaStreamsTest > testStartAndClose STARTED
org.apache.kafka.streams.KafkaStreamsTest > testStartAndClose PASSED
org.apache.kafka.streams.KafkaStreamsTest > testCloseIsIdempotent STARTED
org.apache.kafka.streams.KafkaStreamsTest > testCloseIsIdempotent PASSED
org.apache.kafka.streams.KafkaStreamsTest > testCannotCleanupWhileRunning STARTED
org.apache.kafka.streams.KafkaStreamsTest > testCannotCleanupWhileRunning PASSED
org.apache.kafka.streams.KafkaStreamsTest > testCannotStartTwice STARTED
org.apache.kafka.streams.KafkaStreamsTest > testCannotStartTwice PASSED
org.apache.kafka.streams.KeyValueTest > shouldHaveSaneEqualsAndHashCode STARTED
org.apache.kafka.streams.KeyValueTest > shouldHaveSaneEqualsAndHashCode PASSED
353 tests completed, 1 failed
:streams:test FAILED
FAILURE: Build failed with an exception.
* What went wrong:
Execution failed for task ':streams:test'.
> There were failing tests. See the report at: file://<https://builds.apache.org/job/kafka-trunk-jdk7/ws/streams/build/reports/tests/index.html>
* Try:
Run with --stacktrace option to get the stack trace. Run with --info or --debug option to get more log output.
BUILD FAILED
Total time: 2 hrs 8 mins 23.899 secs
Build step 'Execute shell' marked build as failure
Recording test results
Setting GRADLE_2_4_RC_2_HOME=/home/jenkins/jenkins-slave/tools/hudson.plugins.gradle.GradleInstallation/Gradle_2.4-rc-2
Setting GRADLE_2_4_RC_2_HOME=/home/jenkins/jenkins-slave/tools/hudson.plugins.gradle.GradleInstallation/Gradle_2.4-rc-2
Build failed in Jenkins: kafka-trunk-jdk7 #1493
Posted by Apache Jenkins Server <je...@builds.apache.org>.
See <https://builds.apache.org/job/kafka-trunk-jdk7/1493/changes>
Changes:
[me] MINOR: Refactor TopologyBuilder with ApplicationID Prefix
[junrao] KAFKA-4073; MirrorMaker should handle messages without timestamp
------------------------------------------
[...truncated 12086 lines...]
org.apache.kafka.streams.kstream.internals.KStreamImplTest > shouldCantHaveNullPredicate PASSED
org.apache.kafka.streams.kstream.internals.KStreamImplTest > shouldNotAllowNullActionOnForEach STARTED
org.apache.kafka.streams.kstream.internals.KStreamImplTest > shouldNotAllowNullActionOnForEach PASSED
org.apache.kafka.streams.kstream.internals.KStreamImplTest > shouldNotAllowNullValueMapperOnTableJoin STARTED
org.apache.kafka.streams.kstream.internals.KStreamImplTest > shouldNotAllowNullValueMapperOnTableJoin PASSED
org.apache.kafka.streams.kstream.internals.KStreamImplTest > shouldNotAllowNullPredicateOnFilterNot STARTED
org.apache.kafka.streams.kstream.internals.KStreamImplTest > shouldNotAllowNullPredicateOnFilterNot PASSED
org.apache.kafka.streams.kstream.internals.KStreamImplTest > shouldHaveAtLeastOnPredicateWhenBranching STARTED
org.apache.kafka.streams.kstream.internals.KStreamImplTest > shouldHaveAtLeastOnPredicateWhenBranching PASSED
org.apache.kafka.streams.kstream.internals.KStreamImplTest > shouldNotAllowNullFilePathOnWriteAsText STARTED
org.apache.kafka.streams.kstream.internals.KStreamImplTest > shouldNotAllowNullFilePathOnWriteAsText PASSED
org.apache.kafka.streams.kstream.internals.KeyValuePrinterProcessorTest > testPrintKeyValueWithProvidedSerde STARTED
org.apache.kafka.streams.kstream.internals.KeyValuePrinterProcessorTest > testPrintKeyValueWithProvidedSerde PASSED
org.apache.kafka.streams.kstream.internals.KeyValuePrinterProcessorTest > testPrintKeyValuesWithName STARTED
org.apache.kafka.streams.kstream.internals.KeyValuePrinterProcessorTest > testPrintKeyValuesWithName PASSED
org.apache.kafka.streams.kstream.internals.KeyValuePrinterProcessorTest > testPrintKeyValueDefaultSerde STARTED
org.apache.kafka.streams.kstream.internals.KeyValuePrinterProcessorTest > testPrintKeyValueDefaultSerde PASSED
org.apache.kafka.streams.kstream.internals.KStreamKTableLeftJoinTest > testJoin STARTED
org.apache.kafka.streams.kstream.internals.KStreamKTableLeftJoinTest > testJoin PASSED
org.apache.kafka.streams.kstream.internals.KTableKTableJoinTest > testJoin STARTED
org.apache.kafka.streams.kstream.internals.KTableKTableJoinTest > testJoin PASSED
org.apache.kafka.streams.kstream.internals.KTableKTableJoinTest > testNotSendingOldValues STARTED
org.apache.kafka.streams.kstream.internals.KTableKTableJoinTest > testNotSendingOldValues PASSED
org.apache.kafka.streams.kstream.internals.KTableKTableJoinTest > testSendingOldValues STARTED
org.apache.kafka.streams.kstream.internals.KTableKTableJoinTest > testSendingOldValues PASSED
org.apache.kafka.streams.kstream.internals.KTableFilterTest > testSendingOldValue STARTED
org.apache.kafka.streams.kstream.internals.KTableFilterTest > testSendingOldValue PASSED
org.apache.kafka.streams.kstream.internals.KTableFilterTest > testNotSendingOldValue STARTED
org.apache.kafka.streams.kstream.internals.KTableFilterTest > testNotSendingOldValue PASSED
org.apache.kafka.streams.kstream.internals.KTableFilterTest > testSkipNullOnMaterialization STARTED
org.apache.kafka.streams.kstream.internals.KTableFilterTest > testSkipNullOnMaterialization PASSED
org.apache.kafka.streams.kstream.internals.KTableFilterTest > testKTable STARTED
org.apache.kafka.streams.kstream.internals.KTableFilterTest > testKTable PASSED
org.apache.kafka.streams.kstream.internals.KTableFilterTest > testValueGetter STARTED
org.apache.kafka.streams.kstream.internals.KTableFilterTest > testValueGetter PASSED
org.apache.kafka.streams.kstream.internals.KStreamFlatMapTest > testFlatMap STARTED
org.apache.kafka.streams.kstream.internals.KStreamFlatMapTest > testFlatMap PASSED
org.apache.kafka.streams.kstream.internals.KTableAggregateTest > testAggBasic STARTED
org.apache.kafka.streams.kstream.internals.KTableAggregateTest > testAggBasic PASSED
org.apache.kafka.streams.kstream.internals.KTableAggregateTest > testCount STARTED
org.apache.kafka.streams.kstream.internals.KTableAggregateTest > testCount PASSED
org.apache.kafka.streams.kstream.internals.KTableAggregateTest > testAggRepartition STARTED
org.apache.kafka.streams.kstream.internals.KTableAggregateTest > testAggRepartition PASSED
org.apache.kafka.streams.kstream.internals.KTableAggregateTest > testRemoveOldBeforeAddNew STARTED
org.apache.kafka.streams.kstream.internals.KTableAggregateTest > testRemoveOldBeforeAddNew PASSED
org.apache.kafka.streams.kstream.internals.KStreamFlatMapValuesTest > testFlatMapValues STARTED
org.apache.kafka.streams.kstream.internals.KStreamFlatMapValuesTest > testFlatMapValues PASSED
org.apache.kafka.streams.kstream.internals.KGroupedTableImplTest > shouldNotAllowNullSubtractorOnAggregate STARTED
org.apache.kafka.streams.kstream.internals.KGroupedTableImplTest > shouldNotAllowNullSubtractorOnAggregate PASSED
org.apache.kafka.streams.kstream.internals.KGroupedTableImplTest > shouldNotAllowNullInitializerOnAggregate STARTED
org.apache.kafka.streams.kstream.internals.KGroupedTableImplTest > shouldNotAllowNullInitializerOnAggregate PASSED
org.apache.kafka.streams.kstream.internals.KGroupedTableImplTest > shouldNotAllowNullStoreNameOnAggregate STARTED
org.apache.kafka.streams.kstream.internals.KGroupedTableImplTest > shouldNotAllowNullStoreNameOnAggregate PASSED
org.apache.kafka.streams.kstream.internals.KGroupedTableImplTest > shouldNotAllowNullAdderOnReduce STARTED
org.apache.kafka.streams.kstream.internals.KGroupedTableImplTest > shouldNotAllowNullAdderOnReduce PASSED
org.apache.kafka.streams.kstream.internals.KGroupedTableImplTest > shouldNotAllowNullAdderOnAggregate STARTED
org.apache.kafka.streams.kstream.internals.KGroupedTableImplTest > shouldNotAllowNullAdderOnAggregate PASSED
org.apache.kafka.streams.kstream.internals.KGroupedTableImplTest > shouldNotAllowNullStoreNameOnReduce STARTED
org.apache.kafka.streams.kstream.internals.KGroupedTableImplTest > shouldNotAllowNullStoreNameOnReduce PASSED
org.apache.kafka.streams.kstream.internals.KGroupedTableImplTest > shouldNotAllowNullSubtractorOnReduce STARTED
org.apache.kafka.streams.kstream.internals.KGroupedTableImplTest > shouldNotAllowNullSubtractorOnReduce PASSED
org.apache.kafka.streams.kstream.internals.KTableForeachTest > testForeach STARTED
org.apache.kafka.streams.kstream.internals.KTableForeachTest > testForeach PASSED
org.apache.kafka.streams.kstream.UnlimitedWindowsTest > startTimeMustNotBeNegative STARTED
org.apache.kafka.streams.kstream.UnlimitedWindowsTest > startTimeMustNotBeNegative PASSED
org.apache.kafka.streams.kstream.UnlimitedWindowsTest > shouldIncludeRecordsThatHappenedOnWindowStart STARTED
org.apache.kafka.streams.kstream.UnlimitedWindowsTest > shouldIncludeRecordsThatHappenedOnWindowStart PASSED
org.apache.kafka.streams.kstream.UnlimitedWindowsTest > startTimeCanBeZero STARTED
org.apache.kafka.streams.kstream.UnlimitedWindowsTest > startTimeCanBeZero PASSED
org.apache.kafka.streams.kstream.UnlimitedWindowsTest > shouldIncludeRecordsThatHappenedAfterWindowStart STARTED
org.apache.kafka.streams.kstream.UnlimitedWindowsTest > shouldIncludeRecordsThatHappenedAfterWindowStart PASSED
org.apache.kafka.streams.kstream.UnlimitedWindowsTest > shouldExcludeRecordsThatHappenedBeforeWindowStart STARTED
org.apache.kafka.streams.kstream.UnlimitedWindowsTest > shouldExcludeRecordsThatHappenedBeforeWindowStart PASSED
org.apache.kafka.streams.kstream.TimeWindowsTest > shouldHaveSaneEqualsAndHashCode STARTED
org.apache.kafka.streams.kstream.TimeWindowsTest > shouldHaveSaneEqualsAndHashCode PASSED
org.apache.kafka.streams.kstream.TimeWindowsTest > windowSizeMustNotBeZero STARTED
org.apache.kafka.streams.kstream.TimeWindowsTest > windowSizeMustNotBeZero PASSED
org.apache.kafka.streams.kstream.TimeWindowsTest > advanceIntervalMustNotBeZero STARTED
org.apache.kafka.streams.kstream.TimeWindowsTest > advanceIntervalMustNotBeZero PASSED
org.apache.kafka.streams.kstream.TimeWindowsTest > windowSizeMustNotBeNegative STARTED
org.apache.kafka.streams.kstream.TimeWindowsTest > windowSizeMustNotBeNegative PASSED
org.apache.kafka.streams.kstream.TimeWindowsTest > advanceIntervalMustNotBeNegative STARTED
org.apache.kafka.streams.kstream.TimeWindowsTest > advanceIntervalMustNotBeNegative PASSED
org.apache.kafka.streams.kstream.TimeWindowsTest > advanceIntervalMustNotBeLargerThanWindowSize STARTED
org.apache.kafka.streams.kstream.TimeWindowsTest > advanceIntervalMustNotBeLargerThanWindowSize PASSED
org.apache.kafka.streams.kstream.TimeWindowsTest > windowsForTumblingWindows STARTED
org.apache.kafka.streams.kstream.TimeWindowsTest > windowsForTumblingWindows PASSED
org.apache.kafka.streams.kstream.TimeWindowsTest > windowsForHoppingWindows STARTED
org.apache.kafka.streams.kstream.TimeWindowsTest > windowsForHoppingWindows PASSED
org.apache.kafka.streams.kstream.TimeWindowsTest > windowsForBarelyOverlappingHoppingWindows STARTED
org.apache.kafka.streams.kstream.TimeWindowsTest > windowsForBarelyOverlappingHoppingWindows PASSED
org.apache.kafka.streams.kstream.JoinWindowsTest > afterBelowLower STARTED
org.apache.kafka.streams.kstream.JoinWindowsTest > afterBelowLower PASSED
org.apache.kafka.streams.kstream.JoinWindowsTest > beforeOverUpper STARTED
org.apache.kafka.streams.kstream.JoinWindowsTest > beforeOverUpper PASSED
org.apache.kafka.streams.kstream.JoinWindowsTest > shouldHaveSaneEqualsAndHashCode STARTED
org.apache.kafka.streams.kstream.JoinWindowsTest > shouldHaveSaneEqualsAndHashCode PASSED
org.apache.kafka.streams.kstream.JoinWindowsTest > validWindows STARTED
org.apache.kafka.streams.kstream.JoinWindowsTest > validWindows PASSED
org.apache.kafka.streams.kstream.JoinWindowsTest > timeDifferenceMustNotBeNegative STARTED
org.apache.kafka.streams.kstream.JoinWindowsTest > timeDifferenceMustNotBeNegative PASSED
org.apache.kafka.streams.kstream.KStreamBuilderTest > shouldHaveCorrectSourceTopicsForTableFromMergedStream STARTED
org.apache.kafka.streams.kstream.KStreamBuilderTest > shouldHaveCorrectSourceTopicsForTableFromMergedStream PASSED
org.apache.kafka.streams.kstream.KStreamBuilderTest > shouldHaveCorrectSourceTopicsForTableFromMergedStreamWithProcessors STARTED
org.apache.kafka.streams.kstream.KStreamBuilderTest > shouldHaveCorrectSourceTopicsForTableFromMergedStreamWithProcessors PASSED
org.apache.kafka.streams.kstream.KStreamBuilderTest > testMerge STARTED
org.apache.kafka.streams.kstream.KStreamBuilderTest > testMerge PASSED
org.apache.kafka.streams.kstream.KStreamBuilderTest > testFrom STARTED
org.apache.kafka.streams.kstream.KStreamBuilderTest > testFrom PASSED
org.apache.kafka.streams.kstream.KStreamBuilderTest > shouldThrowExceptionWhenTopicNamesAreNull STARTED
org.apache.kafka.streams.kstream.KStreamBuilderTest > shouldThrowExceptionWhenTopicNamesAreNull PASSED
org.apache.kafka.streams.kstream.KStreamBuilderTest > shouldThrowExceptionWhenNoTopicPresent STARTED
org.apache.kafka.streams.kstream.KStreamBuilderTest > shouldThrowExceptionWhenNoTopicPresent PASSED
org.apache.kafka.streams.kstream.KStreamBuilderTest > testNewName STARTED
org.apache.kafka.streams.kstream.KStreamBuilderTest > testNewName PASSED
353 tests completed, 1 failed
:streams:test FAILED
FAILURE: Build failed with an exception.
* What went wrong:
Execution failed for task ':streams:test'.
> There were failing tests. See the report at: file://<https://builds.apache.org/job/kafka-trunk-jdk7/ws/streams/build/reports/tests/index.html>
* Try:
Run with --stacktrace option to get the stack trace. Run with --info or --debug option to get more log output.
BUILD FAILED
Total time: 1 hrs 25 mins 15.873 secs
Build step 'Execute shell' marked build as failure
Recording test results
Setting GRADLE_2_4_RC_2_HOME=/home/jenkins/jenkins-slave/tools/hudson.plugins.gradle.GradleInstallation/Gradle_2.4-rc-2
Setting GRADLE_2_4_RC_2_HOME=/home/jenkins/jenkins-slave/tools/hudson.plugins.gradle.GradleInstallation/Gradle_2.4-rc-2
Build failed in Jenkins: kafka-trunk-jdk7 #1492
Posted by Apache Jenkins Server <je...@builds.apache.org>.
See <https://builds.apache.org/job/kafka-trunk-jdk7/1492/changes>
Changes:
[ismael] KAFKA-3916; Check for disconnects properly before sending from the
------------------------------------------
[...truncated 12105 lines...]
org.apache.kafka.streams.state.internals.RocksDBKeyValueStoreTest > testRestoreWithDefaultSerdes PASSED
org.apache.kafka.streams.state.internals.RocksDBKeyValueStoreTest > testRestore STARTED
org.apache.kafka.streams.state.internals.RocksDBKeyValueStoreTest > testRestore PASSED
org.apache.kafka.streams.state.internals.RocksDBKeyValueStoreTest > testPutGetRange STARTED
org.apache.kafka.streams.state.internals.RocksDBKeyValueStoreTest > testPutGetRange PASSED
org.apache.kafka.streams.state.internals.RocksDBKeyValueStoreTest > testPutGetRangeWithDefaultSerdes STARTED
org.apache.kafka.streams.state.internals.RocksDBKeyValueStoreTest > testPutGetRangeWithDefaultSerdes PASSED
org.apache.kafka.streams.state.internals.InMemoryLRUCacheStoreTest > testEvict STARTED
org.apache.kafka.streams.state.internals.InMemoryLRUCacheStoreTest > testEvict PASSED
org.apache.kafka.streams.state.internals.InMemoryLRUCacheStoreTest > testSize STARTED
org.apache.kafka.streams.state.internals.InMemoryLRUCacheStoreTest > testSize PASSED
org.apache.kafka.streams.state.internals.InMemoryLRUCacheStoreTest > testPutIfAbsent STARTED
org.apache.kafka.streams.state.internals.InMemoryLRUCacheStoreTest > testPutIfAbsent PASSED
org.apache.kafka.streams.state.internals.InMemoryLRUCacheStoreTest > testRestoreWithDefaultSerdes STARTED
org.apache.kafka.streams.state.internals.InMemoryLRUCacheStoreTest > testRestoreWithDefaultSerdes PASSED
org.apache.kafka.streams.state.internals.InMemoryLRUCacheStoreTest > testRestore STARTED
org.apache.kafka.streams.state.internals.InMemoryLRUCacheStoreTest > testRestore PASSED
org.apache.kafka.streams.state.internals.InMemoryLRUCacheStoreTest > testPutGetRange STARTED
org.apache.kafka.streams.state.internals.InMemoryLRUCacheStoreTest > testPutGetRange PASSED
org.apache.kafka.streams.state.internals.InMemoryLRUCacheStoreTest > testPutGetRangeWithDefaultSerdes STARTED
org.apache.kafka.streams.state.internals.InMemoryLRUCacheStoreTest > testPutGetRangeWithDefaultSerdes PASSED
org.apache.kafka.streams.state.internals.WrappingStoreProviderTest > shouldThrowInvalidStoreExceptionIfNoStoreOfTypeFound STARTED
org.apache.kafka.streams.state.internals.WrappingStoreProviderTest > shouldThrowInvalidStoreExceptionIfNoStoreOfTypeFound PASSED
org.apache.kafka.streams.state.internals.WrappingStoreProviderTest > shouldFindWindowStores STARTED
org.apache.kafka.streams.state.internals.WrappingStoreProviderTest > shouldFindWindowStores PASSED
org.apache.kafka.streams.state.internals.WrappingStoreProviderTest > shouldFindKeyValueStores STARTED
org.apache.kafka.streams.state.internals.WrappingStoreProviderTest > shouldFindKeyValueStores PASSED
org.apache.kafka.streams.state.internals.WindowStoreUtilsTest > testSerialization STARTED
org.apache.kafka.streams.state.internals.WindowStoreUtilsTest > testSerialization PASSED
org.apache.kafka.streams.state.internals.QueryableStoreProviderTest > shouldNotReturnKVStoreWhenIsWindowStore STARTED
org.apache.kafka.streams.state.internals.QueryableStoreProviderTest > shouldNotReturnKVStoreWhenIsWindowStore PASSED
org.apache.kafka.streams.state.internals.QueryableStoreProviderTest > shouldReturnNullIfKVStoreDoesntExist STARTED
org.apache.kafka.streams.state.internals.QueryableStoreProviderTest > shouldReturnNullIfKVStoreDoesntExist PASSED
org.apache.kafka.streams.state.internals.QueryableStoreProviderTest > shouldReturnNullIfWindowStoreDoesntExist STARTED
org.apache.kafka.streams.state.internals.QueryableStoreProviderTest > shouldReturnNullIfWindowStoreDoesntExist PASSED
org.apache.kafka.streams.state.internals.QueryableStoreProviderTest > shouldNotReturnWindowStoreWhenIsKVStore STARTED
org.apache.kafka.streams.state.internals.QueryableStoreProviderTest > shouldNotReturnWindowStoreWhenIsKVStore PASSED
org.apache.kafka.streams.state.internals.QueryableStoreProviderTest > shouldReturnKVStoreWhenItExists STARTED
org.apache.kafka.streams.state.internals.QueryableStoreProviderTest > shouldReturnKVStoreWhenItExists PASSED
org.apache.kafka.streams.state.internals.QueryableStoreProviderTest > shouldReturnWindowStoreWhenItExists STARTED
org.apache.kafka.streams.state.internals.QueryableStoreProviderTest > shouldReturnWindowStoreWhenItExists PASSED
org.apache.kafka.streams.state.internals.OffsetCheckpointTest > testReadWrite STARTED
org.apache.kafka.streams.state.internals.OffsetCheckpointTest > testReadWrite PASSED
org.apache.kafka.streams.state.internals.RocksDBWindowStoreTest > testPutAndFetch STARTED
org.apache.kafka.streams.state.internals.RocksDBWindowStoreTest > testPutAndFetch PASSED
org.apache.kafka.streams.state.internals.RocksDBWindowStoreTest > testPutAndFetchBefore STARTED
org.apache.kafka.streams.state.internals.RocksDBWindowStoreTest > testPutAndFetchBefore PASSED
org.apache.kafka.streams.state.internals.RocksDBWindowStoreTest > testInitialLoading STARTED
org.apache.kafka.streams.state.internals.RocksDBWindowStoreTest > testInitialLoading PASSED
org.apache.kafka.streams.state.internals.RocksDBWindowStoreTest > shouldOnlyIterateOpenSegments STARTED
org.apache.kafka.streams.state.internals.RocksDBWindowStoreTest > shouldOnlyIterateOpenSegments PASSED
org.apache.kafka.streams.state.internals.RocksDBWindowStoreTest > testRestore STARTED
org.apache.kafka.streams.state.internals.RocksDBWindowStoreTest > testRestore PASSED
org.apache.kafka.streams.state.internals.RocksDBWindowStoreTest > testRolling STARTED
org.apache.kafka.streams.state.internals.RocksDBWindowStoreTest > testRolling PASSED
org.apache.kafka.streams.state.internals.RocksDBWindowStoreTest > testSegmentMaintenance STARTED
org.apache.kafka.streams.state.internals.RocksDBWindowStoreTest > testSegmentMaintenance PASSED
org.apache.kafka.streams.state.internals.RocksDBWindowStoreTest > testPutSameKeyTimestamp STARTED
org.apache.kafka.streams.state.internals.RocksDBWindowStoreTest > testPutSameKeyTimestamp PASSED
org.apache.kafka.streams.state.internals.RocksDBWindowStoreTest > testPutAndFetchAfter STARTED
org.apache.kafka.streams.state.internals.RocksDBWindowStoreTest > testPutAndFetchAfter PASSED
org.apache.kafka.streams.state.internals.StreamThreadStateStoreProviderTest > shouldReturnEmptyListIfNoStoresFoundWithName STARTED
org.apache.kafka.streams.state.internals.StreamThreadStateStoreProviderTest > shouldReturnEmptyListIfNoStoresFoundWithName PASSED
org.apache.kafka.streams.state.internals.StreamThreadStateStoreProviderTest > shouldThrowInvalidStoreExceptionIfKVStoreClosed STARTED
org.apache.kafka.streams.state.internals.StreamThreadStateStoreProviderTest > shouldThrowInvalidStoreExceptionIfKVStoreClosed PASSED
org.apache.kafka.streams.state.internals.StreamThreadStateStoreProviderTest > shouldFindWindowStores STARTED
org.apache.kafka.streams.state.internals.StreamThreadStateStoreProviderTest > shouldFindWindowStores PASSED
org.apache.kafka.streams.state.internals.StreamThreadStateStoreProviderTest > shouldReturnEmptyListIfStoreExistsButIsNotOfTypeValueStore STARTED
org.apache.kafka.streams.state.internals.StreamThreadStateStoreProviderTest > shouldReturnEmptyListIfStoreExistsButIsNotOfTypeValueStore PASSED
org.apache.kafka.streams.state.internals.StreamThreadStateStoreProviderTest > shouldFindKeyValueStores STARTED
org.apache.kafka.streams.state.internals.StreamThreadStateStoreProviderTest > shouldFindKeyValueStores PASSED
org.apache.kafka.streams.state.internals.StreamThreadStateStoreProviderTest > shouldThrowInvalidStoreExceptionIfWindowStoreClosed STARTED
org.apache.kafka.streams.state.internals.StreamThreadStateStoreProviderTest > shouldThrowInvalidStoreExceptionIfWindowStoreClosed PASSED
org.apache.kafka.streams.state.internals.CompositeReadOnlyWindowStoreTest > shouldNotGetValuesFromOtherStores STARTED
org.apache.kafka.streams.state.internals.CompositeReadOnlyWindowStoreTest > shouldNotGetValuesFromOtherStores PASSED
org.apache.kafka.streams.state.internals.CompositeReadOnlyWindowStoreTest > shouldReturnEmptyIteratorIfNoData STARTED
org.apache.kafka.streams.state.internals.CompositeReadOnlyWindowStoreTest > shouldReturnEmptyIteratorIfNoData PASSED
org.apache.kafka.streams.state.internals.CompositeReadOnlyWindowStoreTest > shouldFindValueForKeyWhenMultiStores STARTED
org.apache.kafka.streams.state.internals.CompositeReadOnlyWindowStoreTest > shouldFindValueForKeyWhenMultiStores PASSED
org.apache.kafka.streams.state.internals.CompositeReadOnlyWindowStoreTest > shouldFetchValuesFromWindowStore STARTED
org.apache.kafka.streams.state.internals.CompositeReadOnlyWindowStoreTest > shouldFetchValuesFromWindowStore PASSED
org.apache.kafka.streams.state.internals.InMemoryKeyValueStoreTest > testSize STARTED
org.apache.kafka.streams.state.internals.InMemoryKeyValueStoreTest > testSize PASSED
org.apache.kafka.streams.state.internals.InMemoryKeyValueStoreTest > testPutIfAbsent STARTED
org.apache.kafka.streams.state.internals.InMemoryKeyValueStoreTest > testPutIfAbsent PASSED
org.apache.kafka.streams.state.internals.InMemoryKeyValueStoreTest > testRestoreWithDefaultSerdes STARTED
org.apache.kafka.streams.state.internals.InMemoryKeyValueStoreTest > testRestoreWithDefaultSerdes PASSED
org.apache.kafka.streams.state.internals.InMemoryKeyValueStoreTest > testRestore STARTED
org.apache.kafka.streams.state.internals.InMemoryKeyValueStoreTest > testRestore PASSED
org.apache.kafka.streams.state.internals.InMemoryKeyValueStoreTest > testPutGetRange STARTED
org.apache.kafka.streams.state.internals.InMemoryKeyValueStoreTest > testPutGetRange PASSED
org.apache.kafka.streams.state.internals.InMemoryKeyValueStoreTest > testPutGetRangeWithDefaultSerdes STARTED
org.apache.kafka.streams.state.internals.InMemoryKeyValueStoreTest > testPutGetRangeWithDefaultSerdes PASSED
org.apache.kafka.streams.StreamsConfigTest > testGetConsumerConfigs STARTED
org.apache.kafka.streams.StreamsConfigTest > testGetConsumerConfigs PASSED
org.apache.kafka.streams.StreamsConfigTest > defaultSerdeShouldBeConfigured STARTED
org.apache.kafka.streams.StreamsConfigTest > defaultSerdeShouldBeConfigured PASSED
org.apache.kafka.streams.StreamsConfigTest > shouldSupportPrefixedConsumerConfigs STARTED
org.apache.kafka.streams.StreamsConfigTest > shouldSupportPrefixedConsumerConfigs PASSED
org.apache.kafka.streams.StreamsConfigTest > testGetProducerConfigs STARTED
org.apache.kafka.streams.StreamsConfigTest > testGetProducerConfigs PASSED
org.apache.kafka.streams.StreamsConfigTest > shouldSupportPrefixedProducerConfigs STARTED
org.apache.kafka.streams.StreamsConfigTest > shouldSupportPrefixedProducerConfigs PASSED
org.apache.kafka.streams.StreamsConfigTest > shouldBeSupportNonPrefixedConsumerConfigs STARTED
org.apache.kafka.streams.StreamsConfigTest > shouldBeSupportNonPrefixedConsumerConfigs PASSED
org.apache.kafka.streams.StreamsConfigTest > shouldSupportMultipleBootstrapServers STARTED
org.apache.kafka.streams.StreamsConfigTest > shouldSupportMultipleBootstrapServers PASSED
org.apache.kafka.streams.StreamsConfigTest > shouldSupportNonPrefixedProducerConfigs STARTED
org.apache.kafka.streams.StreamsConfigTest > shouldSupportNonPrefixedProducerConfigs PASSED
org.apache.kafka.streams.StreamsConfigTest > testGetRestoreConsumerConfigs STARTED
org.apache.kafka.streams.StreamsConfigTest > testGetRestoreConsumerConfigs PASSED
org.apache.kafka.streams.StreamsConfigTest > shouldBeSupportNonPrefixedRestoreConsumerConfigs STARTED
org.apache.kafka.streams.StreamsConfigTest > shouldBeSupportNonPrefixedRestoreConsumerConfigs PASSED
org.apache.kafka.streams.StreamsConfigTest > shouldSupportPrefixedRestoreConsumerConfigs STARTED
org.apache.kafka.streams.StreamsConfigTest > shouldSupportPrefixedRestoreConsumerConfigs PASSED
354 tests completed, 1 failed
:streams:test FAILED
FAILURE: Build failed with an exception.
* What went wrong:
Execution failed for task ':streams:test'.
> There were failing tests. See the report at: file://<https://builds.apache.org/job/kafka-trunk-jdk7/ws/streams/build/reports/tests/index.html>
* Try:
Run with --stacktrace option to get the stack trace. Run with --info or --debug option to get more log output.
BUILD FAILED
Total time: 2 hrs 43 mins 52.073 secs
Build step 'Execute shell' marked build as failure
Recording test results
Setting GRADLE_2_4_RC_2_HOME=/home/jenkins/jenkins-slave/tools/hudson.plugins.gradle.GradleInstallation/Gradle_2.4-rc-2
Setting GRADLE_2_4_RC_2_HOME=/home/jenkins/jenkins-slave/tools/hudson.plugins.gradle.GradleInstallation/Gradle_2.4-rc-2
Build failed in Jenkins: kafka-trunk-jdk7 #1491
Posted by Apache Jenkins Server <je...@builds.apache.org>.
See <https://builds.apache.org/job/kafka-trunk-jdk7/1491/changes>
Changes:
[ismael] KAFKA-4066; Fix NPE in consumer due to multi-threaded updates
[ismael] MINOR: Fix typos in security section
[wangguoz] MINOR: improve Streams application reset tool to make sure application
[ismael] MINOR: add slf4jlog4j to streams example
[cshapi] KAFKA-4051: Use nanosecond clock for timers in broker
[wangguoz] KAFKA-4049: Fix transient failure in RegexSourceIntegrationTest
[ismael] KAFKA-4032; Uncaught exceptions when autocreating topics
------------------------------------------
[...truncated 1268 lines...]
kafka.server.LogRecoveryTest > testHWCheckpointWithFailuresSingleLogSegment STARTED
kafka.server.LogRecoveryTest > testHWCheckpointWithFailuresSingleLogSegment PASSED
kafka.server.SaslPlaintextReplicaFetchTest > testReplicaFetcherThread STARTED
kafka.server.SaslPlaintextReplicaFetchTest > testReplicaFetcherThread PASSED
kafka.server.CreateTopicsRequestTest > testValidCreateTopicsRequests STARTED
kafka.server.CreateTopicsRequestTest > testValidCreateTopicsRequests PASSED
kafka.server.CreateTopicsRequestTest > testErrorCreateTopicsRequests STARTED
kafka.server.CreateTopicsRequestTest > testErrorCreateTopicsRequests PASSED
kafka.server.CreateTopicsRequestTest > testInvalidCreateTopicsRequests STARTED
kafka.server.CreateTopicsRequestTest > testInvalidCreateTopicsRequests PASSED
kafka.server.CreateTopicsRequestTest > testNotController STARTED
kafka.server.CreateTopicsRequestTest > testNotController PASSED
kafka.server.ServerStartupTest > testBrokerStateRunningAfterZK STARTED
kafka.server.ServerStartupTest > testBrokerStateRunningAfterZK PASSED
kafka.server.ServerStartupTest > testBrokerCreatesZKChroot STARTED
kafka.server.ServerStartupTest > testBrokerCreatesZKChroot PASSED
kafka.server.ServerStartupTest > testConflictBrokerRegistration STARTED
kafka.server.ServerStartupTest > testConflictBrokerRegistration PASSED
kafka.server.ServerStartupTest > testBrokerSelfAware STARTED
kafka.server.ServerStartupTest > testBrokerSelfAware PASSED
kafka.server.ApiVersionsRequestTest > testApiVersionsRequestWithUnsupportedVersion STARTED
kafka.server.ApiVersionsRequestTest > testApiVersionsRequestWithUnsupportedVersion PASSED
kafka.server.ApiVersionsRequestTest > testApiVersionsRequest STARTED
kafka.server.ApiVersionsRequestTest > testApiVersionsRequest PASSED
kafka.server.IsrExpirationTest > testIsrExpirationForSlowFollowers STARTED
kafka.server.IsrExpirationTest > testIsrExpirationForSlowFollowers PASSED
kafka.server.IsrExpirationTest > testIsrExpirationForStuckFollowers STARTED
kafka.server.IsrExpirationTest > testIsrExpirationForStuckFollowers PASSED
kafka.server.IsrExpirationTest > testIsrExpirationIfNoFetchRequestMade STARTED
kafka.server.IsrExpirationTest > testIsrExpirationIfNoFetchRequestMade PASSED
kafka.server.AdvertiseBrokerTest > testBrokerAdvertiseToZK STARTED
kafka.server.AdvertiseBrokerTest > testBrokerAdvertiseToZK PASSED
kafka.server.MetadataRequestTest > testReplicaDownResponse STARTED
kafka.server.MetadataRequestTest > testReplicaDownResponse PASSED
kafka.server.MetadataRequestTest > testRack STARTED
kafka.server.MetadataRequestTest > testRack PASSED
kafka.server.MetadataRequestTest > testIsInternal STARTED
kafka.server.MetadataRequestTest > testIsInternal PASSED
kafka.server.MetadataRequestTest > testControllerId STARTED
kafka.server.MetadataRequestTest > testControllerId PASSED
kafka.server.MetadataRequestTest > testAllTopicsRequest STARTED
kafka.server.MetadataRequestTest > testAllTopicsRequest PASSED
kafka.server.MetadataRequestTest > testNoTopicsRequest STARTED
kafka.server.MetadataRequestTest > testNoTopicsRequest PASSED
kafka.server.MetadataCacheTest > getTopicMetadataWithNonSupportedSecurityProtocol STARTED
kafka.server.MetadataCacheTest > getTopicMetadataWithNonSupportedSecurityProtocol PASSED
kafka.server.MetadataCacheTest > getTopicMetadataIsrNotAvailable STARTED
kafka.server.MetadataCacheTest > getTopicMetadataIsrNotAvailable PASSED
kafka.server.MetadataCacheTest > getTopicMetadata STARTED
kafka.server.MetadataCacheTest > getTopicMetadata PASSED
kafka.server.MetadataCacheTest > getTopicMetadataReplicaNotAvailable STARTED
kafka.server.MetadataCacheTest > getTopicMetadataReplicaNotAvailable PASSED
kafka.server.MetadataCacheTest > getTopicMetadataPartitionLeaderNotAvailable STARTED
kafka.server.MetadataCacheTest > getTopicMetadataPartitionLeaderNotAvailable PASSED
kafka.server.MetadataCacheTest > getAliveBrokersShouldNotBeMutatedByUpdateCache STARTED
kafka.server.MetadataCacheTest > getAliveBrokersShouldNotBeMutatedByUpdateCache PASSED
kafka.server.MetadataCacheTest > getTopicMetadataNonExistingTopics STARTED
kafka.server.MetadataCacheTest > getTopicMetadataNonExistingTopics PASSED
kafka.server.SaslSslReplicaFetchTest > testReplicaFetcherThread STARTED
kafka.server.SaslSslReplicaFetchTest > testReplicaFetcherThread PASSED
kafka.server.ProduceRequestTest > testSimpleProduceRequest STARTED
kafka.server.ProduceRequestTest > testSimpleProduceRequest PASSED
kafka.server.ProduceRequestTest > testCorruptLz4ProduceRequest STARTED
kafka.server.ProduceRequestTest > testCorruptLz4ProduceRequest PASSED
kafka.tools.MirrorMakerTest > testDefaultMirrorMakerMessageHandler STARTED
kafka.tools.MirrorMakerTest > testDefaultMirrorMakerMessageHandler PASSED
kafka.tools.ConsoleProducerTest > testParseKeyProp STARTED
kafka.tools.ConsoleProducerTest > testParseKeyProp PASSED
kafka.tools.ConsoleProducerTest > testValidConfigsOldProducer STARTED
kafka.tools.ConsoleProducerTest > testValidConfigsOldProducer PASSED
kafka.tools.ConsoleProducerTest > testInvalidConfigs STARTED
kafka.tools.ConsoleProducerTest > testInvalidConfigs PASSED
kafka.tools.ConsoleProducerTest > testValidConfigsNewProducer STARTED
kafka.tools.ConsoleProducerTest > testValidConfigsNewProducer PASSED
kafka.tools.ConsoleConsumerTest > shouldLimitReadsToMaxMessageLimit STARTED
kafka.tools.ConsoleConsumerTest > shouldLimitReadsToMaxMessageLimit PASSED
kafka.tools.ConsoleConsumerTest > shouldParseValidNewConsumerValidConfig STARTED
kafka.tools.ConsoleConsumerTest > shouldParseValidNewConsumerValidConfig PASSED
kafka.tools.ConsoleConsumerTest > shouldStopWhenOutputCheckErrorFails STARTED
kafka.tools.ConsoleConsumerTest > shouldStopWhenOutputCheckErrorFails PASSED
kafka.tools.ConsoleConsumerTest > shouldParseValidNewSimpleConsumerValidConfigWithStringOffset STARTED
kafka.tools.ConsoleConsumerTest > shouldParseValidNewSimpleConsumerValidConfigWithStringOffset PASSED
kafka.tools.ConsoleConsumerTest > shouldParseConfigsFromFile STARTED
kafka.tools.ConsoleConsumerTest > shouldParseConfigsFromFile PASSED
kafka.tools.ConsoleConsumerTest > shouldParseValidNewSimpleConsumerValidConfigWithNumericOffset STARTED
kafka.tools.ConsoleConsumerTest > shouldParseValidNewSimpleConsumerValidConfigWithNumericOffset PASSED
kafka.tools.ConsoleConsumerTest > shouldParseValidOldConsumerValidConfig STARTED
kafka.tools.ConsoleConsumerTest > shouldParseValidOldConsumerValidConfig PASSED
kafka.api.RequestResponseSerializationTest > testSerializationAndDeserialization STARTED
kafka.api.RequestResponseSerializationTest > testSerializationAndDeserialization PASSED
kafka.api.RequestResponseSerializationTest > testFetchResponseVersion STARTED
kafka.api.RequestResponseSerializationTest > testFetchResponseVersion PASSED
kafka.api.RequestResponseSerializationTest > testProduceResponseVersion STARTED
kafka.api.RequestResponseSerializationTest > testProduceResponseVersion PASSED
kafka.api.RackAwareAutoTopicCreationTest > testAutoCreateTopic STARTED
kafka.api.RackAwareAutoTopicCreationTest > testAutoCreateTopic PASSED
kafka.api.AdminClientTest > testDescribeGroup STARTED
kafka.api.AdminClientTest > testDescribeGroup PASSED
kafka.api.AdminClientTest > testDescribeConsumerGroup STARTED
kafka.api.AdminClientTest > testDescribeConsumerGroup PASSED
kafka.api.AdminClientTest > testListGroups STARTED
kafka.api.AdminClientTest > testListGroups PASSED
kafka.api.AdminClientTest > testDescribeConsumerGroupForNonExistentGroup STARTED
kafka.api.AdminClientTest > testDescribeConsumerGroupForNonExistentGroup PASSED
kafka.api.SslEndToEndAuthorizationTest > testNoConsumeAcl STARTED
kafka.api.SslEndToEndAuthorizationTest > testNoConsumeAcl PASSED
kafka.api.SslEndToEndAuthorizationTest > testProduceConsumeViaAssign STARTED
kafka.api.SslEndToEndAuthorizationTest > testProduceConsumeViaAssign PASSED
kafka.api.SslEndToEndAuthorizationTest > testNoProduceAcl STARTED
kafka.api.SslEndToEndAuthorizationTest > testNoProduceAcl PASSED
kafka.api.SslEndToEndAuthorizationTest > testNoGroupAcl STARTED
kafka.api.SslEndToEndAuthorizationTest > testNoGroupAcl PASSED
kafka.api.SslEndToEndAuthorizationTest > testProduceConsumeViaSubscribe STARTED
kafka.api.SslEndToEndAuthorizationTest > testProduceConsumeViaSubscribe PASSED
kafka.api.SaslSslConsumerTest > testCoordinatorFailover STARTED
:kafka-trunk-jdk7:core:test FAILED
:test_core_2_10 FAILED
FAILURE: Build failed with an exception.
* What went wrong:
Execution failed for task ':core:test'.
> Process 'Gradle Test Executor 1' finished with non-zero exit value 1
* Try:
Run with --stacktrace option to get the stack trace. Run with --info or --debug option to get more log output.
BUILD FAILED
Total time: 20 mins 50.914 secs
Build step 'Execute shell' marked build as failure
Recording test results
Setting GRADLE_2_4_RC_2_HOME=/home/jenkins/jenkins-slave/tools/hudson.plugins.gradle.GradleInstallation/Gradle_2.4-rc-2
ERROR: Step ?Publish JUnit test result report? failed: No test report files were found. Configuration error?
Setting GRADLE_2_4_RC_2_HOME=/home/jenkins/jenkins-slave/tools/hudson.plugins.gradle.GradleInstallation/Gradle_2.4-rc-2
Build failed in Jenkins: kafka-trunk-jdk7 #1490
Posted by Apache Jenkins Server <je...@builds.apache.org>.
See <https://builds.apache.org/job/kafka-trunk-jdk7/1490/changes>
Changes:
[junrao] KAFKA-3894; log cleaner can partially clean a segment
------------------------------------------
[...truncated 5036 lines...]
kafka.api.SslProducerSendTest > testSendWithInvalidCreateTime STARTED
kafka.api.SslProducerSendTest > testSendWithInvalidCreateTime PASSED
kafka.api.SslProducerSendTest > testSendCompressedMessageWithCreateTime STARTED
kafka.api.SslProducerSendTest > testSendCompressedMessageWithCreateTime PASSED
kafka.api.SslProducerSendTest > testCloseWithZeroTimeoutFromCallerThread STARTED
kafka.api.SslProducerSendTest > testCloseWithZeroTimeoutFromCallerThread PASSED
kafka.api.SslProducerSendTest > testCloseWithZeroTimeoutFromSenderThread STARTED
kafka.api.SslProducerSendTest > testCloseWithZeroTimeoutFromSenderThread PASSED
kafka.api.SslProducerSendTest > testSendNonCompressedMessageWithLogApendTime STARTED
kafka.api.SslProducerSendTest > testSendNonCompressedMessageWithLogApendTime PASSED
kafka.api.AuthorizerIntegrationTest > testCommitWithTopicWrite STARTED
kafka.api.AuthorizerIntegrationTest > testCommitWithTopicWrite PASSED
kafka.api.AuthorizerIntegrationTest > testConsumeWithNoTopicAccess STARTED
kafka.api.AuthorizerIntegrationTest > testConsumeWithNoTopicAccess PASSED
kafka.api.AuthorizerIntegrationTest > testCreatePermissionNeededToReadFromNonExistentTopic STARTED
kafka.api.AuthorizerIntegrationTest > testCreatePermissionNeededToReadFromNonExistentTopic PASSED
kafka.api.AuthorizerIntegrationTest > testDeleteWithWildCardAuth STARTED
kafka.api.AuthorizerIntegrationTest > testDeleteWithWildCardAuth PASSED
kafka.api.AuthorizerIntegrationTest > testOffsetFetchWithNoAccess STARTED
kafka.api.AuthorizerIntegrationTest > testOffsetFetchWithNoAccess PASSED
kafka.api.AuthorizerIntegrationTest > testListOfsetsWithTopicDescribe STARTED
kafka.api.AuthorizerIntegrationTest > testListOfsetsWithTopicDescribe PASSED
kafka.api.AuthorizerIntegrationTest > testProduceWithTopicRead STARTED
kafka.api.AuthorizerIntegrationTest > testProduceWithTopicRead PASSED
kafka.api.AuthorizerIntegrationTest > testListOffsetsWithNoTopicAccess STARTED
kafka.api.AuthorizerIntegrationTest > testListOffsetsWithNoTopicAccess PASSED
kafka.api.AuthorizerIntegrationTest > testCreatePermissionNeededForWritingToNonExistentTopic STARTED
kafka.api.AuthorizerIntegrationTest > testCreatePermissionNeededForWritingToNonExistentTopic PASSED
kafka.api.AuthorizerIntegrationTest > testSimpleConsumeWithOffsetLookupAndNoGroupAccess STARTED
kafka.api.AuthorizerIntegrationTest > testSimpleConsumeWithOffsetLookupAndNoGroupAccess PASSED
kafka.api.AuthorizerIntegrationTest > testConsumeWithTopicDescribe STARTED
kafka.api.AuthorizerIntegrationTest > testConsumeWithTopicDescribe PASSED
kafka.api.AuthorizerIntegrationTest > testOffsetFetchWithNoTopicAccess STARTED
kafka.api.AuthorizerIntegrationTest > testOffsetFetchWithNoTopicAccess PASSED
kafka.api.AuthorizerIntegrationTest > testCommitWithNoTopicAccess STARTED
kafka.api.AuthorizerIntegrationTest > testCommitWithNoTopicAccess PASSED
kafka.api.AuthorizerIntegrationTest > testProduceWithNoTopicAccess STARTED
kafka.api.AuthorizerIntegrationTest > testProduceWithNoTopicAccess PASSED
kafka.api.AuthorizerIntegrationTest > testProduceWithTopicWrite STARTED
kafka.api.AuthorizerIntegrationTest > testProduceWithTopicWrite PASSED
kafka.api.AuthorizerIntegrationTest > testAuthorization STARTED
kafka.api.AuthorizerIntegrationTest > testAuthorization PASSED
kafka.api.AuthorizerIntegrationTest > testUnauthorizedDeleteWithDescribe STARTED
kafka.api.AuthorizerIntegrationTest > testUnauthorizedDeleteWithDescribe PASSED
kafka.api.AuthorizerIntegrationTest > testConsumeWithTopicAndGroupRead STARTED
kafka.api.AuthorizerIntegrationTest > testConsumeWithTopicAndGroupRead PASSED
kafka.api.AuthorizerIntegrationTest > testUnauthorizedDeleteWithoutDescribe STARTED
kafka.api.AuthorizerIntegrationTest > testUnauthorizedDeleteWithoutDescribe PASSED
kafka.api.AuthorizerIntegrationTest > testConsumeWithTopicWrite STARTED
kafka.api.AuthorizerIntegrationTest > testConsumeWithTopicWrite PASSED
kafka.api.AuthorizerIntegrationTest > testOffsetFetchWithNoGroupAccess STARTED
kafka.api.AuthorizerIntegrationTest > testOffsetFetchWithNoGroupAccess PASSED
kafka.api.AuthorizerIntegrationTest > testCommitWithNoAccess STARTED
kafka.api.AuthorizerIntegrationTest > testCommitWithNoAccess PASSED
kafka.api.AuthorizerIntegrationTest > testCommitWithNoGroupAccess STARTED
kafka.api.AuthorizerIntegrationTest > testCommitWithNoGroupAccess PASSED
kafka.api.AuthorizerIntegrationTest > testConsumeWithNoAccess STARTED
kafka.api.AuthorizerIntegrationTest > testConsumeWithNoAccess PASSED
kafka.api.AuthorizerIntegrationTest > testOffsetFetchWithTopicAndGroupRead STARTED
kafka.api.AuthorizerIntegrationTest > testOffsetFetchWithTopicAndGroupRead PASSED
kafka.api.AuthorizerIntegrationTest > testCommitWithTopicDescribe STARTED
kafka.api.AuthorizerIntegrationTest > testCommitWithTopicDescribe PASSED
kafka.api.AuthorizerIntegrationTest > testProduceWithTopicDescribe STARTED
kafka.api.AuthorizerIntegrationTest > testProduceWithTopicDescribe PASSED
kafka.api.AuthorizerIntegrationTest > testOffsetFetchTopicDescribe STARTED
kafka.api.AuthorizerIntegrationTest > testOffsetFetchTopicDescribe PASSED
kafka.api.AuthorizerIntegrationTest > testCommitWithTopicAndGroupRead STARTED
kafka.api.AuthorizerIntegrationTest > testCommitWithTopicAndGroupRead PASSED
kafka.api.AuthorizerIntegrationTest > testSimpleConsumeWithExplicitSeekAndNoGroupAccess STARTED
kafka.api.AuthorizerIntegrationTest > testSimpleConsumeWithExplicitSeekAndNoGroupAccess PASSED
kafka.api.RackAwareAutoTopicCreationTest > testAutoCreateTopic STARTED
kafka.api.RackAwareAutoTopicCreationTest > testAutoCreateTopic PASSED
kafka.api.ConsumerBounceTest > testSeekAndCommitWithBrokerFailures STARTED
kafka.api.ConsumerBounceTest > testSeekAndCommitWithBrokerFailures PASSED
kafka.api.ConsumerBounceTest > testConsumptionWithBrokerFailures STARTED
kafka.api.ConsumerBounceTest > testConsumptionWithBrokerFailures PASSED
kafka.api.SaslPlainPlaintextConsumerTest > testCoordinatorFailover STARTED
kafka.api.SaslPlainPlaintextConsumerTest > testCoordinatorFailover PASSED
kafka.api.SaslPlainPlaintextConsumerTest > testSimpleConsumption STARTED
kafka.api.SaslPlainPlaintextConsumerTest > testSimpleConsumption PASSED
kafka.api.SslEndToEndAuthorizationTest > testNoConsumeAcl STARTED
kafka.api.SslEndToEndAuthorizationTest > testNoConsumeAcl PASSED
kafka.api.SslEndToEndAuthorizationTest > testProduceConsumeViaAssign STARTED
kafka.api.SslEndToEndAuthorizationTest > testProduceConsumeViaAssign PASSED
kafka.api.SslEndToEndAuthorizationTest > testNoProduceAcl STARTED
kafka.api.SslEndToEndAuthorizationTest > testNoProduceAcl PASSED
kafka.api.SslEndToEndAuthorizationTest > testNoGroupAcl STARTED
kafka.api.SslEndToEndAuthorizationTest > testNoGroupAcl PASSED
kafka.api.SslEndToEndAuthorizationTest > testProduceConsumeViaSubscribe STARTED
kafka.api.SslEndToEndAuthorizationTest > testProduceConsumeViaSubscribe PASSED
kafka.api.SslConsumerTest > testCoordinatorFailover STARTED
kafka.api.SslConsumerTest > testCoordinatorFailover PASSED
kafka.api.SslConsumerTest > testSimpleConsumption STARTED
kafka.api.SslConsumerTest > testSimpleConsumption PASSED
kafka.api.SaslSslEndToEndAuthorizationTest > testNoConsumeAcl STARTED
kafka.api.SaslSslEndToEndAuthorizationTest > testNoConsumeAcl PASSED
kafka.api.SaslSslEndToEndAuthorizationTest > testProduceConsumeViaAssign STARTED
kafka.api.SaslSslEndToEndAuthorizationTest > testProduceConsumeViaAssign PASSED
kafka.api.SaslSslEndToEndAuthorizationTest > testNoProduceAcl STARTED
kafka.api.SaslSslEndToEndAuthorizationTest > testNoProduceAcl PASSED
kafka.api.SaslSslEndToEndAuthorizationTest > testNoGroupAcl STARTED
kafka.api.SaslSslEndToEndAuthorizationTest > testNoGroupAcl PASSED
kafka.api.SaslSslEndToEndAuthorizationTest > testProduceConsumeViaSubscribe STARTED
kafka.api.SaslSslEndToEndAuthorizationTest > testProduceConsumeViaSubscribe PASSED
kafka.api.RequestResponseSerializationTest > testSerializationAndDeserialization STARTED
kafka.api.RequestResponseSerializationTest > testSerializationAndDeserialization PASSED
kafka.api.RequestResponseSerializationTest > testFetchResponseVersion STARTED
kafka.api.RequestResponseSerializationTest > testFetchResponseVersion PASSED
kafka.api.RequestResponseSerializationTest > testProduceResponseVersion STARTED
kafka.api.RequestResponseSerializationTest > testProduceResponseVersion PASSED
kafka.api.SaslSslConsumerTest > testCoordinatorFailover STARTED
ERROR: Could not install GRADLE_2_4_RC_2_HOME
java.lang.NullPointerException
at hudson.plugins.toolenv.ToolEnvBuildWrapper$1.buildEnvVars(ToolEnvBuildWrapper.java:46)
at hudson.model.AbstractBuild.getEnvironment(AbstractBuild.java:931)
at hudson.plugins.git.GitSCM.getParamExpandedRepos(GitSCM.java:404)
at hudson.plugins.git.GitSCM.compareRemoteRevisionWithImpl(GitSCM.java:609)
at hudson.plugins.git.GitSCM.compareRemoteRevisionWith(GitSCM.java:574)
at hudson.scm.SCM.compareRemoteRevisionWith(SCM.java:381)
at hudson.scm.SCM.poll(SCM.java:398)
at hudson.model.AbstractProject._poll(AbstractProject.java:1446)
at hudson.model.AbstractProject.poll(AbstractProject.java:1349)
at hudson.triggers.SCMTrigger$Runner.runPolling(SCMTrigger.java:528)
at hudson.triggers.SCMTrigger$Runner.run(SCMTrigger.java:557)
at hudson.util.SequentialExecutionQueue$QueueEntry.run(SequentialExecutionQueue.java:119)
at java.util.concurrent.Executors$RunnableAdapter.call(Executors.java:511)
at java.util.concurrent.FutureTask.run(FutureTask.java:266)
at java.util.concurrent.ThreadPoolExecutor.runWorker(ThreadPoolExecutor.java:1142)
at java.util.concurrent.ThreadPoolExecutor$Worker.run(ThreadPoolExecutor.java:617)
at java.lang.Thread.run(Thread.java:745)
kafka.api.SaslSslConsumerTest > testCoordinatorFailover PASSED
kafka.api.SaslSslConsumerTest > testSimpleConsumption STARTED
Build timed out (after 180 minutes). Marking the build as failed.
Build was aborted
Recording test results
Setting GRADLE_2_4_RC_2_HOME=/home/jenkins/jenkins-slave/tools/hudson.plugins.gradle.GradleInstallation/Gradle_2.4-rc-2
Setting GRADLE_2_4_RC_2_HOME=/home/jenkins/jenkins-slave/tools/hudson.plugins.gradle.GradleInstallation/Gradle_2.4-rc-2
Build failed in Jenkins: kafka-trunk-jdk7 #1489
Posted by Apache Jenkins Server <je...@builds.apache.org>.
See <https://builds.apache.org/job/kafka-trunk-jdk7/1489/changes>
Changes:
[junrao] KAFKA-3163; Minor follow up for (KIP-33)
------------------------------------------
[...truncated 4991 lines...]
kafka.api.PlaintextConsumerTest > testCoordinatorFailover STARTED
kafka.api.PlaintextConsumerTest > testCoordinatorFailover PASSED
kafka.api.PlaintextConsumerTest > testSimpleConsumption STARTED
kafka.api.PlaintextConsumerTest > testSimpleConsumption PASSED
kafka.api.SslProducerSendTest > testSendNonCompressedMessageWithCreateTime STARTED
kafka.api.SslProducerSendTest > testSendNonCompressedMessageWithCreateTime PASSED
kafka.api.SslProducerSendTest > testSendCompressedMessageWithLogAppendTime STARTED
kafka.api.SslProducerSendTest > testSendCompressedMessageWithLogAppendTime PASSED
kafka.api.SslProducerSendTest > testClose STARTED
kafka.api.SslProducerSendTest > testClose PASSED
kafka.api.SslProducerSendTest > testFlush STARTED
kafka.api.SslProducerSendTest > testFlush PASSED
kafka.api.SslProducerSendTest > testSendToPartition STARTED
kafka.api.SslProducerSendTest > testSendToPartition PASSED
kafka.api.SslProducerSendTest > testSendOffset STARTED
kafka.api.SslProducerSendTest > testSendOffset PASSED
kafka.api.SslProducerSendTest > testAutoCreateTopic STARTED
kafka.api.SslProducerSendTest > testAutoCreateTopic PASSED
kafka.api.SslProducerSendTest > testSendWithInvalidCreateTime STARTED
kafka.api.SslProducerSendTest > testSendWithInvalidCreateTime PASSED
kafka.api.SslProducerSendTest > testSendCompressedMessageWithCreateTime STARTED
kafka.api.SslProducerSendTest > testSendCompressedMessageWithCreateTime PASSED
kafka.api.SslProducerSendTest > testCloseWithZeroTimeoutFromCallerThread STARTED
kafka.api.SslProducerSendTest > testCloseWithZeroTimeoutFromCallerThread PASSED
kafka.api.SslProducerSendTest > testCloseWithZeroTimeoutFromSenderThread STARTED
kafka.api.SslProducerSendTest > testCloseWithZeroTimeoutFromSenderThread PASSED
kafka.api.SslProducerSendTest > testSendNonCompressedMessageWithLogApendTime STARTED
kafka.api.SslProducerSendTest > testSendNonCompressedMessageWithLogApendTime PASSED
kafka.api.AuthorizerIntegrationTest > testCommitWithTopicWrite STARTED
kafka.api.AuthorizerIntegrationTest > testCommitWithTopicWrite PASSED
kafka.api.AuthorizerIntegrationTest > testConsumeWithNoTopicAccess STARTED
kafka.api.AuthorizerIntegrationTest > testConsumeWithNoTopicAccess PASSED
kafka.api.AuthorizerIntegrationTest > testCreatePermissionNeededToReadFromNonExistentTopic STARTED
kafka.api.AuthorizerIntegrationTest > testCreatePermissionNeededToReadFromNonExistentTopic PASSED
kafka.api.AuthorizerIntegrationTest > testDeleteWithWildCardAuth STARTED
kafka.api.AuthorizerIntegrationTest > testDeleteWithWildCardAuth PASSED
kafka.api.AuthorizerIntegrationTest > testOffsetFetchWithNoAccess STARTED
kafka.api.AuthorizerIntegrationTest > testOffsetFetchWithNoAccess PASSED
kafka.api.AuthorizerIntegrationTest > testListOfsetsWithTopicDescribe STARTED
kafka.api.AuthorizerIntegrationTest > testListOfsetsWithTopicDescribe PASSED
kafka.api.AuthorizerIntegrationTest > testProduceWithTopicRead STARTED
kafka.api.AuthorizerIntegrationTest > testProduceWithTopicRead PASSED
kafka.api.AuthorizerIntegrationTest > testListOffsetsWithNoTopicAccess STARTED
kafka.api.AuthorizerIntegrationTest > testListOffsetsWithNoTopicAccess PASSED
kafka.api.AuthorizerIntegrationTest > testCreatePermissionNeededForWritingToNonExistentTopic STARTED
kafka.api.AuthorizerIntegrationTest > testCreatePermissionNeededForWritingToNonExistentTopic PASSED
kafka.api.AuthorizerIntegrationTest > testSimpleConsumeWithOffsetLookupAndNoGroupAccess STARTED
kafka.api.AuthorizerIntegrationTest > testSimpleConsumeWithOffsetLookupAndNoGroupAccess PASSED
kafka.api.AuthorizerIntegrationTest > testConsumeWithTopicDescribe STARTED
kafka.api.AuthorizerIntegrationTest > testConsumeWithTopicDescribe PASSED
kafka.api.AuthorizerIntegrationTest > testOffsetFetchWithNoTopicAccess STARTED
kafka.api.AuthorizerIntegrationTest > testOffsetFetchWithNoTopicAccess PASSED
kafka.api.AuthorizerIntegrationTest > testCommitWithNoTopicAccess STARTED
kafka.api.AuthorizerIntegrationTest > testCommitWithNoTopicAccess PASSED
kafka.api.AuthorizerIntegrationTest > testProduceWithNoTopicAccess STARTED
kafka.api.AuthorizerIntegrationTest > testProduceWithNoTopicAccess PASSED
kafka.api.AuthorizerIntegrationTest > testProduceWithTopicWrite STARTED
kafka.api.AuthorizerIntegrationTest > testProduceWithTopicWrite PASSED
kafka.api.AuthorizerIntegrationTest > testAuthorization STARTED
kafka.api.AuthorizerIntegrationTest > testAuthorization PASSED
kafka.api.AuthorizerIntegrationTest > testUnauthorizedDeleteWithDescribe STARTED
kafka.api.AuthorizerIntegrationTest > testUnauthorizedDeleteWithDescribe PASSED
kafka.api.AuthorizerIntegrationTest > testConsumeWithTopicAndGroupRead STARTED
kafka.api.AuthorizerIntegrationTest > testConsumeWithTopicAndGroupRead PASSED
kafka.api.AuthorizerIntegrationTest > testUnauthorizedDeleteWithoutDescribe STARTED
kafka.api.AuthorizerIntegrationTest > testUnauthorizedDeleteWithoutDescribe PASSED
kafka.api.AuthorizerIntegrationTest > testConsumeWithTopicWrite STARTED
kafka.api.AuthorizerIntegrationTest > testConsumeWithTopicWrite PASSED
kafka.api.AuthorizerIntegrationTest > testOffsetFetchWithNoGroupAccess STARTED
kafka.api.AuthorizerIntegrationTest > testOffsetFetchWithNoGroupAccess PASSED
kafka.api.AuthorizerIntegrationTest > testCommitWithNoAccess STARTED
kafka.api.AuthorizerIntegrationTest > testCommitWithNoAccess PASSED
kafka.api.AuthorizerIntegrationTest > testCommitWithNoGroupAccess STARTED
kafka.api.AuthorizerIntegrationTest > testCommitWithNoGroupAccess PASSED
kafka.api.AuthorizerIntegrationTest > testConsumeWithNoAccess STARTED
kafka.api.AuthorizerIntegrationTest > testConsumeWithNoAccess PASSED
kafka.api.AuthorizerIntegrationTest > testOffsetFetchWithTopicAndGroupRead STARTED
kafka.api.AuthorizerIntegrationTest > testOffsetFetchWithTopicAndGroupRead PASSED
kafka.api.AuthorizerIntegrationTest > testCommitWithTopicDescribe STARTED
kafka.api.AuthorizerIntegrationTest > testCommitWithTopicDescribe PASSED
kafka.api.AuthorizerIntegrationTest > testProduceWithTopicDescribe STARTED
kafka.api.AuthorizerIntegrationTest > testProduceWithTopicDescribe PASSED
kafka.api.AuthorizerIntegrationTest > testOffsetFetchTopicDescribe STARTED
kafka.api.AuthorizerIntegrationTest > testOffsetFetchTopicDescribe PASSED
kafka.api.AuthorizerIntegrationTest > testCommitWithTopicAndGroupRead STARTED
kafka.api.AuthorizerIntegrationTest > testCommitWithTopicAndGroupRead PASSED
kafka.api.AuthorizerIntegrationTest > testSimpleConsumeWithExplicitSeekAndNoGroupAccess STARTED
kafka.api.AuthorizerIntegrationTest > testSimpleConsumeWithExplicitSeekAndNoGroupAccess PASSED
kafka.api.RackAwareAutoTopicCreationTest > testAutoCreateTopic STARTED
kafka.api.RackAwareAutoTopicCreationTest > testAutoCreateTopic PASSED
kafka.api.ConsumerBounceTest > testSeekAndCommitWithBrokerFailures STARTED
kafka.api.ConsumerBounceTest > testSeekAndCommitWithBrokerFailures PASSED
kafka.api.ConsumerBounceTest > testConsumptionWithBrokerFailures STARTED
kafka.api.ConsumerBounceTest > testConsumptionWithBrokerFailures PASSED
kafka.api.SaslPlainPlaintextConsumerTest > testCoordinatorFailover STARTED
kafka.api.SaslPlainPlaintextConsumerTest > testCoordinatorFailover PASSED
kafka.api.SaslPlainPlaintextConsumerTest > testSimpleConsumption STARTED
kafka.api.SaslPlainPlaintextConsumerTest > testSimpleConsumption PASSED
kafka.api.SslEndToEndAuthorizationTest > testNoConsumeAcl STARTED
kafka.api.SslEndToEndAuthorizationTest > testNoConsumeAcl PASSED
kafka.api.SslEndToEndAuthorizationTest > testProduceConsumeViaAssign STARTED
kafka.api.SslEndToEndAuthorizationTest > testProduceConsumeViaAssign PASSED
kafka.api.SslEndToEndAuthorizationTest > testNoProduceAcl STARTED
kafka.api.SslEndToEndAuthorizationTest > testNoProduceAcl PASSED
kafka.api.SslEndToEndAuthorizationTest > testNoGroupAcl STARTED
kafka.api.SslEndToEndAuthorizationTest > testNoGroupAcl PASSED
kafka.api.SslEndToEndAuthorizationTest > testProduceConsumeViaSubscribe STARTED
kafka.api.SslEndToEndAuthorizationTest > testProduceConsumeViaSubscribe PASSED
kafka.api.SslConsumerTest > testCoordinatorFailover STARTED
ERROR: Could not install GRADLE_2_4_RC_2_HOME
java.lang.NullPointerException
at hudson.plugins.toolenv.ToolEnvBuildWrapper$1.buildEnvVars(ToolEnvBuildWrapper.java:46)
at hudson.model.AbstractBuild.getEnvironment(AbstractBuild.java:931)
at hudson.plugins.git.GitSCM.getParamExpandedRepos(GitSCM.java:404)
at hudson.plugins.git.GitSCM.compareRemoteRevisionWithImpl(GitSCM.java:609)
at hudson.plugins.git.GitSCM.compareRemoteRevisionWith(GitSCM.java:574)
at hudson.scm.SCM.compareRemoteRevisionWith(SCM.java:381)
at hudson.scm.SCM.poll(SCM.java:398)
at hudson.model.AbstractProject._poll(AbstractProject.java:1446)
at hudson.model.AbstractProject.poll(AbstractProject.java:1349)
at hudson.triggers.SCMTrigger$Runner.runPolling(SCMTrigger.java:528)
at hudson.triggers.SCMTrigger$Runner.run(SCMTrigger.java:557)
at hudson.util.SequentialExecutionQueue$QueueEntry.run(SequentialExecutionQueue.java:119)
at java.util.concurrent.Executors$RunnableAdapter.call(Executors.java:511)
at java.util.concurrent.FutureTask.run(FutureTask.java:266)
at java.util.concurrent.ThreadPoolExecutor.runWorker(ThreadPoolExecutor.java:1142)
at java.util.concurrent.ThreadPoolExecutor$Worker.run(ThreadPoolExecutor.java:617)
at java.lang.Thread.run(Thread.java:745)
kafka.api.SslConsumerTest > testCoordinatorFailover PASSED
kafka.api.SslConsumerTest > testSimpleConsumption STARTED
kafka.api.SslConsumerTest > testSimpleConsumption PASSED
kafka.api.SaslSslEndToEndAuthorizationTest > testNoConsumeAcl STARTED
Build timed out (after 180 minutes). Marking the build as failed.
Build was aborted
Recording test results
Setting GRADLE_2_4_RC_2_HOME=/home/jenkins/jenkins-slave/tools/hudson.plugins.gradle.GradleInstallation/Gradle_2.4-rc-2
Setting GRADLE_2_4_RC_2_HOME=/home/jenkins/jenkins-slave/tools/hudson.plugins.gradle.GradleInstallation/Gradle_2.4-rc-2