You are viewing a plain text version of this content. The canonical link for it is here.
Posted to dev@zookeeper.apache.org by Apache Jenkins Server <je...@builds.apache.org> on 2018/02/21 16:26:15 UTC
Failed: ZOOKEEPER- PreCommit Build #1513
Build: https://builds.apache.org/job/PreCommit-ZOOKEEPER-github-pr-build/1513/
###################################################################################
########################## LAST 60 LINES OF THE CONSOLE ###########################
[...truncated 15.91 MB...]
[exec]
[exec] +1 release audit. The applied patch does not increase the total number of release audit warnings.
[exec]
[exec] -1 core tests. The patch failed core unit tests.
[exec]
[exec] -1 contrib tests. The patch failed contrib unit tests.
[exec]
[exec] Test results: https://builds.apache.org/job/PreCommit-ZOOKEEPER-github-pr-build/1513//testReport/
[exec] Findbugs warnings: https://builds.apache.org/job/PreCommit-ZOOKEEPER-github-pr-build/1513//artifact/trunk/build/test/findbugs/newPatchFindbugsWarnings.html
[exec] Console output: https://builds.apache.org/job/PreCommit-ZOOKEEPER-github-pr-build/1513//console
[exec]
[exec] This message is automatically generated.
[exec]
[exec]
[exec] ======================================================================
[exec] ======================================================================
[exec] Adding comment to Jira.
[exec] ======================================================================
[exec] ======================================================================
[exec]
[exec]
[exec] /bin/kill -9 28549
[exec] /bin/kill -9 28559
[exec] /home/jenkins/jenkins-slave/workspace/PreCommit-ZOOKEEPER-github-pr-build/src/java/test/bin/test-github-pr.sh: line 471: 28588 Killed $ANT_HOME/bin/ant -DZookeeperPatchProcess= -Dtest.junit.output.format=xml -Dtest.output=yes test-contrib
[exec] Unable to log in to server: https://issues.apache.org/jira/rpc/soap/jirasoapservice-v2 with user: hadoopqa.
[exec] Cause: ; nested exception is:
[exec] javax.net.ssl.SSLException: Received fatal alert: protocol_version
[exec]
[exec]
[exec] ======================================================================
[exec] ======================================================================
[exec] Finished build.
[exec] ======================================================================
[exec] ======================================================================
[exec]
[exec]
[exec] Unable to log in to server: https://issues.apache.org/jira/rpc/soap/jirasoapservice-v2 with user: hadoopqa.
[exec] Cause: ; nested exception is:
[exec] javax.net.ssl.SSLException: Received fatal alert: protocol_version
[exec] mv: '/home/jenkins/jenkins-slave/workspace/PreCommit-ZOOKEEPER-github-pr-build/patchprocess' and '/home/jenkins/jenkins-slave/workspace/PreCommit-ZOOKEEPER-github-pr-build/patchprocess' are the same file
BUILD FAILED
/home/jenkins/jenkins-slave/workspace/PreCommit-ZOOKEEPER-github-pr-build/build.xml:1793: exec returned: 2
Total time: 19 minutes 33 seconds
Build step 'Execute shell' marked build as failure
Archiving artifacts
Setting JDK_1_7_LATEST__HOME=/home/jenkins/tools/java/latest1.7
Recording test results
Setting JDK_1_7_LATEST__HOME=/home/jenkins/tools/java/latest1.7
Setting JDK_1_7_LATEST__HOME=/home/jenkins/tools/java/latest1.7
[description-setter] Description set: ZOOKEEPER-2955
Putting comment on the pull request
Setting JDK_1_7_LATEST__HOME=/home/jenkins/tools/java/latest1.7
Email was triggered for: Failure - Any
Sending email for trigger: Failure - Any
Setting JDK_1_7_LATEST__HOME=/home/jenkins/tools/java/latest1.7
Setting JDK_1_7_LATEST__HOME=/home/jenkins/tools/java/latest1.7
Setting JDK_1_7_LATEST__HOME=/home/jenkins/tools/java/latest1.7
###################################################################################
############################## FAILED TESTS (if any) ##############################
All tests passed