You are viewing a plain text version of this content. The canonical link for it is here.
Posted to commits@olingo.apache.org by Apache Jenkins Server <je...@builds.apache.org> on 2015/06/11 02:42:19 UTC

Build failed in Jenkins: olingo-odata2 #1142

See <https://builds.apache.org/job/olingo-odata2/1142/>

------------------------------------------
Started by timer
Building remotely on ubuntu-4 (docker Ubuntu ubuntu4 ubuntu) in workspace <https://builds.apache.org/job/olingo-odata2/ws/>
 > git rev-parse --is-inside-work-tree # timeout=10
Fetching changes from the remote Git repository
 > git config remote.origin.url https://git-wip-us.apache.org/repos/asf/olingo-odata2.git # timeout=10
Fetching upstream changes from https://git-wip-us.apache.org/repos/asf/olingo-odata2.git
 > git --version # timeout=10
 > git fetch --tags --progress https://git-wip-us.apache.org/repos/asf/olingo-odata2.git +refs/heads/master:refs/remotes/origin/master
 > git rev-parse origin/master^{commit} # timeout=10
Checking out Revision 48f9e9319d26dc3104b525c20d2c94780aba59f9 (origin/master)
 > git config core.sparsecheckout # timeout=10
 > git checkout -f 48f9e9319d26dc3104b525c20d2c94780aba59f9
 > git rev-list 48f9e9319d26dc3104b525c20d2c94780aba59f9 # timeout=10
[olingo-odata2] $ /home/jenkins/tools/maven/apache-maven-3.0.4/bin/mvn clean deploy
[INFO] Scanning for projects...
[WARNING] 
[WARNING] Some problems were encountered while building the effective model for org.apache.olingo:olingo-odata2-testutil:jar:2.0.5-SNAPSHOT
[WARNING] 'dependencies.dependency.(groupId:artifactId:type:classifier)' must be unique: org.mockito:mockito-all:jar -> duplicate declaration of version ${mockito.version} @ line 109, column 17
[WARNING] 
[WARNING] It is highly recommended to fix these problems because they threaten the stability of your build.
[WARNING] 
[WARNING] For this reason, future Maven versions might no longer support building such malformed projects.
[WARNING] 
[INFO] ------------------------------------------------------------------------
[INFO] Reactor Build Order:
[INFO] 
[INFO] olingo-odata2-parent
[INFO] olingo-odata2-lib
[INFO] olingo-odata2-api
[INFO] olingo-odata2-api-annotation
[INFO] olingo-odata2-testutil
[INFO] olingo-odata2-core
[INFO] olingo-odata2-ref
[INFO] olingo-odata2-fit
[INFO] olingo-odata2-ref-web
[INFO] olingo-odata2-jpa-processor
[INFO] olingo-odata2-jpa-processor-api
[INFO] olingo-odata2-jpa-processor-core
[INFO] olingo-odata2-jpa-processor-ref
[INFO] olingo-odata2-jpa-processor-ref-web
[INFO] olingo-odata2-annotation-processor
[INFO] olingo-odata2-annotation-processor-api
[INFO] olingo-odata2-annotation-processor-core
[INFO] olingo-odata2-annotation-processor-ref
[INFO] olingo-odata2-annotation-processor-ref-web
[INFO] olingo-odata2-dist
[INFO] olingo-odata2-dist-lib
[INFO] olingo-odata2-dist-jpa
[INFO] olingo-odata2-dist-janos
[INFO] olingo-odata2-dist-ref
[INFO] olingo-odata2-dist-javadoc
[INFO] olingo-odata2-sample
[INFO] olingo-odata2-sample-cars-service-archetype
[INFO] olingo-odata2-sample-cars-annotation-archetype
[INFO] olingo-odata2-sample-cars-jpa-archetype
[INFO]                                                                         
[INFO] ------------------------------------------------------------------------
[INFO] Building olingo-odata2-parent 2.0.5-SNAPSHOT
[INFO] ------------------------------------------------------------------------
[INFO] 
[INFO] --- maven-clean-plugin:2.5:clean (default-clean) @ olingo-odata2-parent ---
[INFO] Deleting <https://builds.apache.org/job/olingo-odata2/ws/target>
[INFO] 
[INFO] --- buildnumber-maven-plugin:1.2:create (default) @ olingo-odata2-parent ---
[INFO] Checking for local modifications: skipped.
[INFO] Updating project files from SCM: skipped.
[INFO] Executing: /bin/sh -c cd <https://builds.apache.org/job/olingo-odata2/ws/> && svn --non-interactive info
[INFO] Working directory: <https://builds.apache.org/job/olingo-odata2/ws/>
[INFO] Storing buildNumber: ? at timestamp: 2015-06-11T00:42:15+0000
[INFO] Executing: /bin/sh -c cd <https://builds.apache.org/job/olingo-odata2/ws/> && svn --non-interactive info
[INFO] Working directory: <https://builds.apache.org/job/olingo-odata2/ws/>
[INFO] Storing buildScmBranch: UNKNOWN_BRANCH
[INFO] 
[INFO] --- maven-remote-resources-plugin:1.5:process (default) @ olingo-odata2-parent ---
[INFO] 
[INFO] --- maven-site-plugin:3.2:attach-descriptor (attach-descriptor) @ olingo-odata2-parent ---
[INFO] 
[INFO] --- maven-source-plugin:2.2.1:jar-no-fork (attach-sources) @ olingo-odata2-parent ---
[INFO] 
[INFO] --- maven-checkstyle-plugin:2.10:check (checkstyle) @ olingo-odata2-parent ---
[INFO] Starting audit...
Audit done.

[INFO] 
[INFO] --- maven-install-plugin:2.3.1:install (default-install) @ olingo-odata2-parent ---
[INFO] Installing <https://builds.apache.org/job/olingo-odata2/ws/pom.xml> to /home/jenkins/.m2/repository/org/apache/olingo/olingo-odata2-parent/2.0.5-SNAPSHOT/olingo-odata2-parent-2.0.5-SNAPSHOT.pom
[INFO] 
[INFO] --- maven-deploy-plugin:2.7:deploy (default-deploy) @ olingo-odata2-parent ---
Downloading: https://repository.apache.org/content/repositories/snapshots/org/apache/olingo/olingo-odata2-parent/2.0.5-SNAPSHOT/maven-metadata.xml

[WARNING] Could not transfer metadata org.apache.olingo:olingo-odata2-parent:2.0.5-SNAPSHOT/maven-metadata.xml from/to apache.snapshots.https (https://repository.apache.org/content/repositories/snapshots): java.lang.RuntimeException: Could not generate DH keypair
[INFO] ------------------------------------------------------------------------
[INFO] Reactor Summary:
[INFO] 
[INFO] olingo-odata2-parent .............................. FAILURE [4.916s]
[INFO] olingo-odata2-lib ................................. SKIPPED
[INFO] olingo-odata2-api ................................. SKIPPED
[INFO] olingo-odata2-api-annotation ...................... SKIPPED
[INFO] olingo-odata2-testutil ............................ SKIPPED
[INFO] olingo-odata2-core ................................ SKIPPED
[INFO] olingo-odata2-ref ................................. SKIPPED
[INFO] olingo-odata2-fit ................................. SKIPPED
[INFO] olingo-odata2-ref-web ............................. SKIPPED
[INFO] olingo-odata2-jpa-processor ....................... SKIPPED
[INFO] olingo-odata2-jpa-processor-api ................... SKIPPED
[INFO] olingo-odata2-jpa-processor-core .................. SKIPPED
[INFO] olingo-odata2-jpa-processor-ref ................... SKIPPED
[INFO] olingo-odata2-jpa-processor-ref-web ............... SKIPPED
[INFO] olingo-odata2-annotation-processor ................ SKIPPED
[INFO] olingo-odata2-annotation-processor-api ............ SKIPPED
[INFO] olingo-odata2-annotation-processor-core ........... SKIPPED
[INFO] olingo-odata2-annotation-processor-ref ............ SKIPPED
[INFO] olingo-odata2-annotation-processor-ref-web ........ SKIPPED
[INFO] olingo-odata2-dist ................................ SKIPPED
[INFO] olingo-odata2-dist-lib ............................ SKIPPED
[INFO] olingo-odata2-dist-jpa ............................ SKIPPED
[INFO] olingo-odata2-dist-janos .......................... SKIPPED
[INFO] olingo-odata2-dist-ref ............................ SKIPPED
[INFO] olingo-odata2-dist-javadoc ........................ SKIPPED
[INFO] olingo-odata2-sample .............................. SKIPPED
[INFO] olingo-odata2-sample-cars-service-archetype ....... SKIPPED
[INFO] olingo-odata2-sample-cars-annotation-archetype .... SKIPPED
[INFO] olingo-odata2-sample-cars-jpa-archetype ........... SKIPPED
[INFO] ------------------------------------------------------------------------
[INFO] BUILD FAILURE
[INFO] ------------------------------------------------------------------------
[INFO] Total time: 6.229s
[INFO] Finished at: Thu Jun 11 00:42:19 UTC 2015
[INFO] Final Memory: 18M/179M
[INFO] ------------------------------------------------------------------------
[ERROR] Failed to execute goal org.apache.maven.plugins:maven-deploy-plugin:2.7:deploy (default-deploy) on project olingo-odata2-parent: Failed to retrieve remote metadata org.apache.olingo:olingo-odata2-parent:2.0.5-SNAPSHOT/maven-metadata.xml: Could not transfer metadata org.apache.olingo:olingo-odata2-parent:2.0.5-SNAPSHOT/maven-metadata.xml from/to apache.snapshots.https (https://repository.apache.org/content/repositories/snapshots): java.lang.RuntimeException: Could not generate DH keypair: Prime size must be multiple of 64, and can only range from 512 to 1024 (inclusive) -> [Help 1]
[ERROR] 
[ERROR] To see the full stack trace of the errors, re-run Maven with the -e switch.
[ERROR] Re-run Maven using the -X switch to enable full debug logging.
[ERROR] 
[ERROR] For more information about the errors and possible solutions, please read the following articles:
[ERROR] [Help 1] http://cwiki.apache.org/confluence/display/MAVEN/MojoExecutionException
Build step 'Invoke top-level Maven targets' marked build as failure

Jenkins build is back to normal : olingo-odata2 #1151

Posted by Apache Jenkins Server <je...@builds.apache.org>.
See <https://builds.apache.org/job/olingo-odata2/1151/>


Build failed in Jenkins: olingo-odata2 #1150

Posted by Apache Jenkins Server <je...@builds.apache.org>.
See <https://builds.apache.org/job/olingo-odata2/1150/>

------------------------------------------
[...truncated 2763 lines...]
            
Uploaded: https://repository.apache.org/content/repositories/snapshots/org/apache/olingo/olingo-odata2-annotation-processor/maven-metadata.xml (451 B at 1.6 KB/sec)
[INFO]                                                                         
[INFO] ------------------------------------------------------------------------
[INFO] Building olingo-odata2-annotation-processor-api 2.0.5-SNAPSHOT
[INFO] ------------------------------------------------------------------------
[INFO] 
[INFO] --- maven-clean-plugin:2.5:clean (default-clean) @ olingo-odata2-annotation-processor-api ---
[INFO] Deleting <https://builds.apache.org/job/olingo-odata2/ws/odata2-annotation-processor/annotation-processor-api/target>
[INFO] 
[INFO] --- buildnumber-maven-plugin:1.2:create (default) @ olingo-odata2-annotation-processor-api ---
[INFO] 
[INFO] --- maven-remote-resources-plugin:1.5:process (default) @ olingo-odata2-annotation-processor-api ---
[INFO] 
[INFO] --- maven-resources-plugin:2.6:resources (default-resources) @ olingo-odata2-annotation-processor-api ---
[INFO] Using 'UTF-8' encoding to copy filtered resources.
[INFO] skip non existing resourceDirectory <https://builds.apache.org/job/olingo-odata2/ws/odata2-annotation-processor/annotation-processor-api/src/main/resources>
[INFO] Copying 3 resources
[INFO] 
[INFO] --- maven-compiler-plugin:2.3.2:compile (default-compile) @ olingo-odata2-annotation-processor-api ---
[INFO] Compiling 2 source files to <https://builds.apache.org/job/olingo-odata2/ws/odata2-annotation-processor/annotation-processor-api/target/classes>
[INFO] 
[INFO] --- maven-bundle-plugin:2.3.7:manifest (bundle-manifest) @ olingo-odata2-annotation-processor-api ---
[WARNING] Manifest org.apache.olingo:olingo-odata2-annotation-processor-api:jar:2.0.5-SNAPSHOT : Superfluous export-package instructions: [org.apache.olingo.odata2.annotation.processor.api.*]
[INFO] 
[INFO] --- maven-resources-plugin:2.6:testResources (default-testResources) @ olingo-odata2-annotation-processor-api ---
[INFO] Using 'UTF-8' encoding to copy filtered resources.
[INFO] skip non existing resourceDirectory <https://builds.apache.org/job/olingo-odata2/ws/odata2-annotation-processor/annotation-processor-api/src/test/resources>
[INFO] Copying 3 resources
[INFO] 
[INFO] --- maven-compiler-plugin:2.3.2:testCompile (default-testCompile) @ olingo-odata2-annotation-processor-api ---
[INFO] No sources to compile
[INFO] 
[INFO] --- maven-surefire-plugin:2.12.4:test (default-test) @ olingo-odata2-annotation-processor-api ---
[INFO] 
[INFO] --- maven-jar-plugin:2.3.2:jar (default-jar) @ olingo-odata2-annotation-processor-api ---
[INFO] Building jar: <https://builds.apache.org/job/olingo-odata2/ws/odata2-annotation-processor/annotation-processor-api/target/olingo-odata2-annotation-processor-api-2.0.5-SNAPSHOT.jar>
[INFO] 
[INFO] --- maven-site-plugin:3.2:attach-descriptor (attach-descriptor) @ olingo-odata2-annotation-processor-api ---
[INFO] 
[INFO] --- maven-source-plugin:2.2.1:jar-no-fork (attach-sources) @ olingo-odata2-annotation-processor-api ---
[INFO] Building jar: <https://builds.apache.org/job/olingo-odata2/ws/odata2-annotation-processor/annotation-processor-api/target/olingo-odata2-annotation-processor-api-2.0.5-SNAPSHOT-sources.jar>
[INFO] 
[INFO] --- maven-checkstyle-plugin:2.10:check (checkstyle) @ olingo-odata2-annotation-processor-api ---
[INFO] Starting audit...
Audit done.

[INFO] 
[INFO] --- maven-install-plugin:2.3.1:install (default-install) @ olingo-odata2-annotation-processor-api ---
[INFO] Installing <https://builds.apache.org/job/olingo-odata2/ws/odata2-annotation-processor/annotation-processor-api/target/olingo-odata2-annotation-processor-api-2.0.5-SNAPSHOT.jar> to /home/jenkins/.m2/repository/org/apache/olingo/olingo-odata2-annotation-processor-api/2.0.5-SNAPSHOT/olingo-odata2-annotation-processor-api-2.0.5-SNAPSHOT.jar
[INFO] Installing <https://builds.apache.org/job/olingo-odata2/ws/odata2-annotation-processor/annotation-processor-api/pom.xml> to /home/jenkins/.m2/repository/org/apache/olingo/olingo-odata2-annotation-processor-api/2.0.5-SNAPSHOT/olingo-odata2-annotation-processor-api-2.0.5-SNAPSHOT.pom
[INFO] Installing <https://builds.apache.org/job/olingo-odata2/ws/odata2-annotation-processor/annotation-processor-api/target/olingo-odata2-annotation-processor-api-2.0.5-SNAPSHOT-sources.jar> to /home/jenkins/.m2/repository/org/apache/olingo/olingo-odata2-annotation-processor-api/2.0.5-SNAPSHOT/olingo-odata2-annotation-processor-api-2.0.5-SNAPSHOT-sources.jar
[INFO] 
[INFO] --- maven-deploy-plugin:2.7:deploy (default-deploy) @ olingo-odata2-annotation-processor-api ---
Downloading: https://repository.apache.org/content/repositories/snapshots/org/apache/olingo/olingo-odata2-annotation-processor-api/2.0.5-SNAPSHOT/maven-metadata.xml
1023/1023 B   
              
Downloaded: https://repository.apache.org/content/repositories/snapshots/org/apache/olingo/olingo-odata2-annotation-processor-api/2.0.5-SNAPSHOT/maven-metadata.xml (1023 B at 0.5 KB/sec)
Uploading: https://repository.apache.org/content/repositories/snapshots/org/apache/olingo/olingo-odata2-annotation-processor-api/2.0.5-SNAPSHOT/olingo-odata2-annotation-processor-api-2.0.5-20150613.063730-19.jar
2/11 KB       
4/11 KB   
6/11 KB   
8/11 KB   
10/11 KB   
11/11 KB   
           
Uploaded: https://repository.apache.org/content/repositories/snapshots/org/apache/olingo/olingo-odata2-annotation-processor-api/2.0.5-SNAPSHOT/olingo-odata2-annotation-processor-api-2.0.5-20150613.063730-19.jar (11 KB at 2.5 KB/sec)
Uploading: https://repository.apache.org/content/repositories/snapshots/org/apache/olingo/olingo-odata2-annotation-processor-api/2.0.5-SNAPSHOT/olingo-odata2-annotation-processor-api-2.0.5-20150613.063730-19.pom
2/4 KB     
4/4 KB   
         
Uploaded: https://repository.apache.org/content/repositories/snapshots/org/apache/olingo/olingo-odata2-annotation-processor-api/2.0.5-SNAPSHOT/olingo-odata2-annotation-processor-api-2.0.5-20150613.063730-19.pom (4 KB at 9.6 KB/sec)
Downloading: https://repository.apache.org/content/repositories/snapshots/org/apache/olingo/olingo-odata2-annotation-processor-api/maven-metadata.xml
455/455 B   
            
Downloaded: https://repository.apache.org/content/repositories/snapshots/org/apache/olingo/olingo-odata2-annotation-processor-api/maven-metadata.xml (455 B at 1.5 KB/sec)
Uploading: https://repository.apache.org/content/repositories/snapshots/org/apache/olingo/olingo-odata2-annotation-processor-api/2.0.5-SNAPSHOT/maven-metadata.xml
1023/1023 B   
              
Uploaded: https://repository.apache.org/content/repositories/snapshots/org/apache/olingo/olingo-odata2-annotation-processor-api/2.0.5-SNAPSHOT/maven-metadata.xml (1023 B at 3.5 KB/sec)
Uploading: https://repository.apache.org/content/repositories/snapshots/org/apache/olingo/olingo-odata2-annotation-processor-api/maven-metadata.xml
455/455 B     
            
Uploaded: https://repository.apache.org/content/repositories/snapshots/org/apache/olingo/olingo-odata2-annotation-processor-api/maven-metadata.xml (455 B at 2.7 KB/sec)
Uploading: https://repository.apache.org/content/repositories/snapshots/org/apache/olingo/olingo-odata2-annotation-processor-api/2.0.5-SNAPSHOT/olingo-odata2-annotation-processor-api-2.0.5-20150613.063730-19-sources.jar
2/9 KB      
4/9 KB   
6/9 KB   
8/9 KB   
9/9 KB   
         
Uploaded: https://repository.apache.org/content/repositories/snapshots/org/apache/olingo/olingo-odata2-annotation-processor-api/2.0.5-SNAPSHOT/olingo-odata2-annotation-processor-api-2.0.5-20150613.063730-19-sources.jar (9 KB at 49.0 KB/sec)
Uploading: https://repository.apache.org/content/repositories/snapshots/org/apache/olingo/olingo-odata2-annotation-processor-api/2.0.5-SNAPSHOT/maven-metadata.xml
1023/1023 B   
              
Uploaded: https://repository.apache.org/content/repositories/snapshots/org/apache/olingo/olingo-odata2-annotation-processor-api/2.0.5-SNAPSHOT/maven-metadata.xml (1023 B at 7.6 KB/sec)
[INFO]                                                                         
[INFO] ------------------------------------------------------------------------
[INFO] Building olingo-odata2-annotation-processor-core 2.0.5-SNAPSHOT
[INFO] ------------------------------------------------------------------------
[INFO] 
[INFO] --- maven-clean-plugin:2.5:clean (default-clean) @ olingo-odata2-annotation-processor-core ---
[INFO] Deleting <https://builds.apache.org/job/olingo-odata2/ws/odata2-annotation-processor/annotation-processor-core/target>
[INFO] 
[INFO] --- buildnumber-maven-plugin:1.2:create (default) @ olingo-odata2-annotation-processor-core ---
[INFO] 
[INFO] --- maven-remote-resources-plugin:1.5:process (default) @ olingo-odata2-annotation-processor-core ---
[INFO] 
[INFO] --- maven-resources-plugin:2.6:resources (default-resources) @ olingo-odata2-annotation-processor-core ---
[INFO] Using 'UTF-8' encoding to copy filtered resources.
[INFO] skip non existing resourceDirectory <https://builds.apache.org/job/olingo-odata2/ws/odata2-annotation-processor/annotation-processor-core/src/main/resources>
[INFO] Copying 3 resources
[INFO] 
[INFO] --- maven-compiler-plugin:2.3.2:compile (default-compile) @ olingo-odata2-annotation-processor-core ---
[INFO] Compiling 13 source files to <https://builds.apache.org/job/olingo-odata2/ws/odata2-annotation-processor/annotation-processor-core/target/classes>
[INFO] 
[INFO] --- maven-bundle-plugin:2.3.7:manifest (bundle-manifest) @ olingo-odata2-annotation-processor-core ---
[INFO] 
[INFO] --- maven-resources-plugin:2.6:testResources (default-testResources) @ olingo-odata2-annotation-processor-core ---
[INFO] Using 'UTF-8' encoding to copy filtered resources.
[INFO] skip non existing resourceDirectory <https://builds.apache.org/job/olingo-odata2/ws/odata2-annotation-processor/annotation-processor-core/src/test/resources>
[INFO] Copying 3 resources
[INFO] 
[INFO] --- maven-compiler-plugin:2.3.2:testCompile (default-testCompile) @ olingo-odata2-annotation-processor-core ---
[INFO] Compiling 19 source files to <https://builds.apache.org/job/olingo-odata2/ws/odata2-annotation-processor/annotation-processor-core/target/test-classes>
[INFO] 
[INFO] --- maven-surefire-plugin:2.12.4:test (default-test) @ olingo-odata2-annotation-processor-core ---
[INFO] Surefire report directory: <https://builds.apache.org/job/olingo-odata2/ws/odata2-annotation-processor/annotation-processor-core/target/surefire-reports>

-------------------------------------------------------
 T E S T S
-------------------------------------------------------
Running org.apache.olingo.odata2.annotation.processor.core.util.ClassHelperTest
Tests run: 3, Failures: 0, Errors: 1, Skipped: 0, Time elapsed: 0.077 sec <<< FAILURE!
loadFromSpaceDir(org.apache.olingo.odata2.annotation.processor.core.util.ClassHelperTest)  Time elapsed: 0.008 sec  <<< ERROR!
java.lang.Exception: Unexpected exception, expected<java.lang.ClassFormatError> but was<java.lang.IllegalArgumentException>
	at org.junit.internal.runners.statements.ExpectException.evaluate(ExpectException.java:31)
	at org.junit.runners.ParentRunner.runLeaf(ParentRunner.java:263)
	at org.junit.runners.BlockJUnit4ClassRunner.runChild(BlockJUnit4ClassRunner.java:68)
	at org.junit.runners.BlockJUnit4ClassRunner.runChild(BlockJUnit4ClassRunner.java:47)
	at org.junit.runners.ParentRunner$3.run(ParentRunner.java:231)
	at org.junit.runners.ParentRunner$1.schedule(ParentRunner.java:60)
	at org.junit.runners.ParentRunner.runChildren(ParentRunner.java:229)
	at org.junit.runners.ParentRunner.access$000(ParentRunner.java:50)
	at org.junit.runners.ParentRunner$2.evaluate(ParentRunner.java:222)
	at org.junit.runners.ParentRunner.run(ParentRunner.java:300)
	at org.apache.maven.surefire.junit4.JUnit4Provider.execute(JUnit4Provider.java:252)
	at org.apache.maven.surefire.junit4.JUnit4Provider.executeTestSet(JUnit4Provider.java:141)
	at org.apache.maven.surefire.junit4.JUnit4Provider.invoke(JUnit4Provider.java:112)
	at sun.reflect.NativeMethodAccessorImpl.invoke0(Native Method)
	at sun.reflect.NativeMethodAccessorImpl.invoke(NativeMethodAccessorImpl.java:57)
	at sun.reflect.DelegatingMethodAccessorImpl.invoke(DelegatingMethodAccessorImpl.java:43)
	at java.lang.reflect.Method.invoke(Method.java:622)
	at org.apache.maven.surefire.util.ReflectionUtils.invokeMethodWithArray(ReflectionUtils.java:189)
	at org.apache.maven.surefire.booter.ProviderFactory$ProviderProxy.invoke(ProviderFactory.java:165)
	at org.apache.maven.surefire.booter.ProviderFactory.invokeProvider(ProviderFactory.java:85)
	at org.apache.maven.surefire.booter.ForkedBooter.runSuitesInProcess(ForkedBooter.java:115)
	at org.apache.maven.surefire.booter.ForkedBooter.main(ForkedBooter.java:75)
Caused by: java.lang.IllegalArgumentException: No folder to scan found for package 'space space.package'.
	at org.apache.olingo.odata2.annotation.processor.core.util.ClassHelper.getResourceUri(ClassHelper.java:109)
	at org.apache.olingo.odata2.annotation.processor.core.util.ClassHelper.loadClasses(ClassHelper.java:72)
	at org.apache.olingo.odata2.annotation.processor.core.util.ClassHelper.loadClasses(ClassHelper.java:65)
	at org.apache.olingo.odata2.annotation.processor.core.util.ClassHelperTest.loadFromSpaceDir(ClassHelperTest.java:74)
	at sun.reflect.NativeMethodAccessorImpl.invoke0(Native Method)
	at sun.reflect.NativeMethodAccessorImpl.invoke(NativeMethodAccessorImpl.java:57)
	at sun.reflect.DelegatingMethodAccessorImpl.invoke(DelegatingMethodAccessorImpl.java:43)
	at java.lang.reflect.Method.invoke(Method.java:622)
	at org.junit.runners.model.FrameworkMethod$1.runReflectiveCall(FrameworkMethod.java:45)
	at org.junit.internal.runners.model.ReflectiveCallable.run(ReflectiveCallable.java:15)
	at org.junit.runners.model.FrameworkMethod.invokeExplosively(FrameworkMethod.java:42)
	at org.junit.internal.runners.statements.InvokeMethod.evaluate(InvokeMethod.java:20)
	at org.junit.internal.runners.statements.ExpectException.evaluate(ExpectException.java:22)
	... 21 more

Running org.apache.olingo.odata2.annotation.processor.core.util.AnnotationHelperTest
Tests run: 21, Failures: 0, Errors: 0, Skipped: 0, Time elapsed: 0.086 sec
Running org.apache.olingo.odata2.annotation.processor.core.datasource.BeanPropertyAccessTest
Tests run: 15, Failures: 0, Errors: 0, Skipped: 0, Time elapsed: 0.169 sec
Running org.apache.olingo.odata2.annotation.processor.core.datasource.AnnotationsInMemoryDsTest
Tests run: 30, Failures: 0, Errors: 0, Skipped: 2, Time elapsed: 1.219 sec
Running org.apache.olingo.odata2.annotation.processor.core.datasource.AnnotationValueAccessTest
Tests run: 17, Failures: 0, Errors: 0, Skipped: 0, Time elapsed: 0.009 sec
Running org.apache.olingo.odata2.annotation.processor.core.AnnotationServiceFactoryImplTest
Tests run: 3, Failures: 0, Errors: 0, Skipped: 0, Time elapsed: 0.035 sec
Running org.apache.olingo.odata2.annotation.processor.core.ListsProcessorTest
Tests run: 4, Failures: 0, Errors: 0, Skipped: 0, Time elapsed: 0.017 sec
Running org.apache.olingo.odata2.annotation.processor.core.edm.AnnotationEdmProviderTest
Tests run: 17, Failures: 0, Errors: 0, Skipped: 0, Time elapsed: 0.105 sec

Results :

Tests in error: 
  loadFromSpaceDir(org.apache.olingo.odata2.annotation.processor.core.util.ClassHelperTest): Unexpected exception, expected<java.lang.ClassFormatError> but was<java.lang.IllegalArgumentException>

Tests run: 110, Failures: 0, Errors: 1, Skipped: 2

[INFO] ------------------------------------------------------------------------
[INFO] Reactor Summary:
[INFO] 
[INFO] olingo-odata2-parent .............................. SUCCESS [14.228s]
[INFO] olingo-odata2-lib ................................. SUCCESS [2.061s]
[INFO] olingo-odata2-api ................................. SUCCESS [9.086s]
[INFO] olingo-odata2-api-annotation ...................... SUCCESS [3.794s]
[INFO] olingo-odata2-testutil ............................ SUCCESS [3.315s]
[INFO] olingo-odata2-core ................................ SUCCESS [27.469s]
[INFO] olingo-odata2-ref ................................. SUCCESS [7.504s]
[INFO] olingo-odata2-fit ................................. SUCCESS [1:30.329s]
[INFO] olingo-odata2-ref-web ............................. SUCCESS [1.777s]
[INFO] olingo-odata2-jpa-processor ....................... SUCCESS [3.036s]
[INFO] olingo-odata2-jpa-processor-api ................... SUCCESS [4.501s]
[INFO] olingo-odata2-jpa-processor-core .................. SUCCESS [11.391s]
[INFO] olingo-odata2-jpa-processor-ref ................... SUCCESS [4.720s]
[INFO] olingo-odata2-jpa-processor-ref-web ............... SUCCESS [2.772s]
[INFO] olingo-odata2-annotation-processor ................ SUCCESS [2.215s]
[INFO] olingo-odata2-annotation-processor-api ............ SUCCESS [8.548s]
[INFO] olingo-odata2-annotation-processor-core ........... FAILURE [4.837s]
[INFO] olingo-odata2-annotation-processor-ref ............ SKIPPED
[INFO] olingo-odata2-annotation-processor-ref-web ........ SKIPPED
[INFO] olingo-odata2-dist ................................ SKIPPED
[INFO] olingo-odata2-dist-lib ............................ SKIPPED
[INFO] olingo-odata2-dist-jpa ............................ SKIPPED
[INFO] olingo-odata2-dist-janos .......................... SKIPPED
[INFO] olingo-odata2-dist-ref ............................ SKIPPED
[INFO] olingo-odata2-dist-javadoc ........................ SKIPPED
[INFO] olingo-odata2-sample .............................. SKIPPED
[INFO] olingo-odata2-sample-cars-service-archetype ....... SKIPPED
[INFO] olingo-odata2-sample-cars-annotation-archetype .... SKIPPED
[INFO] olingo-odata2-sample-cars-jpa-archetype ........... SKIPPED
[INFO] ------------------------------------------------------------------------
[INFO] BUILD FAILURE
[INFO] ------------------------------------------------------------------------
[INFO] Total time: 3:22.843s
[INFO] Finished at: Sat Jun 13 06:37:41 UTC 2015
[INFO] Final Memory: 96M/815M
[INFO] ------------------------------------------------------------------------
[ERROR] Failed to execute goal org.apache.maven.plugins:maven-surefire-plugin:2.12.4:test (default-test) on project olingo-odata2-annotation-processor-core: There are test failures.
[ERROR] 
[ERROR] Please refer to <https://builds.apache.org/job/olingo-odata2/ws/odata2-annotation-processor/annotation-processor-core/target/surefire-reports> for the individual test results.
[ERROR] -> [Help 1]
[ERROR] 
[ERROR] To see the full stack trace of the errors, re-run Maven with the -e switch.
[ERROR] Re-run Maven using the -X switch to enable full debug logging.
[ERROR] 
[ERROR] For more information about the errors and possible solutions, please read the following articles:
[ERROR] [Help 1] http://cwiki.apache.org/confluence/display/MAVEN/MojoFailureException
[ERROR] 
[ERROR] After correcting the problems, you can resume the build with the command
[ERROR]   mvn <goals> -rf :olingo-odata2-annotation-processor-core
Build step 'Invoke top-level Maven targets' marked build as failure

Build failed in Jenkins: olingo-odata2 #1149

Posted by Apache Jenkins Server <je...@builds.apache.org>.
See <https://builds.apache.org/job/olingo-odata2/1149/>

------------------------------------------
Started by user mibo
Building remotely on ubuntu-2 (docker Ubuntu ubuntu) in workspace <https://builds.apache.org/job/olingo-odata2/ws/>
 > git rev-parse --is-inside-work-tree # timeout=10
Fetching changes from the remote Git repository
 > git config remote.origin.url https://git-wip-us.apache.org/repos/asf/olingo-odata2.git # timeout=10
Fetching upstream changes from https://git-wip-us.apache.org/repos/asf/olingo-odata2.git
 > git --version # timeout=10
 > git fetch --tags --progress https://git-wip-us.apache.org/repos/asf/olingo-odata2.git +refs/heads/master:refs/remotes/origin/master
 > git rev-parse origin/master^{commit} # timeout=10
Checking out Revision 5fc3ed2a12892ef38459eb878da1933f689fcb83 (origin/master)
 > git config core.sparsecheckout # timeout=10
 > git checkout -f 5fc3ed2a12892ef38459eb878da1933f689fcb83
 > git rev-list 5fc3ed2a12892ef38459eb878da1933f689fcb83 # timeout=10
[olingo-odata2] $ /home/jenkins/tools/maven/apache-maven-3.0.4/bin/mvn clean deploy
[INFO] Scanning for projects...
[INFO] ------------------------------------------------------------------------
[INFO] Reactor Build Order:
[INFO] 
[INFO] olingo-odata2-parent
[INFO] olingo-odata2-lib
[INFO] olingo-odata2-api
[INFO] olingo-odata2-api-annotation
[INFO] olingo-odata2-testutil
[INFO] olingo-odata2-core
[INFO] olingo-odata2-ref
[INFO] olingo-odata2-fit
[INFO] olingo-odata2-ref-web
[INFO] olingo-odata2-jpa-processor
[INFO] olingo-odata2-jpa-processor-api
[INFO] olingo-odata2-jpa-processor-core
[INFO] olingo-odata2-jpa-processor-ref
[INFO] olingo-odata2-jpa-processor-ref-web
[INFO] olingo-odata2-annotation-processor
[INFO] olingo-odata2-annotation-processor-api
[INFO] olingo-odata2-annotation-processor-core
[INFO] olingo-odata2-annotation-processor-ref
[INFO] olingo-odata2-annotation-processor-ref-web
[INFO] olingo-odata2-dist
[INFO] olingo-odata2-dist-lib
[INFO] olingo-odata2-dist-jpa
[INFO] olingo-odata2-dist-janos
[INFO] olingo-odata2-dist-ref
[INFO] olingo-odata2-dist-javadoc
[INFO] olingo-odata2-sample
[INFO] olingo-odata2-sample-cars-service-archetype
[INFO] olingo-odata2-sample-cars-annotation-archetype
[INFO] olingo-odata2-sample-cars-jpa-archetype
[INFO]                                                                         
[INFO] ------------------------------------------------------------------------
[INFO] Building olingo-odata2-parent 2.0.5-SNAPSHOT
[INFO] ------------------------------------------------------------------------
[INFO] 
[INFO] --- maven-clean-plugin:2.5:clean (default-clean) @ olingo-odata2-parent ---
[INFO] Deleting <https://builds.apache.org/job/olingo-odata2/ws/target>
[INFO] 
[INFO] --- buildnumber-maven-plugin:1.2:create (default) @ olingo-odata2-parent ---
[INFO] Checking for local modifications: skipped.
[INFO] Updating project files from SCM: skipped.
[INFO] Executing: /bin/sh -c cd <https://builds.apache.org/job/olingo-odata2/ws/> && svn --non-interactive info
[INFO] Working directory: <https://builds.apache.org/job/olingo-odata2/ws/>
[INFO] Storing buildNumber: ? at timestamp: 2015-06-13T06:33:18+0000
[INFO] Executing: /bin/sh -c cd <https://builds.apache.org/job/olingo-odata2/ws/> && svn --non-interactive info
[INFO] Working directory: <https://builds.apache.org/job/olingo-odata2/ws/>
[INFO] Storing buildScmBranch: UNKNOWN_BRANCH
[INFO] 
[INFO] --- maven-remote-resources-plugin:1.5:process (default) @ olingo-odata2-parent ---
[INFO] 
[INFO] --- maven-site-plugin:3.2:attach-descriptor (attach-descriptor) @ olingo-odata2-parent ---
[INFO] 
[INFO] --- maven-source-plugin:2.2.1:jar-no-fork (attach-sources) @ olingo-odata2-parent ---
[INFO] 
[INFO] --- maven-checkstyle-plugin:2.10:check (checkstyle) @ olingo-odata2-parent ---
[INFO] Starting audit...
Audit done.

[INFO] 
[INFO] --- maven-install-plugin:2.3.1:install (default-install) @ olingo-odata2-parent ---
[INFO] Installing <https://builds.apache.org/job/olingo-odata2/ws/pom.xml> to /home/jenkins/.m2/repository/org/apache/olingo/olingo-odata2-parent/2.0.5-SNAPSHOT/olingo-odata2-parent-2.0.5-SNAPSHOT.pom
[INFO] 
[INFO] --- maven-deploy-plugin:2.7:deploy (default-deploy) @ olingo-odata2-parent ---
Downloading: https://repository.apache.org/content/repositories/snapshots/org/apache/olingo/olingo-odata2-parent/2.0.5-SNAPSHOT/maven-metadata.xml

[WARNING] Could not transfer metadata org.apache.olingo:olingo-odata2-parent:2.0.5-SNAPSHOT/maven-metadata.xml from/to apache.snapshots.https (https://repository.apache.org/content/repositories/snapshots): java.lang.RuntimeException: Could not generate DH keypair
[INFO] ------------------------------------------------------------------------
[INFO] Reactor Summary:
[INFO] 
[INFO] olingo-odata2-parent .............................. FAILURE [4.306s]
[INFO] olingo-odata2-lib ................................. SKIPPED
[INFO] olingo-odata2-api ................................. SKIPPED
[INFO] olingo-odata2-api-annotation ...................... SKIPPED
[INFO] olingo-odata2-testutil ............................ SKIPPED
[INFO] olingo-odata2-core ................................ SKIPPED
[INFO] olingo-odata2-ref ................................. SKIPPED
[INFO] olingo-odata2-fit ................................. SKIPPED
[INFO] olingo-odata2-ref-web ............................. SKIPPED
[INFO] olingo-odata2-jpa-processor ....................... SKIPPED
[INFO] olingo-odata2-jpa-processor-api ................... SKIPPED
[INFO] olingo-odata2-jpa-processor-core .................. SKIPPED
[INFO] olingo-odata2-jpa-processor-ref ................... SKIPPED
[INFO] olingo-odata2-jpa-processor-ref-web ............... SKIPPED
[INFO] olingo-odata2-annotation-processor ................ SKIPPED
[INFO] olingo-odata2-annotation-processor-api ............ SKIPPED
[INFO] olingo-odata2-annotation-processor-core ........... SKIPPED
[INFO] olingo-odata2-annotation-processor-ref ............ SKIPPED
[INFO] olingo-odata2-annotation-processor-ref-web ........ SKIPPED
[INFO] olingo-odata2-dist ................................ SKIPPED
[INFO] olingo-odata2-dist-lib ............................ SKIPPED
[INFO] olingo-odata2-dist-jpa ............................ SKIPPED
[INFO] olingo-odata2-dist-janos .......................... SKIPPED
[INFO] olingo-odata2-dist-ref ............................ SKIPPED
[INFO] olingo-odata2-dist-javadoc ........................ SKIPPED
[INFO] olingo-odata2-sample .............................. SKIPPED
[INFO] olingo-odata2-sample-cars-service-archetype ....... SKIPPED
[INFO] olingo-odata2-sample-cars-annotation-archetype .... SKIPPED
[INFO] olingo-odata2-sample-cars-jpa-archetype ........... SKIPPED
[INFO] ------------------------------------------------------------------------
[INFO] BUILD FAILURE
[INFO] ------------------------------------------------------------------------
[INFO] Total time: 5.819s
[INFO] Finished at: Sat Jun 13 06:33:22 UTC 2015
[INFO] Final Memory: 18M/723M
[INFO] ------------------------------------------------------------------------
[ERROR] Failed to execute goal org.apache.maven.plugins:maven-deploy-plugin:2.7:deploy (default-deploy) on project olingo-odata2-parent: Failed to retrieve remote metadata org.apache.olingo:olingo-odata2-parent:2.0.5-SNAPSHOT/maven-metadata.xml: Could not transfer metadata org.apache.olingo:olingo-odata2-parent:2.0.5-SNAPSHOT/maven-metadata.xml from/to apache.snapshots.https (https://repository.apache.org/content/repositories/snapshots): java.lang.RuntimeException: Could not generate DH keypair: Prime size must be multiple of 64, and can only range from 512 to 1024 (inclusive) -> [Help 1]
[ERROR] 
[ERROR] To see the full stack trace of the errors, re-run Maven with the -e switch.
[ERROR] Re-run Maven using the -X switch to enable full debug logging.
[ERROR] 
[ERROR] For more information about the errors and possible solutions, please read the following articles:
[ERROR] [Help 1] http://cwiki.apache.org/confluence/display/MAVEN/MojoExecutionException
Build step 'Invoke top-level Maven targets' marked build as failure

Build failed in Jenkins: olingo-odata2 #1148

Posted by Apache Jenkins Server <je...@builds.apache.org>.
See <https://builds.apache.org/job/olingo-odata2/1148/>

------------------------------------------
Started by user mibo
Building remotely on ubuntu-2 (docker Ubuntu ubuntu) in workspace <https://builds.apache.org/job/olingo-odata2/ws/>
 > git rev-parse --is-inside-work-tree # timeout=10
Fetching changes from the remote Git repository
 > git config remote.origin.url https://git-wip-us.apache.org/repos/asf/olingo-odata2.git # timeout=10
Fetching upstream changes from https://git-wip-us.apache.org/repos/asf/olingo-odata2.git
 > git --version # timeout=10
 > git fetch --tags --progress https://git-wip-us.apache.org/repos/asf/olingo-odata2.git +refs/heads/master:refs/remotes/origin/master
 > git rev-parse origin/master^{commit} # timeout=10
Checking out Revision 5fc3ed2a12892ef38459eb878da1933f689fcb83 (origin/master)
 > git config core.sparsecheckout # timeout=10
 > git checkout -f 5fc3ed2a12892ef38459eb878da1933f689fcb83
 > git rev-list 5fc3ed2a12892ef38459eb878da1933f689fcb83 # timeout=10
[olingo-odata2] $ /home/jenkins/tools/maven/apache-maven-3.0.4/bin/mvn clean deploy
[INFO] Scanning for projects...
[INFO] ------------------------------------------------------------------------
[INFO] Reactor Build Order:
[INFO] 
[INFO] olingo-odata2-parent
[INFO] olingo-odata2-lib
[INFO] olingo-odata2-api
[INFO] olingo-odata2-api-annotation
[INFO] olingo-odata2-testutil
[INFO] olingo-odata2-core
[INFO] olingo-odata2-ref
[INFO] olingo-odata2-fit
[INFO] olingo-odata2-ref-web
[INFO] olingo-odata2-jpa-processor
[INFO] olingo-odata2-jpa-processor-api
[INFO] olingo-odata2-jpa-processor-core
[INFO] olingo-odata2-jpa-processor-ref
[INFO] olingo-odata2-jpa-processor-ref-web
[INFO] olingo-odata2-annotation-processor
[INFO] olingo-odata2-annotation-processor-api
[INFO] olingo-odata2-annotation-processor-core
[INFO] olingo-odata2-annotation-processor-ref
[INFO] olingo-odata2-annotation-processor-ref-web
[INFO] olingo-odata2-dist
[INFO] olingo-odata2-dist-lib
[INFO] olingo-odata2-dist-jpa
[INFO] olingo-odata2-dist-janos
[INFO] olingo-odata2-dist-ref
[INFO] olingo-odata2-dist-javadoc
[INFO] olingo-odata2-sample
[INFO] olingo-odata2-sample-cars-service-archetype
[INFO] olingo-odata2-sample-cars-annotation-archetype
[INFO] olingo-odata2-sample-cars-jpa-archetype
[INFO]                                                                         
[INFO] ------------------------------------------------------------------------
[INFO] Building olingo-odata2-parent 2.0.5-SNAPSHOT
[INFO] ------------------------------------------------------------------------
[INFO] 
[INFO] --- maven-clean-plugin:2.5:clean (default-clean) @ olingo-odata2-parent ---
[INFO] Deleting <https://builds.apache.org/job/olingo-odata2/ws/target>
[INFO] 
[INFO] --- buildnumber-maven-plugin:1.2:create (default) @ olingo-odata2-parent ---
[INFO] Checking for local modifications: skipped.
[INFO] Updating project files from SCM: skipped.
[INFO] Executing: /bin/sh -c cd <https://builds.apache.org/job/olingo-odata2/ws/> && svn --non-interactive info
[INFO] Working directory: <https://builds.apache.org/job/olingo-odata2/ws/>
[INFO] Storing buildNumber: ? at timestamp: 2015-06-13T06:31:56+0000
[INFO] Executing: /bin/sh -c cd <https://builds.apache.org/job/olingo-odata2/ws/> && svn --non-interactive info
[INFO] Working directory: <https://builds.apache.org/job/olingo-odata2/ws/>
[INFO] Storing buildScmBranch: UNKNOWN_BRANCH
[INFO] 
[INFO] --- maven-remote-resources-plugin:1.5:process (default) @ olingo-odata2-parent ---
[INFO] 
[INFO] --- maven-site-plugin:3.2:attach-descriptor (attach-descriptor) @ olingo-odata2-parent ---
[INFO] 
[INFO] --- maven-source-plugin:2.2.1:jar-no-fork (attach-sources) @ olingo-odata2-parent ---
[INFO] 
[INFO] --- maven-checkstyle-plugin:2.10:check (checkstyle) @ olingo-odata2-parent ---
[INFO] Starting audit...
Audit done.

[INFO] 
[INFO] --- maven-install-plugin:2.3.1:install (default-install) @ olingo-odata2-parent ---
[INFO] Installing <https://builds.apache.org/job/olingo-odata2/ws/pom.xml> to /home/jenkins/.m2/repository/org/apache/olingo/olingo-odata2-parent/2.0.5-SNAPSHOT/olingo-odata2-parent-2.0.5-SNAPSHOT.pom
[INFO] 
[INFO] --- maven-deploy-plugin:2.7:deploy (default-deploy) @ olingo-odata2-parent ---
Downloading: https://repository.apache.org/content/repositories/snapshots/org/apache/olingo/olingo-odata2-parent/2.0.5-SNAPSHOT/maven-metadata.xml

[WARNING] Could not transfer metadata org.apache.olingo:olingo-odata2-parent:2.0.5-SNAPSHOT/maven-metadata.xml from/to apache.snapshots.https (https://repository.apache.org/content/repositories/snapshots): java.lang.RuntimeException: Could not generate DH keypair
[INFO] ------------------------------------------------------------------------
[INFO] Reactor Summary:
[INFO] 
[INFO] olingo-odata2-parent .............................. FAILURE [3.458s]
[INFO] olingo-odata2-lib ................................. SKIPPED
[INFO] olingo-odata2-api ................................. SKIPPED
[INFO] olingo-odata2-api-annotation ...................... SKIPPED
[INFO] olingo-odata2-testutil ............................ SKIPPED
[INFO] olingo-odata2-core ................................ SKIPPED
[INFO] olingo-odata2-ref ................................. SKIPPED
[INFO] olingo-odata2-fit ................................. SKIPPED
[INFO] olingo-odata2-ref-web ............................. SKIPPED
[INFO] olingo-odata2-jpa-processor ....................... SKIPPED
[INFO] olingo-odata2-jpa-processor-api ................... SKIPPED
[INFO] olingo-odata2-jpa-processor-core .................. SKIPPED
[INFO] olingo-odata2-jpa-processor-ref ................... SKIPPED
[INFO] olingo-odata2-jpa-processor-ref-web ............... SKIPPED
[INFO] olingo-odata2-annotation-processor ................ SKIPPED
[INFO] olingo-odata2-annotation-processor-api ............ SKIPPED
[INFO] olingo-odata2-annotation-processor-core ........... SKIPPED
[INFO] olingo-odata2-annotation-processor-ref ............ SKIPPED
[INFO] olingo-odata2-annotation-processor-ref-web ........ SKIPPED
[INFO] olingo-odata2-dist ................................ SKIPPED
[INFO] olingo-odata2-dist-lib ............................ SKIPPED
[INFO] olingo-odata2-dist-jpa ............................ SKIPPED
[INFO] olingo-odata2-dist-janos .......................... SKIPPED
[INFO] olingo-odata2-dist-ref ............................ SKIPPED
[INFO] olingo-odata2-dist-javadoc ........................ SKIPPED
[INFO] olingo-odata2-sample .............................. SKIPPED
[INFO] olingo-odata2-sample-cars-service-archetype ....... SKIPPED
[INFO] olingo-odata2-sample-cars-annotation-archetype .... SKIPPED
[INFO] olingo-odata2-sample-cars-jpa-archetype ........... SKIPPED
[INFO] ------------------------------------------------------------------------
[INFO] BUILD FAILURE
[INFO] ------------------------------------------------------------------------
[INFO] Total time: 4.564s
[INFO] Finished at: Sat Jun 13 06:31:59 UTC 2015
[INFO] Final Memory: 16M/150M
[INFO] ------------------------------------------------------------------------
[ERROR] Failed to execute goal org.apache.maven.plugins:maven-deploy-plugin:2.7:deploy (default-deploy) on project olingo-odata2-parent: Failed to retrieve remote metadata org.apache.olingo:olingo-odata2-parent:2.0.5-SNAPSHOT/maven-metadata.xml: Could not transfer metadata org.apache.olingo:olingo-odata2-parent:2.0.5-SNAPSHOT/maven-metadata.xml from/to apache.snapshots.https (https://repository.apache.org/content/repositories/snapshots): java.lang.RuntimeException: Could not generate DH keypair: Prime size must be multiple of 64, and can only range from 512 to 1024 (inclusive) -> [Help 1]
[ERROR] 
[ERROR] To see the full stack trace of the errors, re-run Maven with the -e switch.
[ERROR] Re-run Maven using the -X switch to enable full debug logging.
[ERROR] 
[ERROR] For more information about the errors and possible solutions, please read the following articles:
[ERROR] [Help 1] http://cwiki.apache.org/confluence/display/MAVEN/MojoExecutionException
Build step 'Invoke top-level Maven targets' marked build as failure

Build failed in Jenkins: olingo-odata2 #1147

Posted by Apache Jenkins Server <je...@builds.apache.org>.
See <https://builds.apache.org/job/olingo-odata2/1147/changes>

Changes:

[mibo] [OLINGO-697] Fix maven build warning

------------------------------------------
Started by user mibo
Building remotely on ubuntu-2 (docker Ubuntu ubuntu) in workspace <https://builds.apache.org/job/olingo-odata2/ws/>
 > git rev-parse --is-inside-work-tree # timeout=10
Fetching changes from the remote Git repository
 > git config remote.origin.url https://git-wip-us.apache.org/repos/asf/olingo-odata2.git # timeout=10
Fetching upstream changes from https://git-wip-us.apache.org/repos/asf/olingo-odata2.git
 > git --version # timeout=10
 > git fetch --tags --progress https://git-wip-us.apache.org/repos/asf/olingo-odata2.git +refs/heads/master:refs/remotes/origin/master
 > git rev-parse origin/master^{commit} # timeout=10
Checking out Revision 5fc3ed2a12892ef38459eb878da1933f689fcb83 (origin/master)
 > git config core.sparsecheckout # timeout=10
 > git checkout -f 5fc3ed2a12892ef38459eb878da1933f689fcb83
 > git rev-list 48f9e9319d26dc3104b525c20d2c94780aba59f9 # timeout=10
[olingo-odata2] $ /home/jenkins/tools/maven/apache-maven-3.0.4/bin/mvn clean deploy
[INFO] Scanning for projects...
[INFO] ------------------------------------------------------------------------
[INFO] Reactor Build Order:
[INFO] 
[INFO] olingo-odata2-parent
[INFO] olingo-odata2-lib
[INFO] olingo-odata2-api
[INFO] olingo-odata2-api-annotation
[INFO] olingo-odata2-testutil
[INFO] olingo-odata2-core
[INFO] olingo-odata2-ref
[INFO] olingo-odata2-fit
[INFO] olingo-odata2-ref-web
[INFO] olingo-odata2-jpa-processor
[INFO] olingo-odata2-jpa-processor-api
[INFO] olingo-odata2-jpa-processor-core
[INFO] olingo-odata2-jpa-processor-ref
[INFO] olingo-odata2-jpa-processor-ref-web
[INFO] olingo-odata2-annotation-processor
[INFO] olingo-odata2-annotation-processor-api
[INFO] olingo-odata2-annotation-processor-core
[INFO] olingo-odata2-annotation-processor-ref
[INFO] olingo-odata2-annotation-processor-ref-web
[INFO] olingo-odata2-dist
[INFO] olingo-odata2-dist-lib
[INFO] olingo-odata2-dist-jpa
[INFO] olingo-odata2-dist-janos
[INFO] olingo-odata2-dist-ref
[INFO] olingo-odata2-dist-javadoc
[INFO] olingo-odata2-sample
[INFO] olingo-odata2-sample-cars-service-archetype
[INFO] olingo-odata2-sample-cars-annotation-archetype
[INFO] olingo-odata2-sample-cars-jpa-archetype
[INFO]                                                                         
[INFO] ------------------------------------------------------------------------
[INFO] Building olingo-odata2-parent 2.0.5-SNAPSHOT
[INFO] ------------------------------------------------------------------------
[INFO] 
[INFO] --- maven-clean-plugin:2.5:clean (default-clean) @ olingo-odata2-parent ---
[INFO] Deleting <https://builds.apache.org/job/olingo-odata2/ws/target>
[INFO] 
[INFO] --- buildnumber-maven-plugin:1.2:create (default) @ olingo-odata2-parent ---
[INFO] Checking for local modifications: skipped.
[INFO] Updating project files from SCM: skipped.
[INFO] Executing: /bin/sh -c cd <https://builds.apache.org/job/olingo-odata2/ws/> && svn --non-interactive info
[INFO] Working directory: <https://builds.apache.org/job/olingo-odata2/ws/>
[INFO] Storing buildNumber: ? at timestamp: 2015-06-13T06:21:13+0000
[INFO] Executing: /bin/sh -c cd <https://builds.apache.org/job/olingo-odata2/ws/> && svn --non-interactive info
[INFO] Working directory: <https://builds.apache.org/job/olingo-odata2/ws/>
[INFO] Storing buildScmBranch: UNKNOWN_BRANCH
[INFO] 
[INFO] --- maven-remote-resources-plugin:1.5:process (default) @ olingo-odata2-parent ---
[INFO] 
[INFO] --- maven-site-plugin:3.2:attach-descriptor (attach-descriptor) @ olingo-odata2-parent ---
[INFO] 
[INFO] --- maven-source-plugin:2.2.1:jar-no-fork (attach-sources) @ olingo-odata2-parent ---
[INFO] 
[INFO] --- maven-checkstyle-plugin:2.10:check (checkstyle) @ olingo-odata2-parent ---
[INFO] Starting audit...
Audit done.

[INFO] 
[INFO] --- maven-install-plugin:2.3.1:install (default-install) @ olingo-odata2-parent ---
[INFO] Installing <https://builds.apache.org/job/olingo-odata2/ws/pom.xml> to /home/jenkins/.m2/repository/org/apache/olingo/olingo-odata2-parent/2.0.5-SNAPSHOT/olingo-odata2-parent-2.0.5-SNAPSHOT.pom
[INFO] 
[INFO] --- maven-deploy-plugin:2.7:deploy (default-deploy) @ olingo-odata2-parent ---
Downloading: https://repository.apache.org/content/repositories/snapshots/org/apache/olingo/olingo-odata2-parent/2.0.5-SNAPSHOT/maven-metadata.xml

[WARNING] Could not transfer metadata org.apache.olingo:olingo-odata2-parent:2.0.5-SNAPSHOT/maven-metadata.xml from/to apache.snapshots.https (https://repository.apache.org/content/repositories/snapshots): java.lang.RuntimeException: Could not generate DH keypair
[INFO] ------------------------------------------------------------------------
[INFO] Reactor Summary:
[INFO] 
[INFO] olingo-odata2-parent .............................. FAILURE [3.881s]
[INFO] olingo-odata2-lib ................................. SKIPPED
[INFO] olingo-odata2-api ................................. SKIPPED
[INFO] olingo-odata2-api-annotation ...................... SKIPPED
[INFO] olingo-odata2-testutil ............................ SKIPPED
[INFO] olingo-odata2-core ................................ SKIPPED
[INFO] olingo-odata2-ref ................................. SKIPPED
[INFO] olingo-odata2-fit ................................. SKIPPED
[INFO] olingo-odata2-ref-web ............................. SKIPPED
[INFO] olingo-odata2-jpa-processor ....................... SKIPPED
[INFO] olingo-odata2-jpa-processor-api ................... SKIPPED
[INFO] olingo-odata2-jpa-processor-core .................. SKIPPED
[INFO] olingo-odata2-jpa-processor-ref ................... SKIPPED
[INFO] olingo-odata2-jpa-processor-ref-web ............... SKIPPED
[INFO] olingo-odata2-annotation-processor ................ SKIPPED
[INFO] olingo-odata2-annotation-processor-api ............ SKIPPED
[INFO] olingo-odata2-annotation-processor-core ........... SKIPPED
[INFO] olingo-odata2-annotation-processor-ref ............ SKIPPED
[INFO] olingo-odata2-annotation-processor-ref-web ........ SKIPPED
[INFO] olingo-odata2-dist ................................ SKIPPED
[INFO] olingo-odata2-dist-lib ............................ SKIPPED
[INFO] olingo-odata2-dist-jpa ............................ SKIPPED
[INFO] olingo-odata2-dist-janos .......................... SKIPPED
[INFO] olingo-odata2-dist-ref ............................ SKIPPED
[INFO] olingo-odata2-dist-javadoc ........................ SKIPPED
[INFO] olingo-odata2-sample .............................. SKIPPED
[INFO] olingo-odata2-sample-cars-service-archetype ....... SKIPPED
[INFO] olingo-odata2-sample-cars-annotation-archetype .... SKIPPED
[INFO] olingo-odata2-sample-cars-jpa-archetype ........... SKIPPED
[INFO] ------------------------------------------------------------------------
[INFO] BUILD FAILURE
[INFO] ------------------------------------------------------------------------
[INFO] Total time: 5.247s
[INFO] Finished at: Sat Jun 13 06:21:16 UTC 2015
[INFO] Final Memory: 17M/178M
[INFO] ------------------------------------------------------------------------
[ERROR] Failed to execute goal org.apache.maven.plugins:maven-deploy-plugin:2.7:deploy (default-deploy) on project olingo-odata2-parent: Failed to retrieve remote metadata org.apache.olingo:olingo-odata2-parent:2.0.5-SNAPSHOT/maven-metadata.xml: Could not transfer metadata org.apache.olingo:olingo-odata2-parent:2.0.5-SNAPSHOT/maven-metadata.xml from/to apache.snapshots.https (https://repository.apache.org/content/repositories/snapshots): java.lang.RuntimeException: Could not generate DH keypair: Prime size must be multiple of 64, and can only range from 512 to 1024 (inclusive) -> [Help 1]
[ERROR] 
[ERROR] To see the full stack trace of the errors, re-run Maven with the -e switch.
[ERROR] Re-run Maven using the -X switch to enable full debug logging.
[ERROR] 
[ERROR] For more information about the errors and possible solutions, please read the following articles:
[ERROR] [Help 1] http://cwiki.apache.org/confluence/display/MAVEN/MojoExecutionException
Build step 'Invoke top-level Maven targets' marked build as failure

Build failed in Jenkins: olingo-odata2 #1146

Posted by Apache Jenkins Server <je...@builds.apache.org>.
See <https://builds.apache.org/job/olingo-odata2/1146/>

------------------------------------------
Started by timer
Building remotely on H11 (Ubuntu ubuntu) in workspace <https://builds.apache.org/job/olingo-odata2/ws/>
 > git rev-parse --is-inside-work-tree # timeout=10
Fetching changes from the remote Git repository
 > git config remote.origin.url https://git-wip-us.apache.org/repos/asf/olingo-odata2.git # timeout=10
Fetching upstream changes from https://git-wip-us.apache.org/repos/asf/olingo-odata2.git
 > git --version # timeout=10
 > git fetch --tags --progress https://git-wip-us.apache.org/repos/asf/olingo-odata2.git +refs/heads/master:refs/remotes/origin/master
 > git rev-parse origin/master^{commit} # timeout=10
Checking out Revision 48f9e9319d26dc3104b525c20d2c94780aba59f9 (origin/master)
 > git config core.sparsecheckout # timeout=10
 > git checkout -f 48f9e9319d26dc3104b525c20d2c94780aba59f9
 > git rev-list 48f9e9319d26dc3104b525c20d2c94780aba59f9 # timeout=10
[olingo-odata2] $ /home/jenkins/tools/maven/apache-maven-3.0.4/bin/mvn clean deploy
[INFO] Scanning for projects...
[WARNING] 
[WARNING] Some problems were encountered while building the effective model for org.apache.olingo:olingo-odata2-testutil:jar:2.0.5-SNAPSHOT
[WARNING] 'dependencies.dependency.(groupId:artifactId:type:classifier)' must be unique: org.mockito:mockito-all:jar -> duplicate declaration of version ${mockito.version} @ line 109, column 17
[WARNING] 
[WARNING] It is highly recommended to fix these problems because they threaten the stability of your build.
[WARNING] 
[WARNING] For this reason, future Maven versions might no longer support building such malformed projects.
[WARNING] 
[INFO] ------------------------------------------------------------------------
[INFO] Reactor Build Order:
[INFO] 
[INFO] olingo-odata2-parent
[INFO] olingo-odata2-lib
[INFO] olingo-odata2-api
[INFO] olingo-odata2-api-annotation
[INFO] olingo-odata2-testutil
[INFO] olingo-odata2-core
[INFO] olingo-odata2-ref
[INFO] olingo-odata2-fit
[INFO] olingo-odata2-ref-web
[INFO] olingo-odata2-jpa-processor
[INFO] olingo-odata2-jpa-processor-api
[INFO] olingo-odata2-jpa-processor-core
[INFO] olingo-odata2-jpa-processor-ref
[INFO] olingo-odata2-jpa-processor-ref-web
[INFO] olingo-odata2-annotation-processor
[INFO] olingo-odata2-annotation-processor-api
[INFO] olingo-odata2-annotation-processor-core
[INFO] olingo-odata2-annotation-processor-ref
[INFO] olingo-odata2-annotation-processor-ref-web
[INFO] olingo-odata2-dist
[INFO] olingo-odata2-dist-lib
[INFO] olingo-odata2-dist-jpa
[INFO] olingo-odata2-dist-janos
[INFO] olingo-odata2-dist-ref
[INFO] olingo-odata2-dist-javadoc
[INFO] olingo-odata2-sample
[INFO] olingo-odata2-sample-cars-service-archetype
[INFO] olingo-odata2-sample-cars-annotation-archetype
[INFO] olingo-odata2-sample-cars-jpa-archetype
[INFO]                                                                         
[INFO] ------------------------------------------------------------------------
[INFO] Building olingo-odata2-parent 2.0.5-SNAPSHOT
[INFO] ------------------------------------------------------------------------
[INFO] 
[INFO] --- maven-clean-plugin:2.5:clean (default-clean) @ olingo-odata2-parent ---
[INFO] Deleting <https://builds.apache.org/job/olingo-odata2/ws/target>
[INFO] 
[INFO] --- buildnumber-maven-plugin:1.2:create (default) @ olingo-odata2-parent ---
[INFO] Checking for local modifications: skipped.
[INFO] Updating project files from SCM: skipped.
[INFO] Executing: /bin/sh -c cd <https://builds.apache.org/job/olingo-odata2/ws/> && svn --non-interactive info
[INFO] Working directory: <https://builds.apache.org/job/olingo-odata2/ws/>
[INFO] Storing buildNumber: ? at timestamp: 2015-06-13T00:49:43+0000
[INFO] Executing: /bin/sh -c cd <https://builds.apache.org/job/olingo-odata2/ws/> && svn --non-interactive info
[INFO] Working directory: <https://builds.apache.org/job/olingo-odata2/ws/>
[INFO] Storing buildScmBranch: UNKNOWN_BRANCH
[INFO] 
[INFO] --- maven-remote-resources-plugin:1.5:process (default) @ olingo-odata2-parent ---
[INFO] 
[INFO] --- maven-site-plugin:3.2:attach-descriptor (attach-descriptor) @ olingo-odata2-parent ---
[INFO] 
[INFO] --- maven-source-plugin:2.2.1:jar-no-fork (attach-sources) @ olingo-odata2-parent ---
[INFO] 
[INFO] --- maven-checkstyle-plugin:2.10:check (checkstyle) @ olingo-odata2-parent ---
[INFO] Starting audit...
Audit done.

[INFO] 
[INFO] --- maven-install-plugin:2.3.1:install (default-install) @ olingo-odata2-parent ---
[INFO] Installing <https://builds.apache.org/job/olingo-odata2/ws/pom.xml> to /home/jenkins/.m2/repository/org/apache/olingo/olingo-odata2-parent/2.0.5-SNAPSHOT/olingo-odata2-parent-2.0.5-SNAPSHOT.pom
[INFO] 
[INFO] --- maven-deploy-plugin:2.7:deploy (default-deploy) @ olingo-odata2-parent ---
Downloading: https://repository.apache.org/content/repositories/snapshots/org/apache/olingo/olingo-odata2-parent/2.0.5-SNAPSHOT/maven-metadata.xml

[WARNING] Could not transfer metadata org.apache.olingo:olingo-odata2-parent:2.0.5-SNAPSHOT/maven-metadata.xml from/to apache.snapshots.https (https://repository.apache.org/content/repositories/snapshots): java.lang.RuntimeException: Could not generate DH keypair
[INFO] ------------------------------------------------------------------------
[INFO] Reactor Summary:
[INFO] 
[INFO] olingo-odata2-parent .............................. FAILURE [3.807s]
[INFO] olingo-odata2-lib ................................. SKIPPED
[INFO] olingo-odata2-api ................................. SKIPPED
[INFO] olingo-odata2-api-annotation ...................... SKIPPED
[INFO] olingo-odata2-testutil ............................ SKIPPED
[INFO] olingo-odata2-core ................................ SKIPPED
[INFO] olingo-odata2-ref ................................. SKIPPED
[INFO] olingo-odata2-fit ................................. SKIPPED
[INFO] olingo-odata2-ref-web ............................. SKIPPED
[INFO] olingo-odata2-jpa-processor ....................... SKIPPED
[INFO] olingo-odata2-jpa-processor-api ................... SKIPPED
[INFO] olingo-odata2-jpa-processor-core .................. SKIPPED
[INFO] olingo-odata2-jpa-processor-ref ................... SKIPPED
[INFO] olingo-odata2-jpa-processor-ref-web ............... SKIPPED
[INFO] olingo-odata2-annotation-processor ................ SKIPPED
[INFO] olingo-odata2-annotation-processor-api ............ SKIPPED
[INFO] olingo-odata2-annotation-processor-core ........... SKIPPED
[INFO] olingo-odata2-annotation-processor-ref ............ SKIPPED
[INFO] olingo-odata2-annotation-processor-ref-web ........ SKIPPED
[INFO] olingo-odata2-dist ................................ SKIPPED
[INFO] olingo-odata2-dist-lib ............................ SKIPPED
[INFO] olingo-odata2-dist-jpa ............................ SKIPPED
[INFO] olingo-odata2-dist-janos .......................... SKIPPED
[INFO] olingo-odata2-dist-ref ............................ SKIPPED
[INFO] olingo-odata2-dist-javadoc ........................ SKIPPED
[INFO] olingo-odata2-sample .............................. SKIPPED
[INFO] olingo-odata2-sample-cars-service-archetype ....... SKIPPED
[INFO] olingo-odata2-sample-cars-annotation-archetype .... SKIPPED
[INFO] olingo-odata2-sample-cars-jpa-archetype ........... SKIPPED
[INFO] ------------------------------------------------------------------------
[INFO] BUILD FAILURE
[INFO] ------------------------------------------------------------------------
[INFO] Total time: 4.907s
[INFO] Finished at: Sat Jun 13 00:49:46 UTC 2015
[INFO] Final Memory: 17M/178M
[INFO] ------------------------------------------------------------------------
[ERROR] Failed to execute goal org.apache.maven.plugins:maven-deploy-plugin:2.7:deploy (default-deploy) on project olingo-odata2-parent: Failed to retrieve remote metadata org.apache.olingo:olingo-odata2-parent:2.0.5-SNAPSHOT/maven-metadata.xml: Could not transfer metadata org.apache.olingo:olingo-odata2-parent:2.0.5-SNAPSHOT/maven-metadata.xml from/to apache.snapshots.https (https://repository.apache.org/content/repositories/snapshots): java.lang.RuntimeException: Could not generate DH keypair: Prime size must be multiple of 64, and can only range from 512 to 1024 (inclusive) -> [Help 1]
[ERROR] 
[ERROR] To see the full stack trace of the errors, re-run Maven with the -e switch.
[ERROR] Re-run Maven using the -X switch to enable full debug logging.
[ERROR] 
[ERROR] For more information about the errors and possible solutions, please read the following articles:
[ERROR] [Help 1] http://cwiki.apache.org/confluence/display/MAVEN/MojoExecutionException
Build step 'Invoke top-level Maven targets' marked build as failure

Build failed in Jenkins: olingo-odata2 #1145

Posted by Apache Jenkins Server <je...@builds.apache.org>.
See <https://builds.apache.org/job/olingo-odata2/1145/>

------------------------------------------
Started by user mibo
Building remotely on ubuntu3 (Ubuntu ubuntu legacy-ubuntu) in workspace <https://builds.apache.org/job/olingo-odata2/ws/>
 > git rev-parse --is-inside-work-tree # timeout=10
Fetching changes from the remote Git repository
 > git config remote.origin.url https://git-wip-us.apache.org/repos/asf/olingo-odata2.git # timeout=10
Fetching upstream changes from https://git-wip-us.apache.org/repos/asf/olingo-odata2.git
 > git --version # timeout=10
 > git fetch --tags --progress https://git-wip-us.apache.org/repos/asf/olingo-odata2.git +refs/heads/master:refs/remotes/origin/master
 > git rev-parse origin/master^{commit} # timeout=10
Checking out Revision 48f9e9319d26dc3104b525c20d2c94780aba59f9 (origin/master)
 > git config core.sparsecheckout # timeout=10
 > git checkout -f 48f9e9319d26dc3104b525c20d2c94780aba59f9
 > git rev-list 48f9e9319d26dc3104b525c20d2c94780aba59f9 # timeout=10
[olingo-odata2] $ /home/jenkins/tools/maven/apache-maven-3.0.4/bin/mvn clean deploy
[INFO] Scanning for projects...
[WARNING] 
[WARNING] Some problems were encountered while building the effective model for org.apache.olingo:olingo-odata2-testutil:jar:2.0.5-SNAPSHOT
[WARNING] 'dependencies.dependency.(groupId:artifactId:type:classifier)' must be unique: org.mockito:mockito-all:jar -> duplicate declaration of version ${mockito.version} @ line 109, column 17
[WARNING] 
[WARNING] It is highly recommended to fix these problems because they threaten the stability of your build.
[WARNING] 
[WARNING] For this reason, future Maven versions might no longer support building such malformed projects.
[WARNING] 
[INFO] ------------------------------------------------------------------------
[INFO] Reactor Build Order:
[INFO] 
[INFO] olingo-odata2-parent
[INFO] olingo-odata2-lib
[INFO] olingo-odata2-api
[INFO] olingo-odata2-api-annotation
[INFO] olingo-odata2-testutil
[INFO] olingo-odata2-core
[INFO] olingo-odata2-ref
[INFO] olingo-odata2-fit
[INFO] olingo-odata2-ref-web
[INFO] olingo-odata2-jpa-processor
[INFO] olingo-odata2-jpa-processor-api
[INFO] olingo-odata2-jpa-processor-core
[INFO] olingo-odata2-jpa-processor-ref
[INFO] olingo-odata2-jpa-processor-ref-web
[INFO] olingo-odata2-annotation-processor
[INFO] olingo-odata2-annotation-processor-api
[INFO] olingo-odata2-annotation-processor-core
[INFO] olingo-odata2-annotation-processor-ref
[INFO] olingo-odata2-annotation-processor-ref-web
[INFO] olingo-odata2-dist
[INFO] olingo-odata2-dist-lib
[INFO] olingo-odata2-dist-jpa
[INFO] olingo-odata2-dist-janos
[INFO] olingo-odata2-dist-ref
[INFO] olingo-odata2-dist-javadoc
[INFO] olingo-odata2-sample
[INFO] olingo-odata2-sample-cars-service-archetype
[INFO] olingo-odata2-sample-cars-annotation-archetype
[INFO] olingo-odata2-sample-cars-jpa-archetype
[INFO]                                                                         
[INFO] ------------------------------------------------------------------------
[INFO] Building olingo-odata2-parent 2.0.5-SNAPSHOT
[INFO] ------------------------------------------------------------------------
[INFO] 
[INFO] --- maven-clean-plugin:2.5:clean (default-clean) @ olingo-odata2-parent ---
[INFO] Deleting /x1/jenkins/jenkins-slave/workspace/olingo-odata2/target
[INFO] 
[INFO] --- buildnumber-maven-plugin:1.2:create (default) @ olingo-odata2-parent ---
[INFO] Checking for local modifications: skipped.
[INFO] Updating project files from SCM: skipped.
[INFO] Executing: /bin/sh -c cd /x1/jenkins/jenkins-slave/workspace/olingo-odata2 && svn --non-interactive info
[INFO] Working directory: /x1/jenkins/jenkins-slave/workspace/olingo-odata2
[INFO] Storing buildNumber: ? at timestamp: 2015-06-12T21:24:41+0000
[INFO] Executing: /bin/sh -c cd /x1/jenkins/jenkins-slave/workspace/olingo-odata2 && svn --non-interactive info
[INFO] Working directory: /x1/jenkins/jenkins-slave/workspace/olingo-odata2
[INFO] Storing buildScmBranch: UNKNOWN_BRANCH
[INFO] 
[INFO] --- maven-remote-resources-plugin:1.5:process (default) @ olingo-odata2-parent ---
[INFO] 
[INFO] --- maven-site-plugin:3.2:attach-descriptor (attach-descriptor) @ olingo-odata2-parent ---
[INFO] 
[INFO] --- maven-source-plugin:2.2.1:jar-no-fork (attach-sources) @ olingo-odata2-parent ---
[INFO] 
[INFO] --- maven-checkstyle-plugin:2.10:check (checkstyle) @ olingo-odata2-parent ---
[INFO] Starting audit...
Audit done.

[INFO] 
[INFO] --- maven-install-plugin:2.3.1:install (default-install) @ olingo-odata2-parent ---
[INFO] Installing /x1/jenkins/jenkins-slave/workspace/olingo-odata2/pom.xml to /home/jenkins/.m2/repository/org/apache/olingo/olingo-odata2-parent/2.0.5-SNAPSHOT/olingo-odata2-parent-2.0.5-SNAPSHOT.pom
[INFO] 
[INFO] --- maven-deploy-plugin:2.7:deploy (default-deploy) @ olingo-odata2-parent ---
Downloading: https://repository.apache.org/content/repositories/snapshots/org/apache/olingo/olingo-odata2-parent/2.0.5-SNAPSHOT/maven-metadata.xml

[WARNING] Could not transfer metadata org.apache.olingo:olingo-odata2-parent:2.0.5-SNAPSHOT/maven-metadata.xml from/to apache.snapshots.https (https://repository.apache.org/content/repositories/snapshots): java.lang.RuntimeException: Could not generate DH keypair
[INFO] ------------------------------------------------------------------------
[INFO] Reactor Summary:
[INFO] 
[INFO] olingo-odata2-parent .............................. FAILURE [4.834s]
[INFO] olingo-odata2-lib ................................. SKIPPED
[INFO] olingo-odata2-api ................................. SKIPPED
[INFO] olingo-odata2-api-annotation ...................... SKIPPED
[INFO] olingo-odata2-testutil ............................ SKIPPED
[INFO] olingo-odata2-core ................................ SKIPPED
[INFO] olingo-odata2-ref ................................. SKIPPED
[INFO] olingo-odata2-fit ................................. SKIPPED
[INFO] olingo-odata2-ref-web ............................. SKIPPED
[INFO] olingo-odata2-jpa-processor ....................... SKIPPED
[INFO] olingo-odata2-jpa-processor-api ................... SKIPPED
[INFO] olingo-odata2-jpa-processor-core .................. SKIPPED
[INFO] olingo-odata2-jpa-processor-ref ................... SKIPPED
[INFO] olingo-odata2-jpa-processor-ref-web ............... SKIPPED
[INFO] olingo-odata2-annotation-processor ................ SKIPPED
[INFO] olingo-odata2-annotation-processor-api ............ SKIPPED
[INFO] olingo-odata2-annotation-processor-core ........... SKIPPED
[INFO] olingo-odata2-annotation-processor-ref ............ SKIPPED
[INFO] olingo-odata2-annotation-processor-ref-web ........ SKIPPED
[INFO] olingo-odata2-dist ................................ SKIPPED
[INFO] olingo-odata2-dist-lib ............................ SKIPPED
[INFO] olingo-odata2-dist-jpa ............................ SKIPPED
[INFO] olingo-odata2-dist-janos .......................... SKIPPED
[INFO] olingo-odata2-dist-ref ............................ SKIPPED
[INFO] olingo-odata2-dist-javadoc ........................ SKIPPED
[INFO] olingo-odata2-sample .............................. SKIPPED
[INFO] olingo-odata2-sample-cars-service-archetype ....... SKIPPED
[INFO] olingo-odata2-sample-cars-annotation-archetype .... SKIPPED
[INFO] olingo-odata2-sample-cars-jpa-archetype ........... SKIPPED
[INFO] ------------------------------------------------------------------------
[INFO] BUILD FAILURE
[INFO] ------------------------------------------------------------------------
[INFO] Total time: 6.782s
[INFO] Finished at: Fri Jun 12 21:24:45 UTC 2015
[INFO] Final Memory: 15M/104M
[INFO] ------------------------------------------------------------------------
[ERROR] Failed to execute goal org.apache.maven.plugins:maven-deploy-plugin:2.7:deploy (default-deploy) on project olingo-odata2-parent: Failed to retrieve remote metadata org.apache.olingo:olingo-odata2-parent:2.0.5-SNAPSHOT/maven-metadata.xml: Could not transfer metadata org.apache.olingo:olingo-odata2-parent:2.0.5-SNAPSHOT/maven-metadata.xml from/to apache.snapshots.https (https://repository.apache.org/content/repositories/snapshots): java.lang.RuntimeException: Could not generate DH keypair: Prime size must be multiple of 64, and can only range from 512 to 1024 (inclusive) -> [Help 1]
[ERROR] 
[ERROR] To see the full stack trace of the errors, re-run Maven with the -e switch.
[ERROR] Re-run Maven using the -X switch to enable full debug logging.
[ERROR] 
[ERROR] For more information about the errors and possible solutions, please read the following articles:
[ERROR] [Help 1] http://cwiki.apache.org/confluence/display/MAVEN/MojoExecutionException
Build step 'Invoke top-level Maven targets' marked build as failure

Build failed in Jenkins: olingo-odata2 #1144

Posted by Apache Jenkins Server <je...@builds.apache.org>.
See <https://builds.apache.org/job/olingo-odata2/1144/>

------------------------------------------
Started by timer
Building remotely on ubuntu3 (Ubuntu ubuntu legacy-ubuntu) in workspace <https://builds.apache.org/job/olingo-odata2/ws/>
 > git rev-parse --is-inside-work-tree # timeout=10
Fetching changes from the remote Git repository
 > git config remote.origin.url https://git-wip-us.apache.org/repos/asf/olingo-odata2.git # timeout=10
Fetching upstream changes from https://git-wip-us.apache.org/repos/asf/olingo-odata2.git
 > git --version # timeout=10
 > git fetch --tags --progress https://git-wip-us.apache.org/repos/asf/olingo-odata2.git +refs/heads/master:refs/remotes/origin/master
 > git rev-parse origin/master^{commit} # timeout=10
Checking out Revision 48f9e9319d26dc3104b525c20d2c94780aba59f9 (origin/master)
 > git config core.sparsecheckout # timeout=10
 > git checkout -f 48f9e9319d26dc3104b525c20d2c94780aba59f9
 > git rev-list 48f9e9319d26dc3104b525c20d2c94780aba59f9 # timeout=10
[olingo-odata2] $ /home/jenkins/tools/maven/apache-maven-3.0.4/bin/mvn clean deploy
[INFO] Scanning for projects...
[WARNING] 
[WARNING] Some problems were encountered while building the effective model for org.apache.olingo:olingo-odata2-testutil:jar:2.0.5-SNAPSHOT
[WARNING] 'dependencies.dependency.(groupId:artifactId:type:classifier)' must be unique: org.mockito:mockito-all:jar -> duplicate declaration of version ${mockito.version} @ line 109, column 17
[WARNING] 
[WARNING] It is highly recommended to fix these problems because they threaten the stability of your build.
[WARNING] 
[WARNING] For this reason, future Maven versions might no longer support building such malformed projects.
[WARNING] 
[INFO] ------------------------------------------------------------------------
[INFO] Reactor Build Order:
[INFO] 
[INFO] olingo-odata2-parent
[INFO] olingo-odata2-lib
[INFO] olingo-odata2-api
[INFO] olingo-odata2-api-annotation
[INFO] olingo-odata2-testutil
[INFO] olingo-odata2-core
[INFO] olingo-odata2-ref
[INFO] olingo-odata2-fit
[INFO] olingo-odata2-ref-web
[INFO] olingo-odata2-jpa-processor
[INFO] olingo-odata2-jpa-processor-api
[INFO] olingo-odata2-jpa-processor-core
[INFO] olingo-odata2-jpa-processor-ref
[INFO] olingo-odata2-jpa-processor-ref-web
[INFO] olingo-odata2-annotation-processor
[INFO] olingo-odata2-annotation-processor-api
[INFO] olingo-odata2-annotation-processor-core
[INFO] olingo-odata2-annotation-processor-ref
[INFO] olingo-odata2-annotation-processor-ref-web
[INFO] olingo-odata2-dist
[INFO] olingo-odata2-dist-lib
[INFO] olingo-odata2-dist-jpa
[INFO] olingo-odata2-dist-janos
[INFO] olingo-odata2-dist-ref
[INFO] olingo-odata2-dist-javadoc
[INFO] olingo-odata2-sample
[INFO] olingo-odata2-sample-cars-service-archetype
[INFO] olingo-odata2-sample-cars-annotation-archetype
[INFO] olingo-odata2-sample-cars-jpa-archetype
[INFO]                                                                         
[INFO] ------------------------------------------------------------------------
[INFO] Building olingo-odata2-parent 2.0.5-SNAPSHOT
[INFO] ------------------------------------------------------------------------
[INFO] 
[INFO] --- maven-clean-plugin:2.5:clean (default-clean) @ olingo-odata2-parent ---
[INFO] Deleting /x1/jenkins/jenkins-slave/workspace/olingo-odata2/target
[INFO] 
[INFO] --- buildnumber-maven-plugin:1.2:create (default) @ olingo-odata2-parent ---
[INFO] Checking for local modifications: skipped.
[INFO] Updating project files from SCM: skipped.
[INFO] Executing: /bin/sh -c cd /x1/jenkins/jenkins-slave/workspace/olingo-odata2 && svn --non-interactive info
[INFO] Working directory: /x1/jenkins/jenkins-slave/workspace/olingo-odata2
[INFO] Storing buildNumber: ? at timestamp: 2015-06-12T00:42:18+0000
[INFO] Executing: /bin/sh -c cd /x1/jenkins/jenkins-slave/workspace/olingo-odata2 && svn --non-interactive info
[INFO] Working directory: /x1/jenkins/jenkins-slave/workspace/olingo-odata2
[INFO] Storing buildScmBranch: UNKNOWN_BRANCH
[INFO] 
[INFO] --- maven-remote-resources-plugin:1.5:process (default) @ olingo-odata2-parent ---
[INFO] 
[INFO] --- maven-site-plugin:3.2:attach-descriptor (attach-descriptor) @ olingo-odata2-parent ---
[INFO] 
[INFO] --- maven-source-plugin:2.2.1:jar-no-fork (attach-sources) @ olingo-odata2-parent ---
[INFO] 
[INFO] --- maven-checkstyle-plugin:2.10:check (checkstyle) @ olingo-odata2-parent ---
[INFO] Starting audit...
Audit done.

[INFO] 
[INFO] --- maven-install-plugin:2.3.1:install (default-install) @ olingo-odata2-parent ---
[INFO] Installing /x1/jenkins/jenkins-slave/workspace/olingo-odata2/pom.xml to /home/jenkins/.m2/repository/org/apache/olingo/olingo-odata2-parent/2.0.5-SNAPSHOT/olingo-odata2-parent-2.0.5-SNAPSHOT.pom
[INFO] 
[INFO] --- maven-deploy-plugin:2.7:deploy (default-deploy) @ olingo-odata2-parent ---
Downloading: https://repository.apache.org/content/repositories/snapshots/org/apache/olingo/olingo-odata2-parent/2.0.5-SNAPSHOT/maven-metadata.xml

[WARNING] Could not transfer metadata org.apache.olingo:olingo-odata2-parent:2.0.5-SNAPSHOT/maven-metadata.xml from/to apache.snapshots.https (https://repository.apache.org/content/repositories/snapshots): java.lang.RuntimeException: Could not generate DH keypair
[INFO] ------------------------------------------------------------------------
[INFO] Reactor Summary:
[INFO] 
[INFO] olingo-odata2-parent .............................. FAILURE [5.777s]
[INFO] olingo-odata2-lib ................................. SKIPPED
[INFO] olingo-odata2-api ................................. SKIPPED
[INFO] olingo-odata2-api-annotation ...................... SKIPPED
[INFO] olingo-odata2-testutil ............................ SKIPPED
[INFO] olingo-odata2-core ................................ SKIPPED
[INFO] olingo-odata2-ref ................................. SKIPPED
[INFO] olingo-odata2-fit ................................. SKIPPED
[INFO] olingo-odata2-ref-web ............................. SKIPPED
[INFO] olingo-odata2-jpa-processor ....................... SKIPPED
[INFO] olingo-odata2-jpa-processor-api ................... SKIPPED
[INFO] olingo-odata2-jpa-processor-core .................. SKIPPED
[INFO] olingo-odata2-jpa-processor-ref ................... SKIPPED
[INFO] olingo-odata2-jpa-processor-ref-web ............... SKIPPED
[INFO] olingo-odata2-annotation-processor ................ SKIPPED
[INFO] olingo-odata2-annotation-processor-api ............ SKIPPED
[INFO] olingo-odata2-annotation-processor-core ........... SKIPPED
[INFO] olingo-odata2-annotation-processor-ref ............ SKIPPED
[INFO] olingo-odata2-annotation-processor-ref-web ........ SKIPPED
[INFO] olingo-odata2-dist ................................ SKIPPED
[INFO] olingo-odata2-dist-lib ............................ SKIPPED
[INFO] olingo-odata2-dist-jpa ............................ SKIPPED
[INFO] olingo-odata2-dist-janos .......................... SKIPPED
[INFO] olingo-odata2-dist-ref ............................ SKIPPED
[INFO] olingo-odata2-dist-javadoc ........................ SKIPPED
[INFO] olingo-odata2-sample .............................. SKIPPED
[INFO] olingo-odata2-sample-cars-service-archetype ....... SKIPPED
[INFO] olingo-odata2-sample-cars-annotation-archetype .... SKIPPED
[INFO] olingo-odata2-sample-cars-jpa-archetype ........... SKIPPED
[INFO] ------------------------------------------------------------------------
[INFO] BUILD FAILURE
[INFO] ------------------------------------------------------------------------
[INFO] Total time: 7.218s
[INFO] Finished at: Fri Jun 12 00:42:23 UTC 2015
[INFO] Final Memory: 15M/107M
[INFO] ------------------------------------------------------------------------
[ERROR] Failed to execute goal org.apache.maven.plugins:maven-deploy-plugin:2.7:deploy (default-deploy) on project olingo-odata2-parent: Failed to retrieve remote metadata org.apache.olingo:olingo-odata2-parent:2.0.5-SNAPSHOT/maven-metadata.xml: Could not transfer metadata org.apache.olingo:olingo-odata2-parent:2.0.5-SNAPSHOT/maven-metadata.xml from/to apache.snapshots.https (https://repository.apache.org/content/repositories/snapshots): java.lang.RuntimeException: Could not generate DH keypair: Prime size must be multiple of 64, and can only range from 512 to 1024 (inclusive) -> [Help 1]
[ERROR] 
[ERROR] To see the full stack trace of the errors, re-run Maven with the -e switch.
[ERROR] Re-run Maven using the -X switch to enable full debug logging.
[ERROR] 
[ERROR] For more information about the errors and possible solutions, please read the following articles:
[ERROR] [Help 1] http://cwiki.apache.org/confluence/display/MAVEN/MojoExecutionException
Build step 'Invoke top-level Maven targets' marked build as failure

Build failed in Jenkins: olingo-odata2 #1143

Posted by Apache Jenkins Server <je...@builds.apache.org>.
See <https://builds.apache.org/job/olingo-odata2/1143/>

------------------------------------------
Started by user mibo
Building remotely on ubuntu-4 (docker Ubuntu ubuntu4 ubuntu) in workspace <https://builds.apache.org/job/olingo-odata2/ws/>
 > git rev-parse --is-inside-work-tree # timeout=10
Fetching changes from the remote Git repository
 > git config remote.origin.url https://git-wip-us.apache.org/repos/asf/olingo-odata2.git # timeout=10
Fetching upstream changes from https://git-wip-us.apache.org/repos/asf/olingo-odata2.git
 > git --version # timeout=10
 > git fetch --tags --progress https://git-wip-us.apache.org/repos/asf/olingo-odata2.git +refs/heads/master:refs/remotes/origin/master
 > git rev-parse origin/master^{commit} # timeout=10
Checking out Revision 48f9e9319d26dc3104b525c20d2c94780aba59f9 (origin/master)
 > git config core.sparsecheckout # timeout=10
 > git checkout -f 48f9e9319d26dc3104b525c20d2c94780aba59f9
 > git rev-list 48f9e9319d26dc3104b525c20d2c94780aba59f9 # timeout=10
[olingo-odata2] $ /home/jenkins/tools/maven/apache-maven-3.0.4/bin/mvn clean deploy
[INFO] Scanning for projects...
[WARNING] 
[WARNING] Some problems were encountered while building the effective model for org.apache.olingo:olingo-odata2-testutil:jar:2.0.5-SNAPSHOT
[WARNING] 'dependencies.dependency.(groupId:artifactId:type:classifier)' must be unique: org.mockito:mockito-all:jar -> duplicate declaration of version ${mockito.version} @ line 109, column 17
[WARNING] 
[WARNING] It is highly recommended to fix these problems because they threaten the stability of your build.
[WARNING] 
[WARNING] For this reason, future Maven versions might no longer support building such malformed projects.
[WARNING] 
[INFO] ------------------------------------------------------------------------
[INFO] Reactor Build Order:
[INFO] 
[INFO] olingo-odata2-parent
[INFO] olingo-odata2-lib
[INFO] olingo-odata2-api
[INFO] olingo-odata2-api-annotation
[INFO] olingo-odata2-testutil
[INFO] olingo-odata2-core
[INFO] olingo-odata2-ref
[INFO] olingo-odata2-fit
[INFO] olingo-odata2-ref-web
[INFO] olingo-odata2-jpa-processor
[INFO] olingo-odata2-jpa-processor-api
[INFO] olingo-odata2-jpa-processor-core
[INFO] olingo-odata2-jpa-processor-ref
[INFO] olingo-odata2-jpa-processor-ref-web
[INFO] olingo-odata2-annotation-processor
[INFO] olingo-odata2-annotation-processor-api
[INFO] olingo-odata2-annotation-processor-core
[INFO] olingo-odata2-annotation-processor-ref
[INFO] olingo-odata2-annotation-processor-ref-web
[INFO] olingo-odata2-dist
[INFO] olingo-odata2-dist-lib
[INFO] olingo-odata2-dist-jpa
[INFO] olingo-odata2-dist-janos
[INFO] olingo-odata2-dist-ref
[INFO] olingo-odata2-dist-javadoc
[INFO] olingo-odata2-sample
[INFO] olingo-odata2-sample-cars-service-archetype
[INFO] olingo-odata2-sample-cars-annotation-archetype
[INFO] olingo-odata2-sample-cars-jpa-archetype
[INFO]                                                                         
[INFO] ------------------------------------------------------------------------
[INFO] Building olingo-odata2-parent 2.0.5-SNAPSHOT
[INFO] ------------------------------------------------------------------------
[INFO] 
[INFO] --- maven-clean-plugin:2.5:clean (default-clean) @ olingo-odata2-parent ---
[INFO] Deleting <https://builds.apache.org/job/olingo-odata2/ws/target>
[INFO] 
[INFO] --- buildnumber-maven-plugin:1.2:create (default) @ olingo-odata2-parent ---
[INFO] Checking for local modifications: skipped.
[INFO] Updating project files from SCM: skipped.
[INFO] Executing: /bin/sh -c cd <https://builds.apache.org/job/olingo-odata2/ws/> && svn --non-interactive info
[INFO] Working directory: <https://builds.apache.org/job/olingo-odata2/ws/>
[INFO] Storing buildNumber: ? at timestamp: 2015-06-11T04:44:15+0000
[INFO] Executing: /bin/sh -c cd <https://builds.apache.org/job/olingo-odata2/ws/> && svn --non-interactive info
[INFO] Working directory: <https://builds.apache.org/job/olingo-odata2/ws/>
[INFO] Storing buildScmBranch: UNKNOWN_BRANCH
[INFO] 
[INFO] --- maven-remote-resources-plugin:1.5:process (default) @ olingo-odata2-parent ---
[INFO] 
[INFO] --- maven-site-plugin:3.2:attach-descriptor (attach-descriptor) @ olingo-odata2-parent ---
[INFO] 
[INFO] --- maven-source-plugin:2.2.1:jar-no-fork (attach-sources) @ olingo-odata2-parent ---
[INFO] 
[INFO] --- maven-checkstyle-plugin:2.10:check (checkstyle) @ olingo-odata2-parent ---
[INFO] Starting audit...
Audit done.

[INFO] 
[INFO] --- maven-install-plugin:2.3.1:install (default-install) @ olingo-odata2-parent ---
[INFO] Installing <https://builds.apache.org/job/olingo-odata2/ws/pom.xml> to /home/jenkins/.m2/repository/org/apache/olingo/olingo-odata2-parent/2.0.5-SNAPSHOT/olingo-odata2-parent-2.0.5-SNAPSHOT.pom
[INFO] 
[INFO] --- maven-deploy-plugin:2.7:deploy (default-deploy) @ olingo-odata2-parent ---
Downloading: https://repository.apache.org/content/repositories/snapshots/org/apache/olingo/olingo-odata2-parent/2.0.5-SNAPSHOT/maven-metadata.xml

[WARNING] Could not transfer metadata org.apache.olingo:olingo-odata2-parent:2.0.5-SNAPSHOT/maven-metadata.xml from/to apache.snapshots.https (https://repository.apache.org/content/repositories/snapshots): java.lang.RuntimeException: Could not generate DH keypair
[INFO] ------------------------------------------------------------------------
[INFO] Reactor Summary:
[INFO] 
[INFO] olingo-odata2-parent .............................. FAILURE [4.562s]
[INFO] olingo-odata2-lib ................................. SKIPPED
[INFO] olingo-odata2-api ................................. SKIPPED
[INFO] olingo-odata2-api-annotation ...................... SKIPPED
[INFO] olingo-odata2-testutil ............................ SKIPPED
[INFO] olingo-odata2-core ................................ SKIPPED
[INFO] olingo-odata2-ref ................................. SKIPPED
[INFO] olingo-odata2-fit ................................. SKIPPED
[INFO] olingo-odata2-ref-web ............................. SKIPPED
[INFO] olingo-odata2-jpa-processor ....................... SKIPPED
[INFO] olingo-odata2-jpa-processor-api ................... SKIPPED
[INFO] olingo-odata2-jpa-processor-core .................. SKIPPED
[INFO] olingo-odata2-jpa-processor-ref ................... SKIPPED
[INFO] olingo-odata2-jpa-processor-ref-web ............... SKIPPED
[INFO] olingo-odata2-annotation-processor ................ SKIPPED
[INFO] olingo-odata2-annotation-processor-api ............ SKIPPED
[INFO] olingo-odata2-annotation-processor-core ........... SKIPPED
[INFO] olingo-odata2-annotation-processor-ref ............ SKIPPED
[INFO] olingo-odata2-annotation-processor-ref-web ........ SKIPPED
[INFO] olingo-odata2-dist ................................ SKIPPED
[INFO] olingo-odata2-dist-lib ............................ SKIPPED
[INFO] olingo-odata2-dist-jpa ............................ SKIPPED
[INFO] olingo-odata2-dist-janos .......................... SKIPPED
[INFO] olingo-odata2-dist-ref ............................ SKIPPED
[INFO] olingo-odata2-dist-javadoc ........................ SKIPPED
[INFO] olingo-odata2-sample .............................. SKIPPED
[INFO] olingo-odata2-sample-cars-service-archetype ....... SKIPPED
[INFO] olingo-odata2-sample-cars-annotation-archetype .... SKIPPED
[INFO] olingo-odata2-sample-cars-jpa-archetype ........... SKIPPED
[INFO] ------------------------------------------------------------------------
[INFO] BUILD FAILURE
[INFO] ------------------------------------------------------------------------
[INFO] Total time: 5.826s
[INFO] Finished at: Thu Jun 11 04:44:19 UTC 2015
[INFO] Final Memory: 17M/178M
[INFO] ------------------------------------------------------------------------
[ERROR] Failed to execute goal org.apache.maven.plugins:maven-deploy-plugin:2.7:deploy (default-deploy) on project olingo-odata2-parent: Failed to retrieve remote metadata org.apache.olingo:olingo-odata2-parent:2.0.5-SNAPSHOT/maven-metadata.xml: Could not transfer metadata org.apache.olingo:olingo-odata2-parent:2.0.5-SNAPSHOT/maven-metadata.xml from/to apache.snapshots.https (https://repository.apache.org/content/repositories/snapshots): java.lang.RuntimeException: Could not generate DH keypair: Prime size must be multiple of 64, and can only range from 512 to 1024 (inclusive) -> [Help 1]
[ERROR] 
[ERROR] To see the full stack trace of the errors, re-run Maven with the -e switch.
[ERROR] Re-run Maven using the -X switch to enable full debug logging.
[ERROR] 
[ERROR] For more information about the errors and possible solutions, please read the following articles:
[ERROR] [Help 1] http://cwiki.apache.org/confluence/display/MAVEN/MojoExecutionException
Build step 'Invoke top-level Maven targets' marked build as failure