You are viewing a plain text version of this content. The canonical link for it is here.
Posted to issues@ozone.apache.org by "Attila Doroszlai (Jira)" <ji...@apache.org> on 2024/03/29 18:46:00 UTC
[jira] [Updated] (HDDS-10616) testUpdateDeepDirectoryStructureToRemote failure in OBJECT_STORE bucket
[ https://issues.apache.org/jira/browse/HDDS-10616?page=com.atlassian.jira.plugin.system.issuetabpanels:all-tabpanel ]
Attila Doroszlai updated HDDS-10616:
------------------------------------
Description:
{code}
Tests run: 13, Failures: 1, Errors: 0, Skipped: 1, Time elapsed: 22.65 s <<< FAILURE! - in org.apache.hadoop.fs.contract.s3a.ITestS3AContractDistCp
testUpdateDeepDirectoryStructureToRemote(org.apache.hadoop.fs.contract.s3a.ITestS3AContractDistCp) Time elapsed: 2.375 s <<< FAILURE!
java.lang.AssertionError: Files Copied value 2 above maximum 1
at org.junit.Assert.fail(Assert.java:89)
at org.junit.Assert.assertTrue(Assert.java:42)
at org.apache.hadoop.tools.contract.AbstractContractDistCpTest.assertCounterInRange(AbstractContractDistCpTest.java:294)
at org.apache.hadoop.tools.contract.AbstractContractDistCpTest.distCpUpdateDeepDirectoryStructure(AbstractContractDistCpTest.java:334)
at org.apache.hadoop.tools.contract.AbstractContractDistCpTest.testUpdateDeepDirectoryStructureToRemote(AbstractContractDistCpTest.java:259)
{code}
was:
{code}
[ERROR] Tests run: 13, Failures: 1, Errors: 0, Skipped: 1, Time elapsed: 22.65 s <<< FAILURE! - in org.apache.hadoop.fs.contract.s3a.ITestS3AContractDistCp
[ERROR] testUpdateDeepDirectoryStructureToRemote(org.apache.hadoop.fs.contract.s3a.ITestS3AContractDistCp) Time elapsed: 2.375 s <<< FAILURE!
java.lang.AssertionError: Files Copied value 2 above maximum 1
at org.junit.Assert.fail(Assert.java:89)
at org.junit.Assert.assertTrue(Assert.java:42)
at org.apache.hadoop.tools.contract.AbstractContractDistCpTest.assertCounterInRange(AbstractContractDistCpTest.java:294)
at org.apache.hadoop.tools.contract.AbstractContractDistCpTest.distCpUpdateDeepDirectoryStructure(AbstractContractDistCpTest.java:334)
at org.apache.hadoop.tools.contract.AbstractContractDistCpTest.testUpdateDeepDirectoryStructureToRemote(AbstractContractDistCpTest.java:259)
{code}
> testUpdateDeepDirectoryStructureToRemote failure in OBJECT_STORE bucket
> -----------------------------------------------------------------------
>
> Key: HDDS-10616
> URL: https://issues.apache.org/jira/browse/HDDS-10616
> Project: Apache Ozone
> Issue Type: Sub-task
> Components: S3
> Reporter: Attila Doroszlai
> Priority: Major
>
> {code}
> Tests run: 13, Failures: 1, Errors: 0, Skipped: 1, Time elapsed: 22.65 s <<< FAILURE! - in org.apache.hadoop.fs.contract.s3a.ITestS3AContractDistCp
> testUpdateDeepDirectoryStructureToRemote(org.apache.hadoop.fs.contract.s3a.ITestS3AContractDistCp) Time elapsed: 2.375 s <<< FAILURE!
> java.lang.AssertionError: Files Copied value 2 above maximum 1
> at org.junit.Assert.fail(Assert.java:89)
> at org.junit.Assert.assertTrue(Assert.java:42)
> at org.apache.hadoop.tools.contract.AbstractContractDistCpTest.assertCounterInRange(AbstractContractDistCpTest.java:294)
> at org.apache.hadoop.tools.contract.AbstractContractDistCpTest.distCpUpdateDeepDirectoryStructure(AbstractContractDistCpTest.java:334)
> at org.apache.hadoop.tools.contract.AbstractContractDistCpTest.testUpdateDeepDirectoryStructureToRemote(AbstractContractDistCpTest.java:259)
> {code}
--
This message was sent by Atlassian Jira
(v8.20.10#820010)
---------------------------------------------------------------------
To unsubscribe, e-mail: issues-unsubscribe@ozone.apache.org
For additional commands, e-mail: issues-help@ozone.apache.org