You are viewing a plain text version of this content. The canonical link for it is here.
Posted to dev@oodt.apache.org by Apache Jenkins Server <je...@builds.apache.org> on 2012/05/03 03:56:51 UTC
Build failed in Jenkins: oodt-trunk » CAS PGE Adaptor Framework #442
See <https://builds.apache.org/job/oodt-trunk/org.apache.oodt$cas-pge/442/>
------------------------------------------
[INFO] ------------------------------------------------------------------------
[INFO] Building CAS PGE Adaptor Framework
[INFO] task-segment: [install]
[INFO] ------------------------------------------------------------------------
[INFO] [remote-resources:process {execution: default}]
Downloading: http://repo1.maven.org/maven2/net/sf/saxon/saxon-dom/8.7/saxon-dom-8.7.pom
Downloading: http://repo1.maven.org/maven2/net/sf/saxon/saxon/8.7/saxon-8.7.pom
Downloading: http://repo1.maven.org/maven2/net/sf/saxon/saxon-dom/8.7/saxon-dom-8.7.jar
Downloading: http://repo1.maven.org/maven2/net/sf/saxon/saxon/8.7/saxon-8.7.jar
[INFO] [resources:resources {execution: default-resources}]
[INFO] Using 'UTF-8' encoding to copy filtered resources.
[INFO] Copying 14 resources
[INFO] Copying 3 resources
[INFO] [compiler:compile {execution: default-compile}]
[INFO] Compiling 20 source files to <https://builds.apache.org/job/oodt-trunk/org.apache.oodt$cas-pge/ws/target/classes>
[INFO] [resources:testResources {execution: default-testResources}]
[INFO] Using 'UTF-8' encoding to copy filtered resources.
[INFO] skip non existing resourceDirectory <https://builds.apache.org/job/oodt-trunk/org.apache.oodt$cas-pge/ws/src/test/resources>
[INFO] Copying 3 resources
[INFO] [compiler:testCompile {execution: default-testCompile}]
[INFO] Compiling 8 source files to <https://builds.apache.org/job/oodt-trunk/org.apache.oodt$cas-pge/ws/target/test-classes>
[INFO] -------------------------------------------------------------
[ERROR] COMPILATION ERROR :
[INFO] -------------------------------------------------------------
[ERROR] <https://builds.apache.org/job/oodt-trunk/org.apache.oodt$cas-pge/ws/src/test/org/apache/oodt/cas/pge/staging/TestFileStager.java>:[131,51] cannot find symbol
symbol : class IArgumentMatcher
location: class org.apache.oodt.cas.pge.staging.TestFileStager
[ERROR] <https://builds.apache.org/job/oodt-trunk/org.apache.oodt$cas-pge/ws/src/test/org/apache/oodt/cas/pge/staging/TestFileStager.java>:[139,6] method does not override or implement a method from a supertype
[ERROR] <https://builds.apache.org/job/oodt-trunk/org.apache.oodt$cas-pge/ws/src/test/org/apache/oodt/cas/pge/staging/TestFileStager.java>:[147,6] method does not override or implement a method from a supertype
[ERROR] <https://builds.apache.org/job/oodt-trunk/org.apache.oodt$cas-pge/ws/src/test/org/apache/oodt/cas/pge/staging/TestFileStager.java>:[156,17] reportMatcher(org.easymock.IArgumentMatcher) in org.easymock.EasyMock cannot be applied to (org.apache.oodt.cas.pge.staging.TestFileStager.ProductIdMatcher)
[INFO] 4 errors
[INFO] -------------------------------------------------------------
[JENKINS] Archiving <https://builds.apache.org/job/oodt-trunk/org.apache.oodt$cas-pge/ws/pom.xml> to /home/hudson/hudson/jobs/oodt-trunk/modules/org.apache.oodt$cas-pge/builds/2012-05-03_00-46-00/archive/org.apache.oodt/cas-pge/0.4-SNAPSHOT/cas-pge-0.4-SNAPSHOT.pom
[INFO] ------------------------------------------------------------------------
[ERROR] BUILD FAILURE
[INFO] ------------------------------------------------------------------------
[INFO] Compilation failure
<https://builds.apache.org/job/oodt-trunk/org.apache.oodt$cas-pge/ws/src/test/org/apache/oodt/cas/pge/staging/TestFileStager.java>:[131,51] cannot find symbol
symbol : class IArgumentMatcher
location: class org.apache.oodt.cas.pge.staging.TestFileStager
<https://builds.apache.org/job/oodt-trunk/org.apache.oodt$cas-pge/ws/src/test/org/apache/oodt/cas/pge/staging/TestFileStager.java>:[139,6] method does not override or implement a method from a supertype
<https://builds.apache.org/job/oodt-trunk/org.apache.oodt$cas-pge/ws/src/test/org/apache/oodt/cas/pge/staging/TestFileStager.java>:[147,6] method does not override or implement a method from a supertype
<https://builds.apache.org/job/oodt-trunk/org.apache.oodt$cas-pge/ws/src/test/org/apache/oodt/cas/pge/staging/TestFileStager.java>:[156,17] reportMatcher(org.easymock.IArgumentMatcher) in org.easymock.EasyMock cannot be applied to (org.apache.oodt.cas.pge.staging.TestFileStager.ProductIdMatcher)
[INFO] ------------------------------------------------------------------------
[INFO] For more information, run Maven with the -e switch
[INFO] ------------------------------------------------------------------------
[INFO] Total time: 64 minutes 16 seconds
[INFO] Finished at: Thu May 03 01:56:43 UTC 2012
[INFO] Final Memory: 117M/358M
[INFO] ------------------------------------------------------------------------
Waiting for Jenkins to finish collecting data
Build failed in Jenkins: oodt-trunk » CAS PGE Adaptor Framework #448
Posted by Apache Jenkins Server <je...@builds.apache.org>.
See <https://builds.apache.org/job/oodt-trunk/org.apache.oodt$cas-pge/448/>
------------------------------------------
[INFO] ------------------------------------------------------------------------
[INFO] Building CAS PGE Adaptor Framework
[INFO] task-segment: [install]
[INFO] ------------------------------------------------------------------------
[INFO] [remote-resources:process {execution: default}]
Downloading: http://repo1.maven.org/maven2/net/sf/saxon/saxon-dom/8.7/saxon-dom-8.7.pom
Downloading: http://repo1.maven.org/maven2/net/sf/saxon/saxon/8.7/saxon-8.7.pom
Downloading: http://repo1.maven.org/maven2/net/sf/saxon/saxon-dom/8.7/saxon-dom-8.7.jar
Downloading: http://repo1.maven.org/maven2/net/sf/saxon/saxon/8.7/saxon-8.7.jar
[INFO] [resources:resources {execution: default-resources}]
[INFO] Using 'UTF-8' encoding to copy filtered resources.
[INFO] Copying 14 resources
[INFO] Copying 3 resources
[INFO] [compiler:compile {execution: default-compile}]
[INFO] Compiling 20 source files to <https://builds.apache.org/job/oodt-trunk/org.apache.oodt$cas-pge/ws/target/classes>
[INFO] [resources:testResources {execution: default-testResources}]
[INFO] Using 'UTF-8' encoding to copy filtered resources.
[INFO] skip non existing resourceDirectory <https://builds.apache.org/job/oodt-trunk/org.apache.oodt$cas-pge/ws/src/test/resources>
[INFO] Copying 3 resources
[INFO] [compiler:testCompile {execution: default-testCompile}]
[INFO] Compiling 8 source files to <https://builds.apache.org/job/oodt-trunk/org.apache.oodt$cas-pge/ws/target/test-classes>
[INFO] -------------------------------------------------------------
[ERROR] COMPILATION ERROR :
[INFO] -------------------------------------------------------------
[ERROR] <https://builds.apache.org/job/oodt-trunk/org.apache.oodt$cas-pge/ws/src/test/org/apache/oodt/cas/pge/staging/TestFileStager.java>:[131,51] cannot find symbol
symbol : class IArgumentMatcher
location: class org.apache.oodt.cas.pge.staging.TestFileStager
[ERROR] <https://builds.apache.org/job/oodt-trunk/org.apache.oodt$cas-pge/ws/src/test/org/apache/oodt/cas/pge/staging/TestFileStager.java>:[139,6] method does not override or implement a method from a supertype
[ERROR] <https://builds.apache.org/job/oodt-trunk/org.apache.oodt$cas-pge/ws/src/test/org/apache/oodt/cas/pge/staging/TestFileStager.java>:[147,6] method does not override or implement a method from a supertype
[ERROR] <https://builds.apache.org/job/oodt-trunk/org.apache.oodt$cas-pge/ws/src/test/org/apache/oodt/cas/pge/staging/TestFileStager.java>:[156,17] reportMatcher(org.easymock.IArgumentMatcher) in org.easymock.EasyMock cannot be applied to (org.apache.oodt.cas.pge.staging.TestFileStager.ProductIdMatcher)
[INFO] 4 errors
[INFO] -------------------------------------------------------------
[JENKINS] Archiving <https://builds.apache.org/job/oodt-trunk/org.apache.oodt$cas-pge/ws/pom.xml> to /home/hudson/hudson/jobs/oodt-trunk/modules/org.apache.oodt$cas-pge/builds/2012-05-07_22-18-12/archive/org.apache.oodt/cas-pge/0.4-SNAPSHOT/cas-pge-0.4-SNAPSHOT.pom
[INFO] ------------------------------------------------------------------------
[ERROR] BUILD FAILURE
[INFO] ------------------------------------------------------------------------
[INFO] Compilation failure
<https://builds.apache.org/job/oodt-trunk/org.apache.oodt$cas-pge/ws/src/test/org/apache/oodt/cas/pge/staging/TestFileStager.java>:[131,51] cannot find symbol
symbol : class IArgumentMatcher
location: class org.apache.oodt.cas.pge.staging.TestFileStager
<https://builds.apache.org/job/oodt-trunk/org.apache.oodt$cas-pge/ws/src/test/org/apache/oodt/cas/pge/staging/TestFileStager.java>:[139,6] method does not override or implement a method from a supertype
<https://builds.apache.org/job/oodt-trunk/org.apache.oodt$cas-pge/ws/src/test/org/apache/oodt/cas/pge/staging/TestFileStager.java>:[147,6] method does not override or implement a method from a supertype
<https://builds.apache.org/job/oodt-trunk/org.apache.oodt$cas-pge/ws/src/test/org/apache/oodt/cas/pge/staging/TestFileStager.java>:[156,17] reportMatcher(org.easymock.IArgumentMatcher) in org.easymock.EasyMock cannot be applied to (org.apache.oodt.cas.pge.staging.TestFileStager.ProductIdMatcher)
[INFO] ------------------------------------------------------------------------
[INFO] For more information, run Maven with the -e switch
[INFO] ------------------------------------------------------------------------
[INFO] Total time: 34 minutes
[INFO] Finished at: Mon May 07 22:52:40 UTC 2012
[INFO] Final Memory: 104M/360M
[INFO] ------------------------------------------------------------------------
Build failed in Jenkins: oodt-trunk » CAS PGE Adaptor Framework #447
Posted by Apache Jenkins Server <je...@builds.apache.org>.
See <https://builds.apache.org/job/oodt-trunk/org.apache.oodt$cas-pge/447/>
------------------------------------------
[INFO] ------------------------------------------------------------------------
[INFO] Building CAS PGE Adaptor Framework
[INFO] task-segment: [install]
[INFO] ------------------------------------------------------------------------
[INFO] [remote-resources:process {execution: default}]
Downloading: http://repo1.maven.org/maven2/net/sf/saxon/saxon-dom/8.7/saxon-dom-8.7.pom
Downloading: http://repo1.maven.org/maven2/net/sf/saxon/saxon/8.7/saxon-8.7.pom
Downloading: http://repo1.maven.org/maven2/net/sf/saxon/saxon-dom/8.7/saxon-dom-8.7.jar
Downloading: http://repo1.maven.org/maven2/net/sf/saxon/saxon/8.7/saxon-8.7.jar
[INFO] [resources:resources {execution: default-resources}]
[INFO] Using 'UTF-8' encoding to copy filtered resources.
[INFO] Copying 14 resources
[INFO] Copying 3 resources
[INFO] [compiler:compile {execution: default-compile}]
[INFO] Compiling 20 source files to <https://builds.apache.org/job/oodt-trunk/org.apache.oodt$cas-pge/ws/target/classes>
[INFO] [resources:testResources {execution: default-testResources}]
[INFO] Using 'UTF-8' encoding to copy filtered resources.
[INFO] skip non existing resourceDirectory <https://builds.apache.org/job/oodt-trunk/org.apache.oodt$cas-pge/ws/src/test/resources>
[INFO] Copying 3 resources
[INFO] [compiler:testCompile {execution: default-testCompile}]
[INFO] Compiling 8 source files to <https://builds.apache.org/job/oodt-trunk/org.apache.oodt$cas-pge/ws/target/test-classes>
[INFO] -------------------------------------------------------------
[ERROR] COMPILATION ERROR :
[INFO] -------------------------------------------------------------
[ERROR] <https://builds.apache.org/job/oodt-trunk/org.apache.oodt$cas-pge/ws/src/test/org/apache/oodt/cas/pge/staging/TestFileStager.java>:[131,51] cannot find symbol
symbol : class IArgumentMatcher
location: class org.apache.oodt.cas.pge.staging.TestFileStager
[ERROR] <https://builds.apache.org/job/oodt-trunk/org.apache.oodt$cas-pge/ws/src/test/org/apache/oodt/cas/pge/staging/TestFileStager.java>:[139,6] method does not override or implement a method from a supertype
[ERROR] <https://builds.apache.org/job/oodt-trunk/org.apache.oodt$cas-pge/ws/src/test/org/apache/oodt/cas/pge/staging/TestFileStager.java>:[147,6] method does not override or implement a method from a supertype
[ERROR] <https://builds.apache.org/job/oodt-trunk/org.apache.oodt$cas-pge/ws/src/test/org/apache/oodt/cas/pge/staging/TestFileStager.java>:[156,17] reportMatcher(org.easymock.IArgumentMatcher) in org.easymock.EasyMock cannot be applied to (org.apache.oodt.cas.pge.staging.TestFileStager.ProductIdMatcher)
[INFO] 4 errors
[INFO] -------------------------------------------------------------
[JENKINS] Archiving <https://builds.apache.org/job/oodt-trunk/org.apache.oodt$cas-pge/ws/pom.xml> to /home/hudson/hudson/jobs/oodt-trunk/modules/org.apache.oodt$cas-pge/builds/2012-05-07_00-17-03/archive/org.apache.oodt/cas-pge/0.4-SNAPSHOT/cas-pge-0.4-SNAPSHOT.pom
[INFO] ------------------------------------------------------------------------
[ERROR] BUILD FAILURE
[INFO] ------------------------------------------------------------------------
[INFO] Compilation failure
<https://builds.apache.org/job/oodt-trunk/org.apache.oodt$cas-pge/ws/src/test/org/apache/oodt/cas/pge/staging/TestFileStager.java>:[131,51] cannot find symbol
symbol : class IArgumentMatcher
location: class org.apache.oodt.cas.pge.staging.TestFileStager
<https://builds.apache.org/job/oodt-trunk/org.apache.oodt$cas-pge/ws/src/test/org/apache/oodt/cas/pge/staging/TestFileStager.java>:[139,6] method does not override or implement a method from a supertype
<https://builds.apache.org/job/oodt-trunk/org.apache.oodt$cas-pge/ws/src/test/org/apache/oodt/cas/pge/staging/TestFileStager.java>:[147,6] method does not override or implement a method from a supertype
<https://builds.apache.org/job/oodt-trunk/org.apache.oodt$cas-pge/ws/src/test/org/apache/oodt/cas/pge/staging/TestFileStager.java>:[156,17] reportMatcher(org.easymock.IArgumentMatcher) in org.easymock.EasyMock cannot be applied to (org.apache.oodt.cas.pge.staging.TestFileStager.ProductIdMatcher)
[INFO] ------------------------------------------------------------------------
[INFO] For more information, run Maven with the -e switch
[INFO] ------------------------------------------------------------------------
[INFO] Total time: 18 minutes 2 seconds
[INFO] Finished at: Mon May 07 00:35:17 UTC 2012
[INFO] Final Memory: 119M/370M
[INFO] ------------------------------------------------------------------------
Build failed in Jenkins: oodt-trunk » CAS PGE Adaptor Framework #446
Posted by Apache Jenkins Server <je...@builds.apache.org>.
See <https://builds.apache.org/job/oodt-trunk/org.apache.oodt$cas-pge/446/>
------------------------------------------
[INFO] ------------------------------------------------------------------------
[INFO] Building CAS PGE Adaptor Framework
[INFO] task-segment: [install]
[INFO] ------------------------------------------------------------------------
[INFO] [remote-resources:process {execution: default}]
Downloading: http://repo1.maven.org/maven2/net/sf/saxon/saxon-dom/8.7/saxon-dom-8.7.pom
Downloading: http://repo1.maven.org/maven2/net/sf/saxon/saxon/8.7/saxon-8.7.pom
Downloading: http://repo1.maven.org/maven2/net/sf/saxon/saxon-dom/8.7/saxon-dom-8.7.jar
Downloading: http://repo1.maven.org/maven2/net/sf/saxon/saxon/8.7/saxon-8.7.jar
[INFO] [resources:resources {execution: default-resources}]
[INFO] Using 'UTF-8' encoding to copy filtered resources.
[INFO] Copying 14 resources
[INFO] Copying 3 resources
[INFO] [compiler:compile {execution: default-compile}]
[INFO] Compiling 20 source files to <https://builds.apache.org/job/oodt-trunk/org.apache.oodt$cas-pge/ws/target/classes>
[INFO] [resources:testResources {execution: default-testResources}]
[INFO] Using 'UTF-8' encoding to copy filtered resources.
[INFO] skip non existing resourceDirectory <https://builds.apache.org/job/oodt-trunk/org.apache.oodt$cas-pge/ws/src/test/resources>
[INFO] Copying 3 resources
[INFO] [compiler:testCompile {execution: default-testCompile}]
[INFO] Compiling 8 source files to <https://builds.apache.org/job/oodt-trunk/org.apache.oodt$cas-pge/ws/target/test-classes>
[INFO] -------------------------------------------------------------
[ERROR] COMPILATION ERROR :
[INFO] -------------------------------------------------------------
[ERROR] <https://builds.apache.org/job/oodt-trunk/org.apache.oodt$cas-pge/ws/src/test/org/apache/oodt/cas/pge/staging/TestFileStager.java>:[131,51] cannot find symbol
symbol : class IArgumentMatcher
location: class org.apache.oodt.cas.pge.staging.TestFileStager
[ERROR] <https://builds.apache.org/job/oodt-trunk/org.apache.oodt$cas-pge/ws/src/test/org/apache/oodt/cas/pge/staging/TestFileStager.java>:[139,6] method does not override or implement a method from a supertype
[ERROR] <https://builds.apache.org/job/oodt-trunk/org.apache.oodt$cas-pge/ws/src/test/org/apache/oodt/cas/pge/staging/TestFileStager.java>:[147,6] method does not override or implement a method from a supertype
[ERROR] <https://builds.apache.org/job/oodt-trunk/org.apache.oodt$cas-pge/ws/src/test/org/apache/oodt/cas/pge/staging/TestFileStager.java>:[156,17] reportMatcher(org.easymock.IArgumentMatcher) in org.easymock.EasyMock cannot be applied to (org.apache.oodt.cas.pge.staging.TestFileStager.ProductIdMatcher)
[INFO] 4 errors
[INFO] -------------------------------------------------------------
[JENKINS] Archiving <https://builds.apache.org/job/oodt-trunk/org.apache.oodt$cas-pge/ws/pom.xml> to /home/hudson/hudson/jobs/oodt-trunk/modules/org.apache.oodt$cas-pge/builds/2012-05-06_00-38-16/archive/org.apache.oodt/cas-pge/0.4-SNAPSHOT/cas-pge-0.4-SNAPSHOT.pom
[INFO] ------------------------------------------------------------------------
[ERROR] BUILD FAILURE
[INFO] ------------------------------------------------------------------------
[INFO] Compilation failure
<https://builds.apache.org/job/oodt-trunk/org.apache.oodt$cas-pge/ws/src/test/org/apache/oodt/cas/pge/staging/TestFileStager.java>:[131,51] cannot find symbol
symbol : class IArgumentMatcher
location: class org.apache.oodt.cas.pge.staging.TestFileStager
<https://builds.apache.org/job/oodt-trunk/org.apache.oodt$cas-pge/ws/src/test/org/apache/oodt/cas/pge/staging/TestFileStager.java>:[139,6] method does not override or implement a method from a supertype
<https://builds.apache.org/job/oodt-trunk/org.apache.oodt$cas-pge/ws/src/test/org/apache/oodt/cas/pge/staging/TestFileStager.java>:[147,6] method does not override or implement a method from a supertype
<https://builds.apache.org/job/oodt-trunk/org.apache.oodt$cas-pge/ws/src/test/org/apache/oodt/cas/pge/staging/TestFileStager.java>:[156,17] reportMatcher(org.easymock.IArgumentMatcher) in org.easymock.EasyMock cannot be applied to (org.apache.oodt.cas.pge.staging.TestFileStager.ProductIdMatcher)
[INFO] ------------------------------------------------------------------------
[INFO] For more information, run Maven with the -e switch
[INFO] ------------------------------------------------------------------------
[INFO] Total time: 30 minutes 7 seconds
[INFO] Finished at: Sun May 06 01:08:55 UTC 2012
[INFO] Final Memory: 120M/252M
[INFO] ------------------------------------------------------------------------
Build failed in Jenkins: oodt-trunk » CAS PGE Adaptor Framework #445
Posted by Apache Jenkins Server <je...@builds.apache.org>.
See <https://builds.apache.org/job/oodt-trunk/org.apache.oodt$cas-pge/445/>
------------------------------------------
[INFO] ------------------------------------------------------------------------
[INFO] Building CAS PGE Adaptor Framework
[INFO] task-segment: [install]
[INFO] ------------------------------------------------------------------------
[INFO] [remote-resources:process {execution: default}]
Downloading: http://repo1.maven.org/maven2/net/sf/saxon/saxon-dom/8.7/saxon-dom-8.7.pom
Downloading: http://repo1.maven.org/maven2/net/sf/saxon/saxon/8.7/saxon-8.7.pom
Downloading: http://repo1.maven.org/maven2/net/sf/saxon/saxon-dom/8.7/saxon-dom-8.7.jar
Downloading: http://repo1.maven.org/maven2/net/sf/saxon/saxon/8.7/saxon-8.7.jar
[INFO] [resources:resources {execution: default-resources}]
[INFO] Using 'UTF-8' encoding to copy filtered resources.
[INFO] Copying 14 resources
[INFO] Copying 3 resources
[INFO] [compiler:compile {execution: default-compile}]
[INFO] Compiling 20 source files to <https://builds.apache.org/job/oodt-trunk/org.apache.oodt$cas-pge/ws/target/classes>
[INFO] [resources:testResources {execution: default-testResources}]
[INFO] Using 'UTF-8' encoding to copy filtered resources.
[INFO] skip non existing resourceDirectory <https://builds.apache.org/job/oodt-trunk/org.apache.oodt$cas-pge/ws/src/test/resources>
[INFO] Copying 3 resources
[INFO] [compiler:testCompile {execution: default-testCompile}]
[INFO] Compiling 8 source files to <https://builds.apache.org/job/oodt-trunk/org.apache.oodt$cas-pge/ws/target/test-classes>
[INFO] -------------------------------------------------------------
[ERROR] COMPILATION ERROR :
[INFO] -------------------------------------------------------------
[ERROR] <https://builds.apache.org/job/oodt-trunk/org.apache.oodt$cas-pge/ws/src/test/org/apache/oodt/cas/pge/staging/TestFileStager.java>:[131,51] cannot find symbol
symbol : class IArgumentMatcher
location: class org.apache.oodt.cas.pge.staging.TestFileStager
[ERROR] <https://builds.apache.org/job/oodt-trunk/org.apache.oodt$cas-pge/ws/src/test/org/apache/oodt/cas/pge/staging/TestFileStager.java>:[139,6] method does not override or implement a method from a supertype
[ERROR] <https://builds.apache.org/job/oodt-trunk/org.apache.oodt$cas-pge/ws/src/test/org/apache/oodt/cas/pge/staging/TestFileStager.java>:[147,6] method does not override or implement a method from a supertype
[ERROR] <https://builds.apache.org/job/oodt-trunk/org.apache.oodt$cas-pge/ws/src/test/org/apache/oodt/cas/pge/staging/TestFileStager.java>:[156,17] reportMatcher(org.easymock.IArgumentMatcher) in org.easymock.EasyMock cannot be applied to (org.apache.oodt.cas.pge.staging.TestFileStager.ProductIdMatcher)
[INFO] 4 errors
[INFO] -------------------------------------------------------------
[JENKINS] Archiving <https://builds.apache.org/job/oodt-trunk/org.apache.oodt$cas-pge/ws/pom.xml> to /home/hudson/hudson/jobs/oodt-trunk/modules/org.apache.oodt$cas-pge/builds/2012-05-05_02-02-09/archive/org.apache.oodt/cas-pge/0.4-SNAPSHOT/cas-pge-0.4-SNAPSHOT.pom
[INFO] ------------------------------------------------------------------------
[ERROR] BUILD FAILURE
[INFO] ------------------------------------------------------------------------
[INFO] Compilation failure
<https://builds.apache.org/job/oodt-trunk/org.apache.oodt$cas-pge/ws/src/test/org/apache/oodt/cas/pge/staging/TestFileStager.java>:[131,51] cannot find symbol
symbol : class IArgumentMatcher
location: class org.apache.oodt.cas.pge.staging.TestFileStager
<https://builds.apache.org/job/oodt-trunk/org.apache.oodt$cas-pge/ws/src/test/org/apache/oodt/cas/pge/staging/TestFileStager.java>:[139,6] method does not override or implement a method from a supertype
<https://builds.apache.org/job/oodt-trunk/org.apache.oodt$cas-pge/ws/src/test/org/apache/oodt/cas/pge/staging/TestFileStager.java>:[147,6] method does not override or implement a method from a supertype
<https://builds.apache.org/job/oodt-trunk/org.apache.oodt$cas-pge/ws/src/test/org/apache/oodt/cas/pge/staging/TestFileStager.java>:[156,17] reportMatcher(org.easymock.IArgumentMatcher) in org.easymock.EasyMock cannot be applied to (org.apache.oodt.cas.pge.staging.TestFileStager.ProductIdMatcher)
[INFO] ------------------------------------------------------------------------
[INFO] For more information, run Maven with the -e switch
[INFO] ------------------------------------------------------------------------
[INFO] Total time: 28 minutes 22 seconds
[INFO] Finished at: Sat May 05 02:30:58 UTC 2012
[INFO] Final Memory: 122M/306M
[INFO] ------------------------------------------------------------------------
Maven failed with error.
Build failed in Jenkins: oodt-trunk » CAS PGE Adaptor Framework #444
Posted by Apache Jenkins Server <je...@builds.apache.org>.
See <https://builds.apache.org/job/oodt-trunk/org.apache.oodt$cas-pge/444/>
------------------------------------------
[INFO] ------------------------------------------------------------------------
[INFO] Building CAS PGE Adaptor Framework
[INFO] task-segment: [install]
[INFO] ------------------------------------------------------------------------
[INFO] [remote-resources:process {execution: default}]
Downloading: http://repo1.maven.org/maven2/net/sf/saxon/saxon-dom/8.7/saxon-dom-8.7.pom
Downloading: http://repo1.maven.org/maven2/net/sf/saxon/saxon/8.7/saxon-8.7.pom
Downloading: http://repo1.maven.org/maven2/net/sf/saxon/saxon-dom/8.7/saxon-dom-8.7.jar
Downloading: http://repo1.maven.org/maven2/net/sf/saxon/saxon/8.7/saxon-8.7.jar
[INFO] [resources:resources {execution: default-resources}]
[INFO] Using 'UTF-8' encoding to copy filtered resources.
[INFO] Copying 14 resources
[INFO] Copying 3 resources
[INFO] [compiler:compile {execution: default-compile}]
[INFO] Compiling 20 source files to <https://builds.apache.org/job/oodt-trunk/org.apache.oodt$cas-pge/ws/target/classes>
[INFO] [resources:testResources {execution: default-testResources}]
[INFO] Using 'UTF-8' encoding to copy filtered resources.
[INFO] skip non existing resourceDirectory <https://builds.apache.org/job/oodt-trunk/org.apache.oodt$cas-pge/ws/src/test/resources>
[INFO] Copying 3 resources
[INFO] [compiler:testCompile {execution: default-testCompile}]
[INFO] Compiling 8 source files to <https://builds.apache.org/job/oodt-trunk/org.apache.oodt$cas-pge/ws/target/test-classes>
[INFO] -------------------------------------------------------------
[ERROR] COMPILATION ERROR :
[INFO] -------------------------------------------------------------
[ERROR] <https://builds.apache.org/job/oodt-trunk/org.apache.oodt$cas-pge/ws/src/test/org/apache/oodt/cas/pge/staging/TestFileStager.java>:[131,51] cannot find symbol
symbol : class IArgumentMatcher
location: class org.apache.oodt.cas.pge.staging.TestFileStager
[ERROR] <https://builds.apache.org/job/oodt-trunk/org.apache.oodt$cas-pge/ws/src/test/org/apache/oodt/cas/pge/staging/TestFileStager.java>:[139,6] method does not override or implement a method from a supertype
[ERROR] <https://builds.apache.org/job/oodt-trunk/org.apache.oodt$cas-pge/ws/src/test/org/apache/oodt/cas/pge/staging/TestFileStager.java>:[147,6] method does not override or implement a method from a supertype
[ERROR] <https://builds.apache.org/job/oodt-trunk/org.apache.oodt$cas-pge/ws/src/test/org/apache/oodt/cas/pge/staging/TestFileStager.java>:[156,17] reportMatcher(org.easymock.IArgumentMatcher) in org.easymock.EasyMock cannot be applied to (org.apache.oodt.cas.pge.staging.TestFileStager.ProductIdMatcher)
[INFO] 4 errors
[INFO] -------------------------------------------------------------
[JENKINS] Archiving <https://builds.apache.org/job/oodt-trunk/org.apache.oodt$cas-pge/ws/pom.xml> to /home/hudson/hudson/jobs/oodt-trunk/modules/org.apache.oodt$cas-pge/builds/2012-05-05_00-11-34/archive/org.apache.oodt/cas-pge/0.4-SNAPSHOT/cas-pge-0.4-SNAPSHOT.pom
[INFO] ------------------------------------------------------------------------
[ERROR] BUILD FAILURE
[INFO] ------------------------------------------------------------------------
[INFO] Compilation failure
<https://builds.apache.org/job/oodt-trunk/org.apache.oodt$cas-pge/ws/src/test/org/apache/oodt/cas/pge/staging/TestFileStager.java>:[131,51] cannot find symbol
symbol : class IArgumentMatcher
location: class org.apache.oodt.cas.pge.staging.TestFileStager
<https://builds.apache.org/job/oodt-trunk/org.apache.oodt$cas-pge/ws/src/test/org/apache/oodt/cas/pge/staging/TestFileStager.java>:[139,6] method does not override or implement a method from a supertype
<https://builds.apache.org/job/oodt-trunk/org.apache.oodt$cas-pge/ws/src/test/org/apache/oodt/cas/pge/staging/TestFileStager.java>:[147,6] method does not override or implement a method from a supertype
<https://builds.apache.org/job/oodt-trunk/org.apache.oodt$cas-pge/ws/src/test/org/apache/oodt/cas/pge/staging/TestFileStager.java>:[156,17] reportMatcher(org.easymock.IArgumentMatcher) in org.easymock.EasyMock cannot be applied to (org.apache.oodt.cas.pge.staging.TestFileStager.ProductIdMatcher)
[INFO] ------------------------------------------------------------------------
[INFO] For more information, run Maven with the -e switch
[INFO] ------------------------------------------------------------------------
[INFO] Total time: 15 minutes 27 seconds
[INFO] Finished at: Sat May 05 00:27:08 UTC 2012
[INFO] Final Memory: 127M/378M
[INFO] ------------------------------------------------------------------------
Waiting for Jenkins to finish collecting data
Build failed in Jenkins: oodt-trunk » CAS PGE Adaptor Framework #443
Posted by Apache Jenkins Server <je...@builds.apache.org>.
See <https://builds.apache.org/job/oodt-trunk/org.apache.oodt$cas-pge/443/>
------------------------------------------
[INFO] ------------------------------------------------------------------------
[INFO] Building CAS PGE Adaptor Framework
[INFO] task-segment: [install]
[INFO] ------------------------------------------------------------------------
[INFO] [remote-resources:process {execution: default}]
Downloading: http://repo1.maven.org/maven2/net/sf/saxon/saxon-dom/8.7/saxon-dom-8.7.pom
Downloading: http://repo1.maven.org/maven2/net/sf/saxon/saxon/8.7/saxon-8.7.pom
Downloading: http://repo1.maven.org/maven2/net/sf/saxon/saxon-dom/8.7/saxon-dom-8.7.jar
Downloading: http://repo1.maven.org/maven2/net/sf/saxon/saxon/8.7/saxon-8.7.jar
[INFO] [resources:resources {execution: default-resources}]
[INFO] Using 'UTF-8' encoding to copy filtered resources.
[INFO] Copying 14 resources
[INFO] Copying 3 resources
[INFO] [compiler:compile {execution: default-compile}]
[INFO] Compiling 20 source files to <https://builds.apache.org/job/oodt-trunk/org.apache.oodt$cas-pge/ws/target/classes>
[INFO] [resources:testResources {execution: default-testResources}]
[INFO] Using 'UTF-8' encoding to copy filtered resources.
[INFO] skip non existing resourceDirectory <https://builds.apache.org/job/oodt-trunk/org.apache.oodt$cas-pge/ws/src/test/resources>
[INFO] Copying 3 resources
[INFO] [compiler:testCompile {execution: default-testCompile}]
[INFO] Compiling 8 source files to <https://builds.apache.org/job/oodt-trunk/org.apache.oodt$cas-pge/ws/target/test-classes>
[INFO] -------------------------------------------------------------
[ERROR] COMPILATION ERROR :
[INFO] -------------------------------------------------------------
[ERROR] <https://builds.apache.org/job/oodt-trunk/org.apache.oodt$cas-pge/ws/src/test/org/apache/oodt/cas/pge/staging/TestFileStager.java>:[131,51] cannot find symbol
symbol : class IArgumentMatcher
location: class org.apache.oodt.cas.pge.staging.TestFileStager
[ERROR] <https://builds.apache.org/job/oodt-trunk/org.apache.oodt$cas-pge/ws/src/test/org/apache/oodt/cas/pge/staging/TestFileStager.java>:[139,6] method does not override or implement a method from a supertype
[ERROR] <https://builds.apache.org/job/oodt-trunk/org.apache.oodt$cas-pge/ws/src/test/org/apache/oodt/cas/pge/staging/TestFileStager.java>:[147,6] method does not override or implement a method from a supertype
[ERROR] <https://builds.apache.org/job/oodt-trunk/org.apache.oodt$cas-pge/ws/src/test/org/apache/oodt/cas/pge/staging/TestFileStager.java>:[156,17] reportMatcher(org.easymock.IArgumentMatcher) in org.easymock.EasyMock cannot be applied to (org.apache.oodt.cas.pge.staging.TestFileStager.ProductIdMatcher)
[INFO] 4 errors
[INFO] -------------------------------------------------------------
[JENKINS] Archiving <https://builds.apache.org/job/oodt-trunk/org.apache.oodt$cas-pge/ws/pom.xml> to /home/hudson/hudson/jobs/oodt-trunk/modules/org.apache.oodt$cas-pge/builds/2012-05-04_00-14-30/archive/org.apache.oodt/cas-pge/0.4-SNAPSHOT/cas-pge-0.4-SNAPSHOT.pom
[INFO] ------------------------------------------------------------------------
[ERROR] BUILD FAILURE
[INFO] ------------------------------------------------------------------------
[INFO] Compilation failure
<https://builds.apache.org/job/oodt-trunk/org.apache.oodt$cas-pge/ws/src/test/org/apache/oodt/cas/pge/staging/TestFileStager.java>:[131,51] cannot find symbol
symbol : class IArgumentMatcher
location: class org.apache.oodt.cas.pge.staging.TestFileStager
<https://builds.apache.org/job/oodt-trunk/org.apache.oodt$cas-pge/ws/src/test/org/apache/oodt/cas/pge/staging/TestFileStager.java>:[139,6] method does not override or implement a method from a supertype
<https://builds.apache.org/job/oodt-trunk/org.apache.oodt$cas-pge/ws/src/test/org/apache/oodt/cas/pge/staging/TestFileStager.java>:[147,6] method does not override or implement a method from a supertype
<https://builds.apache.org/job/oodt-trunk/org.apache.oodt$cas-pge/ws/src/test/org/apache/oodt/cas/pge/staging/TestFileStager.java>:[156,17] reportMatcher(org.easymock.IArgumentMatcher) in org.easymock.EasyMock cannot be applied to (org.apache.oodt.cas.pge.staging.TestFileStager.ProductIdMatcher)
[INFO] ------------------------------------------------------------------------
[INFO] For more information, run Maven with the -e switch
[INFO] ------------------------------------------------------------------------
[INFO] Total time: 37 minutes 19 seconds
[INFO] Finished at: Fri May 04 00:52:24 UTC 2012
[INFO] Final Memory: 116M/245M
[INFO] ------------------------------------------------------------------------