You are viewing a plain text version of this content. The canonical link for it is here.
Posted to common-dev@hadoop.apache.org by Apache Jenkins Server <hu...@hudson.apache.org> on 2011/05/13 23:33:24 UTC
Hadoop-Common-22-branch - Build # 47 - Still Failing
See https://builds.apache.org/hudson/job/Hadoop-Common-22-branch/47/
###################################################################################
########################## LAST 60 LINES OF THE CONSOLE ###########################
[...truncated 3102 lines...]
[artifact:install-provider]
[artifact:install-provider] for artifact:
[artifact:install-provider] unspecified:unspecified:jar:0.0
[artifact:install-provider]
[artifact:install-provider] from the specified remote repositories:
[artifact:install-provider] central (http://repo1.maven.org/maven2)
[artifact:install-provider]
[artifact:install-provider]
BUILD FAILED
/grid/0/hudson/hudson-slave/workspace/Hadoop-Common-22-branch/trunk/build.xml:1331: Error downloading wagon provider from the remote repository: Missing:
----------
1) org.apache.maven.wagon:wagon-http:jar:1.0-beta-2
Try downloading the file manually from the project website.
Then, install it using the command:
mvn install:install-file -DgroupId=org.apache.maven.wagon -DartifactId=wagon-http -Dversion=1.0-beta-2 -Dpackaging=jar -Dfile=/path/to/file
Alternatively, if you host your own repository you can deploy the file there:
mvn deploy:deploy-file -DgroupId=org.apache.maven.wagon -DartifactId=wagon-http -Dversion=1.0-beta-2 -Dpackaging=jar -Dfile=/path/to/file -Durl=[url] -DrepositoryId=[id]
Path to dependency:
1) unspecified:unspecified:jar:0.0
2) org.apache.maven.wagon:wagon-http:jar:1.0-beta-2
----------
1 required artifact is missing.
for artifact:
unspecified:unspecified:jar:0.0
from the specified remote repositories:
central (http://repo1.maven.org/maven2)
Total time: 2 minutes 12 seconds
======================================================================
======================================================================
STORE: saving artifacts
======================================================================
======================================================================
mv: cannot stat `build/test/findbugs': No such file or directory
Build Failed
[FINDBUGS] Skipping publisher since build result is FAILURE
[WARNINGS] Skipping publisher since build result is FAILURE
Publishing Javadoc
Archiving artifacts
Recording test results
Recording fingerprints
Publishing Clover coverage report...
No Clover report will be published due to a Build Failure
Email was triggered for: Failure
Sending email for trigger: Failure
###################################################################################
############################## FAILED TESTS (if any) ##############################
No tests ran.
Hadoop-Common-22-branch - Build # 48 - Still Failing
Posted by Apache Jenkins Server <hu...@hudson.apache.org>.
See https://builds.apache.org/hudson/job/Hadoop-Common-22-branch/48/
###################################################################################
########################## LAST 60 LINES OF THE CONSOLE ###########################
[...truncated 3102 lines...]
[artifact:install-provider]
[artifact:install-provider] for artifact:
[artifact:install-provider] unspecified:unspecified:jar:0.0
[artifact:install-provider]
[artifact:install-provider] from the specified remote repositories:
[artifact:install-provider] central (http://repo1.maven.org/maven2)
[artifact:install-provider]
[artifact:install-provider]
BUILD FAILED
/grid/0/hudson/hudson-slave/workspace/Hadoop-Common-22-branch/trunk/build.xml:1331: Error downloading wagon provider from the remote repository: Missing:
----------
1) org.apache.maven.wagon:wagon-http:jar:1.0-beta-2
Try downloading the file manually from the project website.
Then, install it using the command:
mvn install:install-file -DgroupId=org.apache.maven.wagon -DartifactId=wagon-http -Dversion=1.0-beta-2 -Dpackaging=jar -Dfile=/path/to/file
Alternatively, if you host your own repository you can deploy the file there:
mvn deploy:deploy-file -DgroupId=org.apache.maven.wagon -DartifactId=wagon-http -Dversion=1.0-beta-2 -Dpackaging=jar -Dfile=/path/to/file -Durl=[url] -DrepositoryId=[id]
Path to dependency:
1) unspecified:unspecified:jar:0.0
2) org.apache.maven.wagon:wagon-http:jar:1.0-beta-2
----------
1 required artifact is missing.
for artifact:
unspecified:unspecified:jar:0.0
from the specified remote repositories:
central (http://repo1.maven.org/maven2)
Total time: 2 minutes 13 seconds
======================================================================
======================================================================
STORE: saving artifacts
======================================================================
======================================================================
mv: cannot stat `build/test/findbugs': No such file or directory
Build Failed
[FINDBUGS] Skipping publisher since build result is FAILURE
[WARNINGS] Skipping publisher since build result is FAILURE
Publishing Javadoc
Archiving artifacts
Recording test results
Recording fingerprints
Publishing Clover coverage report...
No Clover report will be published due to a Build Failure
Email was triggered for: Failure
Sending email for trigger: Failure
###################################################################################
############################## FAILED TESTS (if any) ##############################
No tests ran.