You are viewing a plain text version of this content. The canonical link for it is here.
Posted to builds@beam.apache.org by Apache Jenkins Server <je...@builds.apache.org> on 2023/07/13 16:22:19 UTC
Build failed in Jenkins: beam_PostCommit_XVR_Flink #7096
See <https://ci-beam.apache.org/job/beam_PostCommit_XVR_Flink/7096/display/redirect?page=changes>
Changes:
[noreply] Interrupt previous test runs when a new run kicks off (#27439)
------------------------------------------
[...truncated 163.00 KB...]
github.com/googleapis/gax-go/v2,https://github.com/googleapis/gax-go/blob/v2.8.0/v2/LICENSE,BSD-3-Clause
go.opencensus.io,https://github.com/census-instrumentation/opencensus-go/blob/v0.24.0/LICENSE,Apache-2.0
golang.org/x/crypto,https://cs.opensource.google/go/x/crypto/+/v0.7.0:LICENSE,BSD-3-Clause
golang.org/x/net,https://cs.opensource.google/go/x/net/+/v0.10.0:LICENSE,BSD-3-Clause
golang.org/x/oauth2,https://cs.opensource.google/go/x/oauth2/+/v0.8.0:LICENSE,BSD-3-Clause
golang.org/x/sys,https://cs.opensource.google/go/x/sys/+/v0.8.0:LICENSE,BSD-3-Clause
golang.org/x/text,https://cs.opensource.google/go/x/text/+/v0.9.0:LICENSE,BSD-3-Clause
golang.org/x/xerrors,https://cs.opensource.google/go/x/xerrors/+/04be3eba:LICENSE,BSD-3-Clause
google.golang.org/api,https://github.com/googleapis/google-api-go-client/blob/v0.122.0/LICENSE,BSD-3-Clause
google.golang.org/api/internal/third_party/uritemplates,https://github.com/googleapis/google-api-go-client/blob/v0.122.0/internal/third_party/uritemplates/LICENSE,BSD-3-Clause
google.golang.org/appengine,https://github.com/golang/appengine/blob/v1.6.7/LICENSE,Apache-2.0
google.golang.org/genproto/googleapis,https://github.com/googleapis/go-genproto/blob/daa745c078e1/LICENSE,Apache-2.0
google.golang.org/grpc,https://github.com/grpc/grpc-go/blob/v1.55.0/LICENSE,Apache-2.0
google.golang.org/protobuf,https://github.com/protocolbuffers/protobuf-go/blob/v1.30.0/LICENSE,BSD-3-Clause
+ chmod -R a+w /output/licenses
> Task :runners:flink:1.15:job-server:flinkJobServerSetup
Launching job server @ 40947 ...
> Task :release:go-licenses:java:createLicenses
> Task :release:go-licenses:py:createLicenses
> Task :sdks:java:container:java8:copyGolangLicenses
> Task :sdks:python:container:py38:copyGolangLicenses
> Task :sdks:python:container:py38:dockerPrepare
> Task :release:go-licenses:go:createLicenses
> Task :sdks:java:container:java8:dockerPrepare
> Task :sdks:go:container:copyGolangLicenses
> Task :sdks:go:container:dockerPrepare
> Task :sdks:python:container:py38:docker FAILED
#1 [internal] load build definition from Dockerfile
#1 transferring dockerfile: 4.91kB done
#1 DONE 0.0s
#2 [internal] load .dockerignore
#2 transferring context: 2B done
#2 DONE 0.0s
#3 [internal] load metadata for docker.io/library/python:3.8-bullseye
#3 DONE 0.3s
#4 [beam 1/5] FROM docker.io/library/python:3.8-bullseye@sha256:fd2e46e443c83cb1ee3c0522a82c2837222469ef7e15fd4fc0804c22de9f557d
#4 CACHED
#5 [internal] load build context
#5 transferring context: 2.41MB 0.1s done
#5 DONE 0.1s
#6 [beam 2/5] COPY target/base_image_requirements.txt /tmp/base_image_requirements.txt
#6 CACHED
#7 [beam 3/5] COPY target/apache-beam.tar.gz /opt/apache/beam/tars/
#7 CACHED
#8 [beam 4/5] COPY target/launcher/linux_amd64/boot target/LICENSE target/NOTICE target/LICENSE.python /opt/apache/beam/
#8 ERROR: "/target/launcher/linux_amd64/boot" not found: not found
------
> [beam 4/5] COPY target/launcher/linux_amd64/boot target/LICENSE target/NOTICE target/LICENSE.python /opt/apache/beam/:
------
ERROR: failed to solve: failed to compute cache key: "/target/launcher/linux_amd64/boot" not found: not found
> Task :sdks:java:container:java8:docker
#1 [internal] load build definition from Dockerfile
#1 transferring dockerfile: 2.58kB done
#1 DONE 0.0s
#2 [internal] load .dockerignore
#2 transferring context: 2B done
#2 DONE 0.0s
#3 [internal] load metadata for docker.io/library/eclipse-temurin:8
#3 DONE 0.3s
#4 [ 1/16] FROM docker.io/library/eclipse-temurin:8@sha256:c6377a17a374b7b073e306a2b2842a033435f2f39489b99267951d15226469f6
#4 CACHED
#5 [internal] load build context
#5 transferring context: 46.98MB 0.4s done
#5 DONE 0.5s
#6 [ 2/16] ADD target/slf4j-api.jar /opt/apache/beam/jars/
#6 DONE 2.8s
#7 [ 3/16] ADD target/slf4j-jdk14.jar /opt/apache/beam/jars/
#7 DONE 0.1s
#8 [ 4/16] ADD target/jcl-over-slf4j.jar /opt/apache/beam/jars/
#8 DONE 0.1s
#9 [ 5/16] ADD target/log4j-over-slf4j.jar /opt/apache/beam/jars/
#9 DONE 0.1s
#10 [ 6/16] ADD target/log4j-to-slf4j.jar /opt/apache/beam/jars/
#10 DONE 0.1s
#11 [ 7/16] ADD target/beam-sdks-java-harness.jar /opt/apache/beam/jars/
#11 DONE 0.1s
#12 [ 8/16] COPY target/jamm.jar target/open-module-agent*.jar /opt/apache/beam/jars/
#12 DONE 0.2s
#13 [ 9/16] COPY target/linux_amd64/boot /opt/apache/beam/
#13 DONE 0.2s
#14 [10/16] COPY target/LICENSE /opt/apache/beam/
#14 DONE 0.1s
#15 [11/16] COPY target/NOTICE /opt/apache/beam/
#15 DONE 0.1s
#16 [12/16] ADD target/third_party_licenses /opt/apache/beam/third_party_licenses/
#16 DONE 0.3s
#17 [13/16] COPY target/LICENSE target/options/* /opt/apache/beam/options/
#17 DONE 0.1s
#18 [14/16] COPY target/go-licenses/* /opt/apache/beam/third_party_licenses/golang/
#18 DONE 0.2s
#19 [15/16] RUN if [ "true" = "false" ] ; then rm -rf /opt/apache/beam/third_party_licenses ; fi
#19 DONE 0.4s
#20 [16/16] COPY target/profiler/* /opt/google_cloud_profiler/
#20 DONE 0.2s
#21 exporting to image
#21 exporting layers
#21 exporting layers 0.2s done
#21 writing image sha256:fbefa20fca5662e164d955712b244353ee2eec2eb67e437976d6fb27f73dd440 done
#21 naming to docker.io/apache/beam_java8_sdk:2.50.0.dev done
#21 DONE 0.3s
> Task :sdks:go:container:docker
#1 [internal] load build definition from Dockerfile
#1 transferring dockerfile: 1.70kB done
#1 DONE 0.0s
#2 [internal] load .dockerignore
#2 transferring context: 2B done
#2 DONE 0.0s
#3 [internal] load metadata for docker.io/library/debian:bullseye
#3 DONE 0.3s
#4 [1/7] FROM docker.io/library/debian:bullseye@sha256:a648e10e02af129706b1fb89e1ac9694ae3db7f2b8439aa906321e68cc281bc0
#4 resolve docker.io/library/debian:bullseye@sha256:a648e10e02af129706b1fb89e1ac9694ae3db7f2b8439aa906321e68cc281bc0 0.0s done
#4 sha256:3b6053ca925336c804e2d3f080af177efcdc9f51198a627569bfc7c7e730ef7e 529B / 529B done
#4 sha256:189a2f977ff1e0aeb33038f380dd9a6ab0355d27ec82f10d23567b95386506ce 1.46kB / 1.46kB done
#4 sha256:a648e10e02af129706b1fb89e1ac9694ae3db7f2b8439aa906321e68cc281bc0 1.85kB / 1.85kB done
#4 DONE 0.1s
#5 [internal] load build context
#5 transferring context: 24.02MB 0.3s done
#5 DONE 0.4s
#6 [2/7] RUN apt-get update && DEBIAN_FRONTEND=noninteractive apt-get install -y ca-certificates && rm -rf /var/lib/apt/lists/*
#6 2.866 Get:1 http://deb.debian.org/debian bullseye InRelease [116 kB]
#6 2.924 Get:2 http://deb.debian.org/debian-security bullseye-security InRelease [48.4 kB]
#6 2.924 Get:3 http://deb.debian.org/debian bullseye-updates InRelease [44.1 kB]
#6 3.688 Get:4 http://deb.debian.org/debian bullseye/main amd64 Packages [8183 kB]
#6 3.868 Get:5 http://deb.debian.org/debian-security bullseye-security/main amd64 Packages [252 kB]
#6 3.936 Get:6 http://deb.debian.org/debian bullseye-updates/main amd64 Packages [14.8 kB]
#6 5.525 Fetched 8658 kB in 3s (3182 kB/s)
#6 5.525 Reading package lists...
#6 6.522 Reading package lists...
#6 7.564 Building dependency tree...
#6 7.806 Reading state information...
#6 8.146 The following additional packages will be installed:
#6 8.146 openssl
#6 8.185 The following NEW packages will be installed:
#6 8.187 ca-certificates openssl
#6 8.293 0 upgraded, 2 newly installed, 0 to remove and 0 not upgraded.
#6 8.293 Need to get 1012 kB of archives.
#6 8.293 After this operation, 1892 kB of additional disk space will be used.
#6 8.293 Get:1 http://deb.debian.org/debian-security bullseye-security/main amd64 openssl amd64 1.1.1n-0+deb11u5 [854 kB]
#6 8.466 Get:2 http://deb.debian.org/debian bullseye/main amd64 ca-certificates all 20210119 [158 kB]
#6 9.286 debconf: delaying package configuration, since apt-utils is not installed
#6 9.346 Fetched 1012 kB in 0s (3753 kB/s)
#6 9.482 Selecting previously unselected package openssl.
#6 9.482 (Reading database ... (Reading database ... 5%(Reading database ... 10%(Reading database ... 15%(Reading database ... 20%(Reading database ... 25%(Reading database ... 30%(Reading database ... 35%(Reading database ... 40%(Reading database ... 45%(Reading database ... 50%(Reading database ... 55%(Reading database ... 60%(Reading database ... 65%(Reading database ... 70%(Reading database ... 75%(Reading database ... 80%(Reading database ... 85%(Reading database ... 90%(Reading database ... 95%(Reading database ... 100%(Reading database ... 6664 files and directories currently installed.)
#6 9.602 Preparing to unpack .../openssl_1.1.1n-0+deb11u5_amd64.deb ...
#6 9.610 Unpacking openssl (1.1.1n-0+deb11u5) ...
#6 9.815 Selecting previously unselected package ca-certificates.
#6 9.817 Preparing to unpack .../ca-certificates_20210119_all.deb ...
#6 9.822 Unpacking ca-certificates (20210119) ...
#6 9.901 Setting up openssl (1.1.1n-0+deb11u5) ...
#6 9.920 Setting up ca-certificates (20210119) ...
#6 10.92 Updating certificates in /etc/ssl/certs...
#6 12.07 129 added, 0 removed; done.
#6 12.15 Processing triggers for ca-certificates (20210119) ...
#6 12.16 Updating certificates in /etc/ssl/certs...
#6 12.93 0 added, 0 removed; done.
#6 12.93 Running hooks in /etc/ca-certificates/update.d...
#6 12.93 done.
#6 DONE 13.1s
#7 [3/7] ADD target/linux_amd64/boot /opt/apache/beam/
#7 DONE 0.3s
#8 [4/7] COPY target/LICENSE /opt/apache/beam/
#8 DONE 0.1s
#9 [5/7] COPY target/NOTICE /opt/apache/beam/
#9 DONE 0.1s
#10 [6/7] COPY target/go-licenses/* /opt/apache/beam/third_party_licenses/golang/
#10 DONE 0.1s
#11 [7/7] RUN if [ "true" = "false" ] ; then rm -rf /opt/apache/beam/third_party_licenses ; fi
#11 DONE 0.6s
#12 exporting to image
#12 exporting layers
#12 exporting layers 0.3s done
#12 writing image sha256:19bd9a3925d17b06e231e944606633d4f76daf43c2a059fc4f9eb3bf92941073 done
#12 naming to docker.io/apache/beam_go_sdk:latest done
#12 DONE 0.3s
> Task :runners:flink:1.15:job-server:flinkJobServerCleanup
FAILURE: Build failed with an exception.
* What went wrong:
Execution failed for task ':sdks:python:container:py38:docker'.
> Process 'command 'docker'' finished with non-zero exit value 1
* Try:
> Run with --stacktrace option to get the stack trace.
> Run with --info or --debug option to get more log output.
* Get more help at https://help.gradle.org
Deprecated Gradle features were used in this build, making it incompatible with Gradle 8.0.
You can use '--warning-mode all' to show the individual deprecation warnings and determine if they come from your own scripts or plugins.
See https://docs.gradle.org/7.5.1/userguide/command_line_interface.html#sec:command_line_warnings
Execution optimizations have been disabled for 1 invalid unit(s) of work during this build to ensure correctness.
Please consult deprecation warnings for more details.
BUILD FAILED in 3m 45s
274 actionable tasks: 178 executed, 84 from cache, 12 up-to-date
Publishing build scan...
https://ge.apache.org/s/bqjgckm5522v4
Build step 'Invoke Gradle script' changed build result to FAILURE
Build step 'Invoke Gradle script' marked build as failure
---------------------------------------------------------------------
To unsubscribe, e-mail: builds-unsubscribe@beam.apache.org
For additional commands, e-mail: builds-help@beam.apache.org
Jenkins build is back to normal : beam_PostCommit_XVR_Flink #7097
Posted by Apache Jenkins Server <je...@builds.apache.org>.
See <https://ci-beam.apache.org/job/beam_PostCommit_XVR_Flink/7097/display/redirect>
---------------------------------------------------------------------
To unsubscribe, e-mail: builds-unsubscribe@beam.apache.org
For additional commands, e-mail: builds-help@beam.apache.org