You are viewing a plain text version of this content. The canonical link for it is here.
Posted to commits@beam.apache.org by Apache Jenkins Server <je...@builds.apache.org> on 2018/06/16 21:40:36 UTC
Build failed in Jenkins:
beam_PostCommit_Java_ValidatesRunner_Dataflow_Gradle #516
See <https://builds.apache.org/job/beam_PostCommit_Java_ValidatesRunner_Dataflow_Gradle/516/display/redirect>
------------------------------------------
[...truncated 54.62 MB...]
at java.util.concurrent.ThreadPoolExecutor.runWorker(ThreadPoolExecutor.java:1142)
at java.util.concurrent.ThreadPoolExecutor$Worker.run(ThreadPoolExecutor.java:617)
at java.lang.Thread.run(Thread.java:745)
Caused by: org.apache.beam.sdk.util.UserCodeException: java.lang.AssertionError: OutputSideInputs/ParMultiDo(Anonymous).output: org/hamcrest/Matchers
at org.apache.beam.sdk.util.UserCodeException.wrap(UserCodeException.java:36)
at org.apache.beam.sdk.testing.PAssert$DefaultConcludeFn$DoFnInvoker.invokeProcessElement(Unknown Source)
at org.apache.beam.runners.core.SimpleDoFnRunner.invokeProcessElement(SimpleDoFnRunner.java:185)
at org.apache.beam.runners.core.SimpleDoFnRunner.processElement(SimpleDoFnRunner.java:149)
at com.google.cloud.dataflow.worker.SimpleParDoFn.processElement(SimpleParDoFn.java:323)
at com.google.cloud.dataflow.worker.util.common.worker.ParDoOperation.process(ParDoOperation.java:43)
at com.google.cloud.dataflow.worker.util.common.worker.OutputReceiver.process(OutputReceiver.java:48)
at com.google.cloud.dataflow.worker.SimpleParDoFn$1.output(SimpleParDoFn.java:271)
at org.apache.beam.runners.core.SimpleDoFnRunner.outputWindowedValue(SimpleDoFnRunner.java:219)
at org.apache.beam.runners.core.SimpleDoFnRunner.access$700(SimpleDoFnRunner.java:69)
at org.apache.beam.runners.core.SimpleDoFnRunner$DoFnProcessContext.output(SimpleDoFnRunner.java:517)
at org.apache.beam.runners.core.SimpleDoFnRunner$DoFnProcessContext.output(SimpleDoFnRunner.java:505)
at org.apache.beam.sdk.testing.PAssert$GroupedValuesCheckerDoFn.processElement(PAssert.java:1215)
at org.apache.beam.sdk.testing.PAssert$GroupedValuesCheckerDoFn$DoFnInvoker.invokeProcessElement(Unknown Source)
at org.apache.beam.runners.core.SimpleDoFnRunner.invokeProcessElement(SimpleDoFnRunner.java:185)
at org.apache.beam.runners.core.SimpleDoFnRunner.processElement(SimpleDoFnRunner.java:149)
at com.google.cloud.dataflow.worker.SimpleParDoFn.processElement(SimpleParDoFn.java:323)
at com.google.cloud.dataflow.worker.util.common.worker.ParDoOperation.process(ParDoOperation.java:43)
at com.google.cloud.dataflow.worker.util.common.worker.OutputReceiver.process(OutputReceiver.java:48)
at com.google.cloud.dataflow.worker.SimpleParDoFn$1.output(SimpleParDoFn.java:271)
at org.apache.beam.runners.core.SimpleDoFnRunner.outputWindowedValue(SimpleDoFnRunner.java:219)
at org.apache.beam.runners.core.SimpleDoFnRunner.access$700(SimpleDoFnRunner.java:69)
at org.apache.beam.runners.core.SimpleDoFnRunner$DoFnProcessContext.output(SimpleDoFnRunner.java:517)
at org.apache.beam.sdk.transforms.DoFnOutputReceivers$WindowedContextOutputReceiver.output(DoFnOutputReceivers.java:42)
at org.apache.beam.sdk.transforms.MapElements$1.processElement(MapElements.java:131)
at org.apache.beam.sdk.transforms.MapElements$1$DoFnInvoker.invokeProcessElement(Unknown Source)
at org.apache.beam.runners.core.SimpleDoFnRunner.invokeProcessElement(SimpleDoFnRunner.java:185)
at org.apache.beam.runners.core.SimpleDoFnRunner.processElement(SimpleDoFnRunner.java:149)
at com.google.cloud.dataflow.worker.SimpleParDoFn.processElement(SimpleParDoFn.java:323)
at com.google.cloud.dataflow.worker.util.common.worker.ParDoOperation.process(ParDoOperation.java:43)
at com.google.cloud.dataflow.worker.util.common.worker.OutputReceiver.process(OutputReceiver.java:48)
at com.google.cloud.dataflow.worker.SimpleParDoFn$1.output(SimpleParDoFn.java:271)
at org.apache.beam.runners.core.SimpleDoFnRunner.outputWindowedValue(SimpleDoFnRunner.java:219)
at org.apache.beam.runners.core.SimpleDoFnRunner.access$700(SimpleDoFnRunner.java:69)
at org.apache.beam.runners.core.SimpleDoFnRunner$DoFnProcessContext.output(SimpleDoFnRunner.java:517)
at org.apache.beam.runners.core.SimpleDoFnRunner$DoFnProcessContext.output(SimpleDoFnRunner.java:505)
at org.apache.beam.sdk.testing.PAssert$ConcatFn.processElement(PAssert.java:1049)
at org.apache.beam.sdk.testing.PAssert$ConcatFn$DoFnInvoker.invokeProcessElement(Unknown Source)
at org.apache.beam.runners.core.SimpleDoFnRunner.invokeProcessElement(SimpleDoFnRunner.java:185)
at org.apache.beam.runners.core.SimpleDoFnRunner.processElement(SimpleDoFnRunner.java:149)
at com.google.cloud.dataflow.worker.SimpleParDoFn.processElement(SimpleParDoFn.java:323)
at com.google.cloud.dataflow.worker.util.common.worker.ParDoOperation.process(ParDoOperation.java:43)
at com.google.cloud.dataflow.worker.util.common.worker.OutputReceiver.process(OutputReceiver.java:48)
at com.google.cloud.dataflow.worker.SimpleParDoFn$1.output(SimpleParDoFn.java:271)
at org.apache.beam.runners.core.SimpleDoFnRunner.outputWindowedValue(SimpleDoFnRunner.java:219)
at org.apache.beam.runners.core.SimpleDoFnRunner.access$700(SimpleDoFnRunner.java:69)
at org.apache.beam.runners.core.SimpleDoFnRunner$DoFnProcessContext.output(SimpleDoFnRunner.java:517)
at org.apache.beam.sdk.transforms.DoFnOutputReceivers$WindowedContextOutputReceiver.output(DoFnOutputReceivers.java:42)
at org.apache.beam.sdk.transforms.MapElements$1.processElement(MapElements.java:131)
at org.apache.beam.sdk.transforms.MapElements$1$DoFnInvoker.invokeProcessElement(Unknown Source)
at org.apache.beam.runners.core.SimpleDoFnRunner.invokeProcessElement(SimpleDoFnRunner.java:185)
at org.apache.beam.runners.core.SimpleDoFnRunner.processElement(SimpleDoFnRunner.java:149)
at com.google.cloud.dataflow.worker.SimpleParDoFn.processElement(SimpleParDoFn.java:323)
at com.google.cloud.dataflow.worker.util.common.worker.ParDoOperation.process(ParDoOperation.java:43)
at com.google.cloud.dataflow.worker.util.common.worker.OutputReceiver.process(OutputReceiver.java:48)
at com.google.cloud.dataflow.worker.GroupAlsoByWindowsParDoFn$1.output(GroupAlsoByWindowsParDoFn.java:181)
... 21 more
Caused by: java.lang.AssertionError: OutputSideInputs/ParMultiDo(Anonymous).output: org/hamcrest/Matchers
at org.apache.beam.sdk.testing.PAssert$PAssertionSite.capture(PAssert.java:168)
at org.apache.beam.sdk.testing.PAssert.that(PAssert.java:378)
at org.apache.beam.sdk.testing.PAssert.that(PAssert.java:370)
at org.apache.beam.sdk.transforms.ViewTest.testSingletonSideInput(ViewTest.java:107)
at sun.reflect.NativeMethodAccessorImpl.invoke0(Native Method)
at sun.reflect.NativeMethodAccessorImpl.invoke(NativeMethodAccessorImpl.java:62)
at sun.reflect.DelegatingMethodAccessorImpl.invoke(DelegatingMethodAccessorImpl.java:43)
at java.lang.reflect.Method.invoke(Method.java:498)
at org.junit.runners.model.FrameworkMethod$1.runReflectiveCall(FrameworkMethod.java:50)
at org.junit.internal.runners.model.ReflectiveCallable.run(ReflectiveCallable.java:12)
at org.junit.runners.model.FrameworkMethod.invokeExplosively(FrameworkMethod.java:47)
at org.junit.internal.runners.statements.InvokeMethod.evaluate(InvokeMethod.java:17)
at org.apache.beam.sdk.testing.TestPipeline$1.evaluate(TestPipeline.java:317)
at org.junit.rules.ExpectedException$ExpectedExceptionStatement.evaluate(ExpectedException.java:239)
at org.junit.rules.RunRules.evaluate(RunRules.java:20)
at org.junit.runners.ParentRunner.runLeaf(ParentRunner.java:325)
at org.junit.runners.BlockJUnit4ClassRunner.runChild(BlockJUnit4ClassRunner.java:78)
at org.junit.runners.BlockJUnit4ClassRunner.runChild(BlockJUnit4ClassRunner.java:57)
at org.junit.runners.ParentRunner$3.run(ParentRunner.java:290)
at org.junit.runners.ParentRunner$1.schedule(ParentRunner.java:71)
at org.junit.runners.ParentRunner.runChildren(ParentRunner.java:288)
at org.junit.runners.ParentRunner.access$000(ParentRunner.java:58)
at org.junit.runners.ParentRunner$2.evaluate(ParentRunner.java:268)
at org.junit.runners.ParentRunner.run(ParentRunner.java:363)
at org.gradle.api.internal.tasks.testing.junit.JUnitTestClassExecutor.runTestClass(JUnitTestClassExecutor.java:106)
at org.gradle.api.internal.tasks.testing.junit.JUnitTestClassExecutor.execute(JUnitTestClassExecutor.java:58)
at org.gradle.api.internal.tasks.testing.junit.JUnitTestClassExecutor.execute(JUnitTestClassExecutor.java:38)
at org.gradle.api.internal.tasks.testing.junit.AbstractJUnitTestClassProcessor.processTestClass(AbstractJUnitTestClassProcessor.java:66)
at org.gradle.api.internal.tasks.testing.SuiteTestClassProcessor.processTestClass(SuiteTestClassProcessor.java:51)
at sun.reflect.NativeMethodAccessorImpl.invoke0(Native Method)
at sun.reflect.NativeMethodAccessorImpl.invoke(NativeMethodAccessorImpl.java:62)
at sun.reflect.DelegatingMethodAccessorImpl.invoke(DelegatingMethodAccessorImpl.java:43)
at java.lang.reflect.Method.invoke(Method.java:498)
at org.gradle.internal.dispatch.ReflectionDispatch.dispatch(ReflectionDispatch.java:35)
at org.gradle.internal.dispatch.ReflectionDispatch.dispatch(ReflectionDispatch.java:24)
at org.gradle.internal.dispatch.ContextClassLoaderDispatch.dispatch(ContextClassLoaderDispatch.java:32)
at org.gradle.internal.dispatch.ProxyDispatchAdapter$DispatchingInvocationHandler.invoke(ProxyDispatchAdapter.java:93)
at com.sun.proxy.$Proxy2.processTestClass(Unknown Source)
at org.gradle.api.internal.tasks.testing.worker.TestWorker.processTestClass(TestWorker.java:109)
at sun.reflect.NativeMethodAccessorImpl.invoke0(Native Method)
at sun.reflect.NativeMethodAccessorImpl.invoke(NativeMethodAccessorImpl.java:62)
at sun.reflect.DelegatingMethodAccessorImpl.invoke(DelegatingMethodAccessorImpl.java:43)
at java.lang.reflect.Method.invoke(Method.java:498)
at org.gradle.internal.dispatch.ReflectionDispatch.dispatch(ReflectionDispatch.java:35)
at org.gradle.internal.dispatch.ReflectionDispatch.dispatch(ReflectionDispatch.java:24)
at org.gradle.internal.remote.internal.hub.MessageHubBackedObjectConnection$DispatchWrapper.dispatch(MessageHubBackedObjectConnection.java:155)
at org.gradle.internal.remote.internal.hub.MessageHubBackedObjectConnection$DispatchWrapper.dispatch(MessageHubBackedObjectConnection.java:137)
at org.gradle.internal.remote.internal.hub.MessageHub$Handler.run(MessageHub.java:404)
at org.gradle.internal.concurrent.ExecutorPolicy$CatchAndRecordFailures.onExecute(ExecutorPolicy.java:63)
at org.gradle.internal.concurrent.ManagedExecutorImpl$1.run(ManagedExecutorImpl.java:46)
at java.util.concurrent.ThreadPoolExecutor.runWorker(ThreadPoolExecutor.java:1149)
at java.util.concurrent.ThreadPoolExecutor$Worker.run(ThreadPoolExecutor.java:624)
at org.gradle.internal.concurrent.ThreadFactoryImpl$ManagedThreadRunnable.run(ThreadFactoryImpl.java:55)
Caused by: java.lang.NoClassDefFoundError: org/hamcrest/Matchers
at org.apache.beam.sdk.testing.PAssert$AssertContainsInAnyOrder.apply(PAssert.java:1322)
at org.apache.beam.sdk.testing.PAssert$AssertContainsInAnyOrder.apply(PAssert.java:1301)
at org.apache.beam.sdk.testing.PAssert$CheckRelationAgainstExpected.apply(PAssert.java:966)
at org.apache.beam.sdk.testing.PAssert$CheckRelationAgainstExpected.apply(PAssert.java:946)
at org.apache.beam.sdk.testing.PAssert.doChecks(PAssert.java:1250)
at org.apache.beam.sdk.testing.PAssert$GroupedValuesCheckerDoFn.processElement(PAssert.java:1215)
at org.apache.beam.sdk.testing.PAssert$GroupedValuesCheckerDoFn$DoFnInvoker.invokeProcessElement(Unknown Source)
at org.apache.beam.runners.core.SimpleDoFnRunner.invokeProcessElement(SimpleDoFnRunner.java:185)
at org.apache.beam.runners.core.SimpleDoFnRunner.processElement(SimpleDoFnRunner.java:149)
at com.google.cloud.dataflow.worker.SimpleParDoFn.processElement(SimpleParDoFn.java:323)
at com.google.cloud.dataflow.worker.util.common.worker.ParDoOperation.process(ParDoOperation.java:43)
at com.google.cloud.dataflow.worker.util.common.worker.OutputReceiver.process(OutputReceiver.java:48)
at com.google.cloud.dataflow.worker.SimpleParDoFn$1.output(SimpleParDoFn.java:271)
at org.apache.beam.runners.core.SimpleDoFnRunner.outputWindowedValue(SimpleDoFnRunner.java:219)
at org.apache.beam.runners.core.SimpleDoFnRunner.access$700(SimpleDoFnRunner.java:69)
at org.apache.beam.runners.core.SimpleDoFnRunner$DoFnProcessContext.output(SimpleDoFnRunner.java:517)
at org.apache.beam.sdk.transforms.DoFnOutputReceivers$WindowedContextOutputReceiver.output(DoFnOutputReceivers.java:42)
at org.apache.beam.sdk.transforms.MapElements$1.processElement(MapElements.java:131)
at org.apache.beam.sdk.transforms.MapElements$1$DoFnInvoker.invokeProcessElement(Unknown Source)
at org.apache.beam.runners.core.SimpleDoFnRunner.invokeProcessElement(SimpleDoFnRunner.java:185)
at org.apache.beam.runners.core.SimpleDoFnRunner.processElement(SimpleDoFnRunner.java:149)
at com.google.cloud.dataflow.worker.SimpleParDoFn.processElement(SimpleParDoFn.java:323)
at com.google.cloud.dataflow.worker.util.common.worker.ParDoOperation.process(ParDoOperation.java:43)
at com.google.cloud.dataflow.worker.util.common.worker.OutputReceiver.process(OutputReceiver.java:48)
at com.google.cloud.dataflow.worker.SimpleParDoFn$1.output(SimpleParDoFn.java:271)
at org.apache.beam.runners.core.SimpleDoFnRunner.outputWindowedValue(SimpleDoFnRunner.java:219)
at org.apache.beam.runners.core.SimpleDoFnRunner.access$700(SimpleDoFnRunner.java:69)
at org.apache.beam.runners.core.SimpleDoFnRunner$DoFnProcessContext.output(SimpleDoFnRunner.java:517)
at org.apache.beam.runners.core.SimpleDoFnRunner$DoFnProcessContext.output(SimpleDoFnRunner.java:505)
at org.apache.beam.sdk.testing.PAssert$ConcatFn.processElement(PAssert.java:1049)
at org.apache.beam.sdk.testing.PAssert$ConcatFn$DoFnInvoker.invokeProcessElement(Unknown Source)
at org.apache.beam.runners.core.SimpleDoFnRunner.invokeProcessElement(SimpleDoFnRunner.java:185)
at org.apache.beam.runners.core.SimpleDoFnRunner.processElement(SimpleDoFnRunner.java:149)
at com.google.cloud.dataflow.worker.SimpleParDoFn.processElement(SimpleParDoFn.java:323)
at com.google.cloud.dataflow.worker.util.common.worker.ParDoOperation.process(ParDoOperation.java:43)
at com.google.cloud.dataflow.worker.util.common.worker.OutputReceiver.process(OutputReceiver.java:48)
at com.google.cloud.dataflow.worker.SimpleParDoFn$1.output(SimpleParDoFn.java:271)
at org.apache.beam.runners.core.SimpleDoFnRunner.outputWindowedValue(SimpleDoFnRunner.java:219)
at org.apache.beam.runners.core.SimpleDoFnRunner.access$700(SimpleDoFnRunner.java:69)
at org.apache.beam.runners.core.SimpleDoFnRunner$DoFnProcessContext.output(SimpleDoFnRunner.java:517)
at org.apache.beam.sdk.transforms.DoFnOutputReceivers$WindowedContextOutputReceiver.output(DoFnOutputReceivers.java:42)
at org.apache.beam.sdk.transforms.MapElements$1.processElement(MapElements.java:131)
at org.apache.beam.sdk.transforms.MapElements$1$DoFnInvoker.invokeProcessElement(Unknown Source)
at org.apache.beam.runners.core.SimpleDoFnRunner.invokeProcessElement(SimpleDoFnRunner.java:185)
at org.apache.beam.runners.core.SimpleDoFnRunner.processElement(SimpleDoFnRunner.java:149)
at com.google.cloud.dataflow.worker.SimpleParDoFn.processElement(SimpleParDoFn.java:323)
at com.google.cloud.dataflow.worker.util.common.worker.ParDoOperation.process(ParDoOperation.java:43)
at com.google.cloud.dataflow.worker.util.common.worker.OutputReceiver.process(OutputReceiver.java:48)
at com.google.cloud.dataflow.worker.GroupAlsoByWindowsParDoFn$1.output(GroupAlsoByWindowsParDoFn.java:181)
at com.google.cloud.dataflow.worker.GroupAlsoByWindowFnRunner$1.outputWindowedValue(GroupAlsoByWindowFnRunner.java:102)
at com.google.cloud.dataflow.worker.util.BatchGroupAlsoByWindowViaIteratorsFn.processElement(BatchGroupAlsoByWindowViaIteratorsFn.java:124)
at com.google.cloud.dataflow.worker.util.BatchGroupAlsoByWindowViaIteratorsFn.processElement(BatchGroupAlsoByWindowViaIteratorsFn.java:53)
at com.google.cloud.dataflow.worker.GroupAlsoByWindowFnRunner.invokeProcessElement(GroupAlsoByWindowFnRunner.java:115)
at com.google.cloud.dataflow.worker.GroupAlsoByWindowFnRunner.processElement(GroupAlsoByWindowFnRunner.java:73)
at com.google.cloud.dataflow.worker.GroupAlsoByWindowsParDoFn.processElement(GroupAlsoByWindowsParDoFn.java:113)
at com.google.cloud.dataflow.worker.util.common.worker.ParDoOperation.process(ParDoOperation.java:43)
at com.google.cloud.dataflow.worker.util.common.worker.OutputReceiver.process(OutputReceiver.java:48)
at com.google.cloud.dataflow.worker.util.common.worker.ReadOperation.runReadLoop(ReadOperation.java:200)
at com.google.cloud.dataflow.worker.util.common.worker.ReadOperation.start(ReadOperation.java:158)
at com.google.cloud.dataflow.worker.util.common.worker.MapTaskExecutor.execute(MapTaskExecutor.java:75)
at com.google.cloud.dataflow.worker.BatchDataflowWorker.executeWork(BatchDataflowWorker.java:391)
at com.google.cloud.dataflow.worker.BatchDataflowWorker.doWork(BatchDataflowWorker.java:360)
at com.google.cloud.dataflow.worker.BatchDataflowWorker.getAndPerformWork(BatchDataflowWorker.java:288)
at com.google.cloud.dataflow.worker.DataflowBatchWorkerHarness$WorkerThread.doWork(DataflowBatchWorkerHarness.java:134)
at com.google.cloud.dataflow.worker.DataflowBatchWorkerHarness$WorkerThread.call(DataflowBatchWorkerHarness.java:114)
at com.google.cloud.dataflow.worker.DataflowBatchWorkerHarness$WorkerThread.call(DataflowBatchWorkerHarness.java:101)
at java.util.concurrent.FutureTask.run(FutureTask.java:266)
at java.util.concurrent.ThreadPoolExecutor.runWorker(ThreadPoolExecutor.java:1142)
at java.util.concurrent.ThreadPoolExecutor$Worker.run(ThreadPoolExecutor.java:617)
at java.lang.Thread.run(Thread.java:745)
Workflow failed. Causes: S16:PAssert$33/GroupGlobally/GroupDummyAndContents/Read+PAssert$33/GroupGlobally/GroupDummyAndContents/GroupByWindow+PAssert$33/GroupGlobally/Values/Values/Map+PAssert$33/GroupGlobally/ParDo(Concat)+PAssert$33/GetPane/Map+PAssert$33/RunChecks+PAssert$33/VerifyAssertions/ParDo(DefaultConclude) failed., A work item was attempted 4 times without success. Each time the worker eventually lost contact with the service. The work item was attempted on:
viewtest0testsingletonsid-06161436-urr6-harness-fjt2,
viewtest0testsingletonsid-06161436-urr6-harness-fjt2,
viewtest0testsingletonsid-06161436-urr6-harness-fjt2,
viewtest0testsingletonsid-06161436-urr6-harness-fjt2
at org.apache.beam.runners.dataflow.TestDataflowRunner.run(TestDataflowRunner.java:134)
at org.apache.beam.runners.dataflow.TestDataflowRunner.run(TestDataflowRunner.java:90)
at org.apache.beam.runners.dataflow.TestDataflowRunner.run(TestDataflowRunner.java:55)
at org.apache.beam.sdk.Pipeline.run(Pipeline.java:311)
at org.apache.beam.sdk.testing.TestPipeline.run(TestPipeline.java:348)
at org.apache.beam.sdk.testing.TestPipeline.run(TestPipeline.java:329)
at org.apache.beam.sdk.transforms.ViewTest.testSingletonSideInput(ViewTest.java:109)
Gradle Test Executor 40 finished executing tests.
> Task :beam-runners-google-cloud-dataflow-java:validatesRunnerTest
209 tests completed, 190 failed, 2 skipped
Finished generating test XML results (2.095 secs) into: <https://builds.apache.org/job/beam_PostCommit_Java_ValidatesRunner_Dataflow_Gradle/ws/src/runners/google-cloud-dataflow-java/build/test-results/validatesRunnerTest>
Generating HTML test report...
Finished generating test html results (1.109 secs) into: <https://builds.apache.org/job/beam_PostCommit_Java_ValidatesRunner_Dataflow_Gradle/ws/src/runners/google-cloud-dataflow-java/build/reports/tests/validatesRunnerTest>
> Task :beam-runners-google-cloud-dataflow-java:validatesRunnerTest FAILED
:beam-runners-google-cloud-dataflow-java:validatesRunnerTest (Thread[Task worker for ':' Thread 44,5,main]) completed. Took 2 hrs 22 mins 43.98 secs.
FAILURE: Build failed with an exception.
* What went wrong:
Execution failed for task ':beam-runners-google-cloud-dataflow-java:validatesRunnerTest'.
> There were failing tests. See the report at: file://<https://builds.apache.org/job/beam_PostCommit_Java_ValidatesRunner_Dataflow_Gradle/ws/src/runners/google-cloud-dataflow-java/build/reports/tests/validatesRunnerTest/index.html>
* Try:
Run with --stacktrace option to get the stack trace. Run with --debug option to get more log output. Run with --scan to get full insights.
* Get more help at https://help.gradle.org
Deprecated Gradle features were used in this build, making it incompatible with Gradle 5.0.
See https://docs.gradle.org/4.8/userguide/command_line_interface.html#sec:command_line_warnings
BUILD FAILED in 2h 24m 39s
38 actionable tasks: 34 executed, 4 from cache
Publishing build scan...
https://gradle.com/s/cuxubxigzs2dc
Build cache (/home/jenkins/.gradle/caches/build-cache-1) remove files older than Sat Jun 09 19:15:50 UTC 2018.
Build cache (/home/jenkins/.gradle/caches/build-cache-1) removing 141 cache entries (46 MB reclaimed).
Build cache (/home/jenkins/.gradle/caches/build-cache-1) cleaned up in 0.058 secs.
Build step 'Invoke Gradle script' changed build result to FAILURE
Build step 'Invoke Gradle script' marked build as failure
Recording test results
Not sending mail to unregistered user apilloud@google.com
Not sending mail to unregistered user robbe.sneyders@ml6.eu
Not sending mail to unregistered user github@alasdairhodge.co.uk
Not sending mail to unregistered user ringwalt@google.com
Not sending mail to unregistered user aaltay@gmail.com
Not sending mail to unregistered user swegner@google.com
Not sending mail to unregistered user robinyq@rodete-desktop-imager.corp.google.com
Not sending mail to unregistered user ehudm@google.com
Not sending mail to unregistered user kedin@google.com
Not sending mail to unregistered user jiangkai@gmail.com
Not sending mail to unregistered user kirpichov@google.com
Not sending mail to unregistered user fvoichick@gmail.com
Jenkins build is back to normal :
beam_PostCommit_Java_ValidatesRunner_Dataflow_Gradle #527
Posted by Apache Jenkins Server <je...@builds.apache.org>.
See <https://builds.apache.org/job/beam_PostCommit_Java_ValidatesRunner_Dataflow_Gradle/527/display/redirect>
Build failed in Jenkins:
beam_PostCommit_Java_ValidatesRunner_Dataflow_Gradle #526
Posted by Apache Jenkins Server <je...@builds.apache.org>.
See <https://builds.apache.org/job/beam_PostCommit_Java_ValidatesRunner_Dataflow_Gradle/526/display/redirect?page=changes>
Changes:
[ankurgoenka] Fixing concurrency bug in BeamFileSystemArtifactServicesTest
[iemejia] [BEAM-4399] Get Cassandra options out of IOTestPipelineOptions
[iemejia] [BEAM-4399] Refactor CassandraIOIT to be writeThenRead
[iemejia] [BEAM-4399] Update Cassandra driver to version 3.5.0
[Pablo] Upgrading python dependency on httplib2
[kenn] Fix case sensitivity in JdbcDriverTest
------------------------------------------
[...truncated 54.53 MB...]
at com.google.cloud.dataflow.worker.DataflowBatchWorkerHarness$WorkerThread.call(DataflowBatchWorkerHarness.java:101)
at java.util.concurrent.FutureTask.run(FutureTask.java:266)
at java.util.concurrent.ThreadPoolExecutor.runWorker(ThreadPoolExecutor.java:1142)
at java.util.concurrent.ThreadPoolExecutor$Worker.run(ThreadPoolExecutor.java:617)
at java.lang.Thread.run(Thread.java:745)
Caused by: org.apache.beam.sdk.util.UserCodeException: java.lang.AssertionError: OutputSideInputs/ParMultiDo(Anonymous).output: org/hamcrest/Matchers
at org.apache.beam.sdk.util.UserCodeException.wrap(UserCodeException.java:36)
at org.apache.beam.sdk.testing.PAssert$DefaultConcludeFn$DoFnInvoker.invokeProcessElement(Unknown Source)
at org.apache.beam.runners.core.SimpleDoFnRunner.invokeProcessElement(SimpleDoFnRunner.java:185)
at org.apache.beam.runners.core.SimpleDoFnRunner.processElement(SimpleDoFnRunner.java:149)
at com.google.cloud.dataflow.worker.SimpleParDoFn.processElement(SimpleParDoFn.java:323)
at com.google.cloud.dataflow.worker.util.common.worker.ParDoOperation.process(ParDoOperation.java:43)
at com.google.cloud.dataflow.worker.util.common.worker.OutputReceiver.process(OutputReceiver.java:48)
at com.google.cloud.dataflow.worker.SimpleParDoFn$1.output(SimpleParDoFn.java:271)
at org.apache.beam.runners.core.SimpleDoFnRunner.outputWindowedValue(SimpleDoFnRunner.java:219)
at org.apache.beam.runners.core.SimpleDoFnRunner.access$700(SimpleDoFnRunner.java:69)
at org.apache.beam.runners.core.SimpleDoFnRunner$DoFnProcessContext.output(SimpleDoFnRunner.java:517)
at org.apache.beam.runners.core.SimpleDoFnRunner$DoFnProcessContext.output(SimpleDoFnRunner.java:505)
at org.apache.beam.sdk.testing.PAssert$GroupedValuesCheckerDoFn.processElement(PAssert.java:1215)
at org.apache.beam.sdk.testing.PAssert$GroupedValuesCheckerDoFn$DoFnInvoker.invokeProcessElement(Unknown Source)
at org.apache.beam.runners.core.SimpleDoFnRunner.invokeProcessElement(SimpleDoFnRunner.java:185)
at org.apache.beam.runners.core.SimpleDoFnRunner.processElement(SimpleDoFnRunner.java:149)
at com.google.cloud.dataflow.worker.SimpleParDoFn.processElement(SimpleParDoFn.java:323)
at com.google.cloud.dataflow.worker.util.common.worker.ParDoOperation.process(ParDoOperation.java:43)
at com.google.cloud.dataflow.worker.util.common.worker.OutputReceiver.process(OutputReceiver.java:48)
at com.google.cloud.dataflow.worker.SimpleParDoFn$1.output(SimpleParDoFn.java:271)
at org.apache.beam.runners.core.SimpleDoFnRunner.outputWindowedValue(SimpleDoFnRunner.java:219)
at org.apache.beam.runners.core.SimpleDoFnRunner.access$700(SimpleDoFnRunner.java:69)
at org.apache.beam.runners.core.SimpleDoFnRunner$DoFnProcessContext.output(SimpleDoFnRunner.java:517)
at org.apache.beam.sdk.transforms.DoFnOutputReceivers$WindowedContextOutputReceiver.output(DoFnOutputReceivers.java:42)
at org.apache.beam.sdk.transforms.MapElements$1.processElement(MapElements.java:131)
at org.apache.beam.sdk.transforms.MapElements$1$DoFnInvoker.invokeProcessElement(Unknown Source)
at org.apache.beam.runners.core.SimpleDoFnRunner.invokeProcessElement(SimpleDoFnRunner.java:185)
at org.apache.beam.runners.core.SimpleDoFnRunner.processElement(SimpleDoFnRunner.java:149)
at com.google.cloud.dataflow.worker.SimpleParDoFn.processElement(SimpleParDoFn.java:323)
at com.google.cloud.dataflow.worker.util.common.worker.ParDoOperation.process(ParDoOperation.java:43)
at com.google.cloud.dataflow.worker.util.common.worker.OutputReceiver.process(OutputReceiver.java:48)
at com.google.cloud.dataflow.worker.SimpleParDoFn$1.output(SimpleParDoFn.java:271)
at org.apache.beam.runners.core.SimpleDoFnRunner.outputWindowedValue(SimpleDoFnRunner.java:219)
at org.apache.beam.runners.core.SimpleDoFnRunner.access$700(SimpleDoFnRunner.java:69)
at org.apache.beam.runners.core.SimpleDoFnRunner$DoFnProcessContext.output(SimpleDoFnRunner.java:517)
at org.apache.beam.runners.core.SimpleDoFnRunner$DoFnProcessContext.output(SimpleDoFnRunner.java:505)
at org.apache.beam.sdk.testing.PAssert$ConcatFn.processElement(PAssert.java:1049)
at org.apache.beam.sdk.testing.PAssert$ConcatFn$DoFnInvoker.invokeProcessElement(Unknown Source)
at org.apache.beam.runners.core.SimpleDoFnRunner.invokeProcessElement(SimpleDoFnRunner.java:185)
at org.apache.beam.runners.core.SimpleDoFnRunner.processElement(SimpleDoFnRunner.java:149)
at com.google.cloud.dataflow.worker.SimpleParDoFn.processElement(SimpleParDoFn.java:323)
at com.google.cloud.dataflow.worker.util.common.worker.ParDoOperation.process(ParDoOperation.java:43)
at com.google.cloud.dataflow.worker.util.common.worker.OutputReceiver.process(OutputReceiver.java:48)
at com.google.cloud.dataflow.worker.SimpleParDoFn$1.output(SimpleParDoFn.java:271)
at org.apache.beam.runners.core.SimpleDoFnRunner.outputWindowedValue(SimpleDoFnRunner.java:219)
at org.apache.beam.runners.core.SimpleDoFnRunner.access$700(SimpleDoFnRunner.java:69)
at org.apache.beam.runners.core.SimpleDoFnRunner$DoFnProcessContext.output(SimpleDoFnRunner.java:517)
at org.apache.beam.sdk.transforms.DoFnOutputReceivers$WindowedContextOutputReceiver.output(DoFnOutputReceivers.java:42)
at org.apache.beam.sdk.transforms.MapElements$1.processElement(MapElements.java:131)
at org.apache.beam.sdk.transforms.MapElements$1$DoFnInvoker.invokeProcessElement(Unknown Source)
at org.apache.beam.runners.core.SimpleDoFnRunner.invokeProcessElement(SimpleDoFnRunner.java:185)
at org.apache.beam.runners.core.SimpleDoFnRunner.processElement(SimpleDoFnRunner.java:149)
at com.google.cloud.dataflow.worker.SimpleParDoFn.processElement(SimpleParDoFn.java:323)
at com.google.cloud.dataflow.worker.util.common.worker.ParDoOperation.process(ParDoOperation.java:43)
at com.google.cloud.dataflow.worker.util.common.worker.OutputReceiver.process(OutputReceiver.java:48)
at com.google.cloud.dataflow.worker.GroupAlsoByWindowsParDoFn$1.output(GroupAlsoByWindowsParDoFn.java:181)
... 21 more
Caused by: java.lang.AssertionError: OutputSideInputs/ParMultiDo(Anonymous).output: org/hamcrest/Matchers
at org.apache.beam.sdk.testing.PAssert$PAssertionSite.capture(PAssert.java:168)
at org.apache.beam.sdk.testing.PAssert.that(PAssert.java:378)
at org.apache.beam.sdk.testing.PAssert.that(PAssert.java:370)
at org.apache.beam.sdk.transforms.ViewTest.testSingletonSideInput(ViewTest.java:107)
at sun.reflect.NativeMethodAccessorImpl.invoke0(Native Method)
at sun.reflect.NativeMethodAccessorImpl.invoke(NativeMethodAccessorImpl.java:62)
at sun.reflect.DelegatingMethodAccessorImpl.invoke(DelegatingMethodAccessorImpl.java:43)
at java.lang.reflect.Method.invoke(Method.java:498)
at org.junit.runners.model.FrameworkMethod$1.runReflectiveCall(FrameworkMethod.java:50)
at org.junit.internal.runners.model.ReflectiveCallable.run(ReflectiveCallable.java:12)
at org.junit.runners.model.FrameworkMethod.invokeExplosively(FrameworkMethod.java:47)
at org.junit.internal.runners.statements.InvokeMethod.evaluate(InvokeMethod.java:17)
at org.apache.beam.sdk.testing.TestPipeline$1.evaluate(TestPipeline.java:317)
at org.junit.rules.ExpectedException$ExpectedExceptionStatement.evaluate(ExpectedException.java:239)
at org.junit.rules.RunRules.evaluate(RunRules.java:20)
at org.junit.runners.ParentRunner.runLeaf(ParentRunner.java:325)
at org.junit.runners.BlockJUnit4ClassRunner.runChild(BlockJUnit4ClassRunner.java:78)
at org.junit.runners.BlockJUnit4ClassRunner.runChild(BlockJUnit4ClassRunner.java:57)
at org.junit.runners.ParentRunner$3.run(ParentRunner.java:290)
at org.junit.runners.ParentRunner$1.schedule(ParentRunner.java:71)
at org.junit.runners.ParentRunner.runChildren(ParentRunner.java:288)
at org.junit.runners.ParentRunner.access$000(ParentRunner.java:58)
at org.junit.runners.ParentRunner$2.evaluate(ParentRunner.java:268)
at org.junit.runners.ParentRunner.run(ParentRunner.java:363)
at org.gradle.api.internal.tasks.testing.junit.JUnitTestClassExecutor.runTestClass(JUnitTestClassExecutor.java:106)
at org.gradle.api.internal.tasks.testing.junit.JUnitTestClassExecutor.execute(JUnitTestClassExecutor.java:58)
at org.gradle.api.internal.tasks.testing.junit.JUnitTestClassExecutor.execute(JUnitTestClassExecutor.java:38)
at org.gradle.api.internal.tasks.testing.junit.AbstractJUnitTestClassProcessor.processTestClass(AbstractJUnitTestClassProcessor.java:66)
at org.gradle.api.internal.tasks.testing.SuiteTestClassProcessor.processTestClass(SuiteTestClassProcessor.java:51)
at sun.reflect.NativeMethodAccessorImpl.invoke0(Native Method)
at sun.reflect.NativeMethodAccessorImpl.invoke(NativeMethodAccessorImpl.java:62)
at sun.reflect.DelegatingMethodAccessorImpl.invoke(DelegatingMethodAccessorImpl.java:43)
at java.lang.reflect.Method.invoke(Method.java:498)
at org.gradle.internal.dispatch.ReflectionDispatch.dispatch(ReflectionDispatch.java:35)
at org.gradle.internal.dispatch.ReflectionDispatch.dispatch(ReflectionDispatch.java:24)
at org.gradle.internal.dispatch.ContextClassLoaderDispatch.dispatch(ContextClassLoaderDispatch.java:32)
at org.gradle.internal.dispatch.ProxyDispatchAdapter$DispatchingInvocationHandler.invoke(ProxyDispatchAdapter.java:93)
at com.sun.proxy.$Proxy2.processTestClass(Unknown Source)
at org.gradle.api.internal.tasks.testing.worker.TestWorker.processTestClass(TestWorker.java:109)
at sun.reflect.NativeMethodAccessorImpl.invoke0(Native Method)
at sun.reflect.NativeMethodAccessorImpl.invoke(NativeMethodAccessorImpl.java:62)
at sun.reflect.DelegatingMethodAccessorImpl.invoke(DelegatingMethodAccessorImpl.java:43)
at java.lang.reflect.Method.invoke(Method.java:498)
at org.gradle.internal.dispatch.ReflectionDispatch.dispatch(ReflectionDispatch.java:35)
at org.gradle.internal.dispatch.ReflectionDispatch.dispatch(ReflectionDispatch.java:24)
at org.gradle.internal.remote.internal.hub.MessageHubBackedObjectConnection$DispatchWrapper.dispatch(MessageHubBackedObjectConnection.java:155)
at org.gradle.internal.remote.internal.hub.MessageHubBackedObjectConnection$DispatchWrapper.dispatch(MessageHubBackedObjectConnection.java:137)
at org.gradle.internal.remote.internal.hub.MessageHub$Handler.run(MessageHub.java:404)
at org.gradle.internal.concurrent.ExecutorPolicy$CatchAndRecordFailures.onExecute(ExecutorPolicy.java:63)
at org.gradle.internal.concurrent.ManagedExecutorImpl$1.run(ManagedExecutorImpl.java:46)
at java.util.concurrent.ThreadPoolExecutor.runWorker(ThreadPoolExecutor.java:1149)
at java.util.concurrent.ThreadPoolExecutor$Worker.run(ThreadPoolExecutor.java:624)
at org.gradle.internal.concurrent.ThreadFactoryImpl$ManagedThreadRunnable.run(ThreadFactoryImpl.java:55)
Caused by: java.lang.NoClassDefFoundError: org/hamcrest/Matchers
at org.apache.beam.sdk.testing.PAssert$AssertContainsInAnyOrder.apply(PAssert.java:1322)
at org.apache.beam.sdk.testing.PAssert$AssertContainsInAnyOrder.apply(PAssert.java:1301)
at org.apache.beam.sdk.testing.PAssert$CheckRelationAgainstExpected.apply(PAssert.java:966)
at org.apache.beam.sdk.testing.PAssert$CheckRelationAgainstExpected.apply(PAssert.java:946)
at org.apache.beam.sdk.testing.PAssert.doChecks(PAssert.java:1250)
at org.apache.beam.sdk.testing.PAssert$GroupedValuesCheckerDoFn.processElement(PAssert.java:1215)
at org.apache.beam.sdk.testing.PAssert$GroupedValuesCheckerDoFn$DoFnInvoker.invokeProcessElement(Unknown Source)
at org.apache.beam.runners.core.SimpleDoFnRunner.invokeProcessElement(SimpleDoFnRunner.java:185)
at org.apache.beam.runners.core.SimpleDoFnRunner.processElement(SimpleDoFnRunner.java:149)
at com.google.cloud.dataflow.worker.SimpleParDoFn.processElement(SimpleParDoFn.java:323)
at com.google.cloud.dataflow.worker.util.common.worker.ParDoOperation.process(ParDoOperation.java:43)
at com.google.cloud.dataflow.worker.util.common.worker.OutputReceiver.process(OutputReceiver.java:48)
at com.google.cloud.dataflow.worker.SimpleParDoFn$1.output(SimpleParDoFn.java:271)
at org.apache.beam.runners.core.SimpleDoFnRunner.outputWindowedValue(SimpleDoFnRunner.java:219)
at org.apache.beam.runners.core.SimpleDoFnRunner.access$700(SimpleDoFnRunner.java:69)
at org.apache.beam.runners.core.SimpleDoFnRunner$DoFnProcessContext.output(SimpleDoFnRunner.java:517)
at org.apache.beam.sdk.transforms.DoFnOutputReceivers$WindowedContextOutputReceiver.output(DoFnOutputReceivers.java:42)
at org.apache.beam.sdk.transforms.MapElements$1.processElement(MapElements.java:131)
at org.apache.beam.sdk.transforms.MapElements$1$DoFnInvoker.invokeProcessElement(Unknown Source)
at org.apache.beam.runners.core.SimpleDoFnRunner.invokeProcessElement(SimpleDoFnRunner.java:185)
at org.apache.beam.runners.core.SimpleDoFnRunner.processElement(SimpleDoFnRunner.java:149)
at com.google.cloud.dataflow.worker.SimpleParDoFn.processElement(SimpleParDoFn.java:323)
at com.google.cloud.dataflow.worker.util.common.worker.ParDoOperation.process(ParDoOperation.java:43)
at com.google.cloud.dataflow.worker.util.common.worker.OutputReceiver.process(OutputReceiver.java:48)
at com.google.cloud.dataflow.worker.SimpleParDoFn$1.output(SimpleParDoFn.java:271)
at org.apache.beam.runners.core.SimpleDoFnRunner.outputWindowedValue(SimpleDoFnRunner.java:219)
at org.apache.beam.runners.core.SimpleDoFnRunner.access$700(SimpleDoFnRunner.java:69)
at org.apache.beam.runners.core.SimpleDoFnRunner$DoFnProcessContext.output(SimpleDoFnRunner.java:517)
at org.apache.beam.runners.core.SimpleDoFnRunner$DoFnProcessContext.output(SimpleDoFnRunner.java:505)
at org.apache.beam.sdk.testing.PAssert$ConcatFn.processElement(PAssert.java:1049)
at org.apache.beam.sdk.testing.PAssert$ConcatFn$DoFnInvoker.invokeProcessElement(Unknown Source)
at org.apache.beam.runners.core.SimpleDoFnRunner.invokeProcessElement(SimpleDoFnRunner.java:185)
at org.apache.beam.runners.core.SimpleDoFnRunner.processElement(SimpleDoFnRunner.java:149)
at com.google.cloud.dataflow.worker.SimpleParDoFn.processElement(SimpleParDoFn.java:323)
at com.google.cloud.dataflow.worker.util.common.worker.ParDoOperation.process(ParDoOperation.java:43)
at com.google.cloud.dataflow.worker.util.common.worker.OutputReceiver.process(OutputReceiver.java:48)
at com.google.cloud.dataflow.worker.SimpleParDoFn$1.output(SimpleParDoFn.java:271)
at org.apache.beam.runners.core.SimpleDoFnRunner.outputWindowedValue(SimpleDoFnRunner.java:219)
at org.apache.beam.runners.core.SimpleDoFnRunner.access$700(SimpleDoFnRunner.java:69)
at org.apache.beam.runners.core.SimpleDoFnRunner$DoFnProcessContext.output(SimpleDoFnRunner.java:517)
at org.apache.beam.sdk.transforms.DoFnOutputReceivers$WindowedContextOutputReceiver.output(DoFnOutputReceivers.java:42)
at org.apache.beam.sdk.transforms.MapElements$1.processElement(MapElements.java:131)
at org.apache.beam.sdk.transforms.MapElements$1$DoFnInvoker.invokeProcessElement(Unknown Source)
at org.apache.beam.runners.core.SimpleDoFnRunner.invokeProcessElement(SimpleDoFnRunner.java:185)
at org.apache.beam.runners.core.SimpleDoFnRunner.processElement(SimpleDoFnRunner.java:149)
at com.google.cloud.dataflow.worker.SimpleParDoFn.processElement(SimpleParDoFn.java:323)
at com.google.cloud.dataflow.worker.util.common.worker.ParDoOperation.process(ParDoOperation.java:43)
at com.google.cloud.dataflow.worker.util.common.worker.OutputReceiver.process(OutputReceiver.java:48)
at com.google.cloud.dataflow.worker.GroupAlsoByWindowsParDoFn$1.output(GroupAlsoByWindowsParDoFn.java:181)
at com.google.cloud.dataflow.worker.GroupAlsoByWindowFnRunner$1.outputWindowedValue(GroupAlsoByWindowFnRunner.java:102)
at com.google.cloud.dataflow.worker.util.BatchGroupAlsoByWindowViaIteratorsFn.processElement(BatchGroupAlsoByWindowViaIteratorsFn.java:124)
at com.google.cloud.dataflow.worker.util.BatchGroupAlsoByWindowViaIteratorsFn.processElement(BatchGroupAlsoByWindowViaIteratorsFn.java:53)
at com.google.cloud.dataflow.worker.GroupAlsoByWindowFnRunner.invokeProcessElement(GroupAlsoByWindowFnRunner.java:115)
at com.google.cloud.dataflow.worker.GroupAlsoByWindowFnRunner.processElement(GroupAlsoByWindowFnRunner.java:73)
at com.google.cloud.dataflow.worker.GroupAlsoByWindowsParDoFn.processElement(GroupAlsoByWindowsParDoFn.java:113)
at com.google.cloud.dataflow.worker.util.common.worker.ParDoOperation.process(ParDoOperation.java:43)
at com.google.cloud.dataflow.worker.util.common.worker.OutputReceiver.process(OutputReceiver.java:48)
at com.google.cloud.dataflow.worker.util.common.worker.ReadOperation.runReadLoop(ReadOperation.java:200)
at com.google.cloud.dataflow.worker.util.common.worker.ReadOperation.start(ReadOperation.java:158)
at com.google.cloud.dataflow.worker.util.common.worker.MapTaskExecutor.execute(MapTaskExecutor.java:75)
at com.google.cloud.dataflow.worker.BatchDataflowWorker.executeWork(BatchDataflowWorker.java:391)
at com.google.cloud.dataflow.worker.BatchDataflowWorker.doWork(BatchDataflowWorker.java:360)
at com.google.cloud.dataflow.worker.BatchDataflowWorker.getAndPerformWork(BatchDataflowWorker.java:288)
at com.google.cloud.dataflow.worker.DataflowBatchWorkerHarness$WorkerThread.doWork(DataflowBatchWorkerHarness.java:134)
at com.google.cloud.dataflow.worker.DataflowBatchWorkerHarness$WorkerThread.call(DataflowBatchWorkerHarness.java:114)
at com.google.cloud.dataflow.worker.DataflowBatchWorkerHarness$WorkerThread.call(DataflowBatchWorkerHarness.java:101)
at java.util.concurrent.FutureTask.run(FutureTask.java:266)
at java.util.concurrent.ThreadPoolExecutor.runWorker(ThreadPoolExecutor.java:1142)
at java.util.concurrent.ThreadPoolExecutor$Worker.run(ThreadPoolExecutor.java:617)
at java.lang.Thread.run(Thread.java:745)
Workflow failed. Causes: S16:PAssert$33/GroupGlobally/GroupDummyAndContents/Read+PAssert$33/GroupGlobally/GroupDummyAndContents/GroupByWindow+PAssert$33/GroupGlobally/Values/Values/Map+PAssert$33/GroupGlobally/ParDo(Concat)+PAssert$33/GetPane/Map+PAssert$33/RunChecks+PAssert$33/VerifyAssertions/ParDo(DefaultConclude) failed., A work item was attempted 4 times without success. Each time the worker eventually lost contact with the service. The work item was attempted on:
viewtest0testsingletonsid-06181320-128m-harness-rqxv,
viewtest0testsingletonsid-06181320-128m-harness-rqxv,
viewtest0testsingletonsid-06181320-128m-harness-rqxv,
viewtest0testsingletonsid-06181320-128m-harness-rqxv
at org.apache.beam.runners.dataflow.TestDataflowRunner.run(TestDataflowRunner.java:134)
at org.apache.beam.runners.dataflow.TestDataflowRunner.run(TestDataflowRunner.java:90)
at org.apache.beam.runners.dataflow.TestDataflowRunner.run(TestDataflowRunner.java:55)
at org.apache.beam.sdk.Pipeline.run(Pipeline.java:311)
at org.apache.beam.sdk.testing.TestPipeline.run(TestPipeline.java:348)
at org.apache.beam.sdk.testing.TestPipeline.run(TestPipeline.java:329)
at org.apache.beam.sdk.transforms.ViewTest.testSingletonSideInput(ViewTest.java:109)
Gradle Test Executor 36 finished executing tests.
> Task :beam-runners-google-cloud-dataflow-java:validatesRunnerTest
209 tests completed, 190 failed, 2 skipped
Finished generating test XML results (1.242 secs) into: <https://builds.apache.org/job/beam_PostCommit_Java_ValidatesRunner_Dataflow_Gradle/ws/src/runners/google-cloud-dataflow-java/build/test-results/validatesRunnerTest>
Generating HTML test report...
Finished generating test html results (0.644 secs) into: <https://builds.apache.org/job/beam_PostCommit_Java_ValidatesRunner_Dataflow_Gradle/ws/src/runners/google-cloud-dataflow-java/build/reports/tests/validatesRunnerTest>
> Task :beam-runners-google-cloud-dataflow-java:validatesRunnerTest FAILED
:beam-runners-google-cloud-dataflow-java:validatesRunnerTest (Thread[Task worker for ':' Thread 21,5,main]) completed. Took 2 hrs 33 mins 52.365 secs.
FAILURE: Build failed with an exception.
* What went wrong:
Execution failed for task ':beam-runners-google-cloud-dataflow-java:validatesRunnerTest'.
> There were failing tests. See the report at: file://<https://builds.apache.org/job/beam_PostCommit_Java_ValidatesRunner_Dataflow_Gradle/ws/src/runners/google-cloud-dataflow-java/build/reports/tests/validatesRunnerTest/index.html>
* Try:
Run with --stacktrace option to get the stack trace. Run with --debug option to get more log output. Run with --scan to get full insights.
* Get more help at https://help.gradle.org
Deprecated Gradle features were used in this build, making it incompatible with Gradle 5.0.
See https://docs.gradle.org/4.8/userguide/command_line_interface.html#sec:command_line_warnings
BUILD FAILED in 2h 34m 57s
38 actionable tasks: 34 executed, 4 from cache
Publishing build scan...
https://gradle.com/s/bs4geqynp7kl6
Build step 'Invoke Gradle script' changed build result to FAILURE
Build step 'Invoke Gradle script' marked build as failure
Recording test results
Not sending mail to unregistered user apilloud@google.com
Not sending mail to unregistered user robbe.sneyders@ml6.eu
Not sending mail to unregistered user github@alasdairhodge.co.uk
Not sending mail to unregistered user ringwalt@google.com
Not sending mail to unregistered user aaltay@gmail.com
Not sending mail to unregistered user swegner@google.com
Not sending mail to unregistered user ankurgoenka@gmail.com
Not sending mail to unregistered user robinyq@rodete-desktop-imager.corp.google.com
Not sending mail to unregistered user ehudm@google.com
Not sending mail to unregistered user kedin@google.com
Not sending mail to unregistered user jiangkai@gmail.com
Not sending mail to unregistered user kirpichov@google.com
Not sending mail to unregistered user fvoichick@gmail.com
Build failed in Jenkins:
beam_PostCommit_Java_ValidatesRunner_Dataflow_Gradle #525
Posted by Apache Jenkins Server <je...@builds.apache.org>.
See <https://builds.apache.org/job/beam_PostCommit_Java_ValidatesRunner_Dataflow_Gradle/525/display/redirect?page=changes>
Changes:
[kedin] [SQL] Add INSERT tests to JdbcDriverTest
[kedin] [SQL] Add complex type test to JdbcDriverTest
------------------------------------------
[...truncated 54.59 MB...]
at com.google.cloud.dataflow.worker.DataflowBatchWorkerHarness$WorkerThread.call(DataflowBatchWorkerHarness.java:114)
at com.google.cloud.dataflow.worker.DataflowBatchWorkerHarness$WorkerThread.call(DataflowBatchWorkerHarness.java:101)
at java.util.concurrent.FutureTask.run(FutureTask.java:266)
at java.util.concurrent.ThreadPoolExecutor.runWorker(ThreadPoolExecutor.java:1142)
at java.util.concurrent.ThreadPoolExecutor$Worker.run(ThreadPoolExecutor.java:617)
at java.lang.Thread.run(Thread.java:745)
Caused by: org.apache.beam.sdk.util.UserCodeException: java.lang.AssertionError: OutputSideInputs/ParMultiDo(Anonymous).output: org/hamcrest/Matchers
at org.apache.beam.sdk.util.UserCodeException.wrap(UserCodeException.java:36)
at org.apache.beam.sdk.testing.PAssert$DefaultConcludeFn$DoFnInvoker.invokeProcessElement(Unknown Source)
at org.apache.beam.runners.core.SimpleDoFnRunner.invokeProcessElement(SimpleDoFnRunner.java:185)
at org.apache.beam.runners.core.SimpleDoFnRunner.processElement(SimpleDoFnRunner.java:149)
at com.google.cloud.dataflow.worker.SimpleParDoFn.processElement(SimpleParDoFn.java:323)
at com.google.cloud.dataflow.worker.util.common.worker.ParDoOperation.process(ParDoOperation.java:43)
at com.google.cloud.dataflow.worker.util.common.worker.OutputReceiver.process(OutputReceiver.java:48)
at com.google.cloud.dataflow.worker.SimpleParDoFn$1.output(SimpleParDoFn.java:271)
at org.apache.beam.runners.core.SimpleDoFnRunner.outputWindowedValue(SimpleDoFnRunner.java:219)
at org.apache.beam.runners.core.SimpleDoFnRunner.access$700(SimpleDoFnRunner.java:69)
at org.apache.beam.runners.core.SimpleDoFnRunner$DoFnProcessContext.output(SimpleDoFnRunner.java:517)
at org.apache.beam.runners.core.SimpleDoFnRunner$DoFnProcessContext.output(SimpleDoFnRunner.java:505)
at org.apache.beam.sdk.testing.PAssert$GroupedValuesCheckerDoFn.processElement(PAssert.java:1215)
at org.apache.beam.sdk.testing.PAssert$GroupedValuesCheckerDoFn$DoFnInvoker.invokeProcessElement(Unknown Source)
at org.apache.beam.runners.core.SimpleDoFnRunner.invokeProcessElement(SimpleDoFnRunner.java:185)
at org.apache.beam.runners.core.SimpleDoFnRunner.processElement(SimpleDoFnRunner.java:149)
at com.google.cloud.dataflow.worker.SimpleParDoFn.processElement(SimpleParDoFn.java:323)
at com.google.cloud.dataflow.worker.util.common.worker.ParDoOperation.process(ParDoOperation.java:43)
at com.google.cloud.dataflow.worker.util.common.worker.OutputReceiver.process(OutputReceiver.java:48)
at com.google.cloud.dataflow.worker.SimpleParDoFn$1.output(SimpleParDoFn.java:271)
at org.apache.beam.runners.core.SimpleDoFnRunner.outputWindowedValue(SimpleDoFnRunner.java:219)
at org.apache.beam.runners.core.SimpleDoFnRunner.access$700(SimpleDoFnRunner.java:69)
at org.apache.beam.runners.core.SimpleDoFnRunner$DoFnProcessContext.output(SimpleDoFnRunner.java:517)
at org.apache.beam.sdk.transforms.DoFnOutputReceivers$WindowedContextOutputReceiver.output(DoFnOutputReceivers.java:42)
at org.apache.beam.sdk.transforms.MapElements$1.processElement(MapElements.java:131)
at org.apache.beam.sdk.transforms.MapElements$1$DoFnInvoker.invokeProcessElement(Unknown Source)
at org.apache.beam.runners.core.SimpleDoFnRunner.invokeProcessElement(SimpleDoFnRunner.java:185)
at org.apache.beam.runners.core.SimpleDoFnRunner.processElement(SimpleDoFnRunner.java:149)
at com.google.cloud.dataflow.worker.SimpleParDoFn.processElement(SimpleParDoFn.java:323)
at com.google.cloud.dataflow.worker.util.common.worker.ParDoOperation.process(ParDoOperation.java:43)
at com.google.cloud.dataflow.worker.util.common.worker.OutputReceiver.process(OutputReceiver.java:48)
at com.google.cloud.dataflow.worker.SimpleParDoFn$1.output(SimpleParDoFn.java:271)
at org.apache.beam.runners.core.SimpleDoFnRunner.outputWindowedValue(SimpleDoFnRunner.java:219)
at org.apache.beam.runners.core.SimpleDoFnRunner.access$700(SimpleDoFnRunner.java:69)
at org.apache.beam.runners.core.SimpleDoFnRunner$DoFnProcessContext.output(SimpleDoFnRunner.java:517)
at org.apache.beam.runners.core.SimpleDoFnRunner$DoFnProcessContext.output(SimpleDoFnRunner.java:505)
at org.apache.beam.sdk.testing.PAssert$ConcatFn.processElement(PAssert.java:1049)
at org.apache.beam.sdk.testing.PAssert$ConcatFn$DoFnInvoker.invokeProcessElement(Unknown Source)
at org.apache.beam.runners.core.SimpleDoFnRunner.invokeProcessElement(SimpleDoFnRunner.java:185)
at org.apache.beam.runners.core.SimpleDoFnRunner.processElement(SimpleDoFnRunner.java:149)
at com.google.cloud.dataflow.worker.SimpleParDoFn.processElement(SimpleParDoFn.java:323)
at com.google.cloud.dataflow.worker.util.common.worker.ParDoOperation.process(ParDoOperation.java:43)
at com.google.cloud.dataflow.worker.util.common.worker.OutputReceiver.process(OutputReceiver.java:48)
at com.google.cloud.dataflow.worker.SimpleParDoFn$1.output(SimpleParDoFn.java:271)
at org.apache.beam.runners.core.SimpleDoFnRunner.outputWindowedValue(SimpleDoFnRunner.java:219)
at org.apache.beam.runners.core.SimpleDoFnRunner.access$700(SimpleDoFnRunner.java:69)
at org.apache.beam.runners.core.SimpleDoFnRunner$DoFnProcessContext.output(SimpleDoFnRunner.java:517)
at org.apache.beam.sdk.transforms.DoFnOutputReceivers$WindowedContextOutputReceiver.output(DoFnOutputReceivers.java:42)
at org.apache.beam.sdk.transforms.MapElements$1.processElement(MapElements.java:131)
at org.apache.beam.sdk.transforms.MapElements$1$DoFnInvoker.invokeProcessElement(Unknown Source)
at org.apache.beam.runners.core.SimpleDoFnRunner.invokeProcessElement(SimpleDoFnRunner.java:185)
at org.apache.beam.runners.core.SimpleDoFnRunner.processElement(SimpleDoFnRunner.java:149)
at com.google.cloud.dataflow.worker.SimpleParDoFn.processElement(SimpleParDoFn.java:323)
at com.google.cloud.dataflow.worker.util.common.worker.ParDoOperation.process(ParDoOperation.java:43)
at com.google.cloud.dataflow.worker.util.common.worker.OutputReceiver.process(OutputReceiver.java:48)
at com.google.cloud.dataflow.worker.GroupAlsoByWindowsParDoFn$1.output(GroupAlsoByWindowsParDoFn.java:181)
... 21 more
Caused by: java.lang.AssertionError: OutputSideInputs/ParMultiDo(Anonymous).output: org/hamcrest/Matchers
at org.apache.beam.sdk.testing.PAssert$PAssertionSite.capture(PAssert.java:168)
at org.apache.beam.sdk.testing.PAssert.that(PAssert.java:378)
at org.apache.beam.sdk.testing.PAssert.that(PAssert.java:370)
at org.apache.beam.sdk.transforms.ViewTest.testSingletonSideInput(ViewTest.java:107)
at sun.reflect.NativeMethodAccessorImpl.invoke0(Native Method)
at sun.reflect.NativeMethodAccessorImpl.invoke(NativeMethodAccessorImpl.java:62)
at sun.reflect.DelegatingMethodAccessorImpl.invoke(DelegatingMethodAccessorImpl.java:43)
at java.lang.reflect.Method.invoke(Method.java:498)
at org.junit.runners.model.FrameworkMethod$1.runReflectiveCall(FrameworkMethod.java:50)
at org.junit.internal.runners.model.ReflectiveCallable.run(ReflectiveCallable.java:12)
at org.junit.runners.model.FrameworkMethod.invokeExplosively(FrameworkMethod.java:47)
at org.junit.internal.runners.statements.InvokeMethod.evaluate(InvokeMethod.java:17)
at org.apache.beam.sdk.testing.TestPipeline$1.evaluate(TestPipeline.java:317)
at org.junit.rules.ExpectedException$ExpectedExceptionStatement.evaluate(ExpectedException.java:239)
at org.junit.rules.RunRules.evaluate(RunRules.java:20)
at org.junit.runners.ParentRunner.runLeaf(ParentRunner.java:325)
at org.junit.runners.BlockJUnit4ClassRunner.runChild(BlockJUnit4ClassRunner.java:78)
at org.junit.runners.BlockJUnit4ClassRunner.runChild(BlockJUnit4ClassRunner.java:57)
at org.junit.runners.ParentRunner$3.run(ParentRunner.java:290)
at org.junit.runners.ParentRunner$1.schedule(ParentRunner.java:71)
at org.junit.runners.ParentRunner.runChildren(ParentRunner.java:288)
at org.junit.runners.ParentRunner.access$000(ParentRunner.java:58)
at org.junit.runners.ParentRunner$2.evaluate(ParentRunner.java:268)
at org.junit.runners.ParentRunner.run(ParentRunner.java:363)
at org.gradle.api.internal.tasks.testing.junit.JUnitTestClassExecutor.runTestClass(JUnitTestClassExecutor.java:106)
at org.gradle.api.internal.tasks.testing.junit.JUnitTestClassExecutor.execute(JUnitTestClassExecutor.java:58)
at org.gradle.api.internal.tasks.testing.junit.JUnitTestClassExecutor.execute(JUnitTestClassExecutor.java:38)
at org.gradle.api.internal.tasks.testing.junit.AbstractJUnitTestClassProcessor.processTestClass(AbstractJUnitTestClassProcessor.java:66)
at org.gradle.api.internal.tasks.testing.SuiteTestClassProcessor.processTestClass(SuiteTestClassProcessor.java:51)
at sun.reflect.NativeMethodAccessorImpl.invoke0(Native Method)
at sun.reflect.NativeMethodAccessorImpl.invoke(NativeMethodAccessorImpl.java:62)
at sun.reflect.DelegatingMethodAccessorImpl.invoke(DelegatingMethodAccessorImpl.java:43)
at java.lang.reflect.Method.invoke(Method.java:498)
at org.gradle.internal.dispatch.ReflectionDispatch.dispatch(ReflectionDispatch.java:35)
at org.gradle.internal.dispatch.ReflectionDispatch.dispatch(ReflectionDispatch.java:24)
at org.gradle.internal.dispatch.ContextClassLoaderDispatch.dispatch(ContextClassLoaderDispatch.java:32)
at org.gradle.internal.dispatch.ProxyDispatchAdapter$DispatchingInvocationHandler.invoke(ProxyDispatchAdapter.java:93)
at com.sun.proxy.$Proxy2.processTestClass(Unknown Source)
at org.gradle.api.internal.tasks.testing.worker.TestWorker.processTestClass(TestWorker.java:109)
at sun.reflect.NativeMethodAccessorImpl.invoke0(Native Method)
at sun.reflect.NativeMethodAccessorImpl.invoke(NativeMethodAccessorImpl.java:62)
at sun.reflect.DelegatingMethodAccessorImpl.invoke(DelegatingMethodAccessorImpl.java:43)
at java.lang.reflect.Method.invoke(Method.java:498)
at org.gradle.internal.dispatch.ReflectionDispatch.dispatch(ReflectionDispatch.java:35)
at org.gradle.internal.dispatch.ReflectionDispatch.dispatch(ReflectionDispatch.java:24)
at org.gradle.internal.remote.internal.hub.MessageHubBackedObjectConnection$DispatchWrapper.dispatch(MessageHubBackedObjectConnection.java:155)
at org.gradle.internal.remote.internal.hub.MessageHubBackedObjectConnection$DispatchWrapper.dispatch(MessageHubBackedObjectConnection.java:137)
at org.gradle.internal.remote.internal.hub.MessageHub$Handler.run(MessageHub.java:404)
at org.gradle.internal.concurrent.ExecutorPolicy$CatchAndRecordFailures.onExecute(ExecutorPolicy.java:63)
at org.gradle.internal.concurrent.ManagedExecutorImpl$1.run(ManagedExecutorImpl.java:46)
at java.util.concurrent.ThreadPoolExecutor.runWorker(ThreadPoolExecutor.java:1149)
at java.util.concurrent.ThreadPoolExecutor$Worker.run(ThreadPoolExecutor.java:624)
at org.gradle.internal.concurrent.ThreadFactoryImpl$ManagedThreadRunnable.run(ThreadFactoryImpl.java:55)
Caused by: java.lang.NoClassDefFoundError: org/hamcrest/Matchers
at org.apache.beam.sdk.testing.PAssert$AssertContainsInAnyOrder.apply(PAssert.java:1322)
at org.apache.beam.sdk.testing.PAssert$AssertContainsInAnyOrder.apply(PAssert.java:1301)
at org.apache.beam.sdk.testing.PAssert$CheckRelationAgainstExpected.apply(PAssert.java:966)
at org.apache.beam.sdk.testing.PAssert$CheckRelationAgainstExpected.apply(PAssert.java:946)
at org.apache.beam.sdk.testing.PAssert.doChecks(PAssert.java:1250)
at org.apache.beam.sdk.testing.PAssert$GroupedValuesCheckerDoFn.processElement(PAssert.java:1215)
at org.apache.beam.sdk.testing.PAssert$GroupedValuesCheckerDoFn$DoFnInvoker.invokeProcessElement(Unknown Source)
at org.apache.beam.runners.core.SimpleDoFnRunner.invokeProcessElement(SimpleDoFnRunner.java:185)
at org.apache.beam.runners.core.SimpleDoFnRunner.processElement(SimpleDoFnRunner.java:149)
at com.google.cloud.dataflow.worker.SimpleParDoFn.processElement(SimpleParDoFn.java:323)
at com.google.cloud.dataflow.worker.util.common.worker.ParDoOperation.process(ParDoOperation.java:43)
at com.google.cloud.dataflow.worker.util.common.worker.OutputReceiver.process(OutputReceiver.java:48)
at com.google.cloud.dataflow.worker.SimpleParDoFn$1.output(SimpleParDoFn.java:271)
at org.apache.beam.runners.core.SimpleDoFnRunner.outputWindowedValue(SimpleDoFnRunner.java:219)
at org.apache.beam.runners.core.SimpleDoFnRunner.access$700(SimpleDoFnRunner.java:69)
at org.apache.beam.runners.core.SimpleDoFnRunner$DoFnProcessContext.output(SimpleDoFnRunner.java:517)
at org.apache.beam.sdk.transforms.DoFnOutputReceivers$WindowedContextOutputReceiver.output(DoFnOutputReceivers.java:42)
at org.apache.beam.sdk.transforms.MapElements$1.processElement(MapElements.java:131)
at org.apache.beam.sdk.transforms.MapElements$1$DoFnInvoker.invokeProcessElement(Unknown Source)
at org.apache.beam.runners.core.SimpleDoFnRunner.invokeProcessElement(SimpleDoFnRunner.java:185)
at org.apache.beam.runners.core.SimpleDoFnRunner.processElement(SimpleDoFnRunner.java:149)
at com.google.cloud.dataflow.worker.SimpleParDoFn.processElement(SimpleParDoFn.java:323)
at com.google.cloud.dataflow.worker.util.common.worker.ParDoOperation.process(ParDoOperation.java:43)
at com.google.cloud.dataflow.worker.util.common.worker.OutputReceiver.process(OutputReceiver.java:48)
at com.google.cloud.dataflow.worker.SimpleParDoFn$1.output(SimpleParDoFn.java:271)
at org.apache.beam.runners.core.SimpleDoFnRunner.outputWindowedValue(SimpleDoFnRunner.java:219)
at org.apache.beam.runners.core.SimpleDoFnRunner.access$700(SimpleDoFnRunner.java:69)
at org.apache.beam.runners.core.SimpleDoFnRunner$DoFnProcessContext.output(SimpleDoFnRunner.java:517)
at org.apache.beam.runners.core.SimpleDoFnRunner$DoFnProcessContext.output(SimpleDoFnRunner.java:505)
at org.apache.beam.sdk.testing.PAssert$ConcatFn.processElement(PAssert.java:1049)
at org.apache.beam.sdk.testing.PAssert$ConcatFn$DoFnInvoker.invokeProcessElement(Unknown Source)
at org.apache.beam.runners.core.SimpleDoFnRunner.invokeProcessElement(SimpleDoFnRunner.java:185)
at org.apache.beam.runners.core.SimpleDoFnRunner.processElement(SimpleDoFnRunner.java:149)
at com.google.cloud.dataflow.worker.SimpleParDoFn.processElement(SimpleParDoFn.java:323)
at com.google.cloud.dataflow.worker.util.common.worker.ParDoOperation.process(ParDoOperation.java:43)
at com.google.cloud.dataflow.worker.util.common.worker.OutputReceiver.process(OutputReceiver.java:48)
at com.google.cloud.dataflow.worker.SimpleParDoFn$1.output(SimpleParDoFn.java:271)
at org.apache.beam.runners.core.SimpleDoFnRunner.outputWindowedValue(SimpleDoFnRunner.java:219)
at org.apache.beam.runners.core.SimpleDoFnRunner.access$700(SimpleDoFnRunner.java:69)
at org.apache.beam.runners.core.SimpleDoFnRunner$DoFnProcessContext.output(SimpleDoFnRunner.java:517)
at org.apache.beam.sdk.transforms.DoFnOutputReceivers$WindowedContextOutputReceiver.output(DoFnOutputReceivers.java:42)
at org.apache.beam.sdk.transforms.MapElements$1.processElement(MapElements.java:131)
at org.apache.beam.sdk.transforms.MapElements$1$DoFnInvoker.invokeProcessElement(Unknown Source)
at org.apache.beam.runners.core.SimpleDoFnRunner.invokeProcessElement(SimpleDoFnRunner.java:185)
at org.apache.beam.runners.core.SimpleDoFnRunner.processElement(SimpleDoFnRunner.java:149)
at com.google.cloud.dataflow.worker.SimpleParDoFn.processElement(SimpleParDoFn.java:323)
at com.google.cloud.dataflow.worker.util.common.worker.ParDoOperation.process(ParDoOperation.java:43)
at com.google.cloud.dataflow.worker.util.common.worker.OutputReceiver.process(OutputReceiver.java:48)
at com.google.cloud.dataflow.worker.GroupAlsoByWindowsParDoFn$1.output(GroupAlsoByWindowsParDoFn.java:181)
at com.google.cloud.dataflow.worker.GroupAlsoByWindowFnRunner$1.outputWindowedValue(GroupAlsoByWindowFnRunner.java:102)
at com.google.cloud.dataflow.worker.util.BatchGroupAlsoByWindowViaIteratorsFn.processElement(BatchGroupAlsoByWindowViaIteratorsFn.java:124)
at com.google.cloud.dataflow.worker.util.BatchGroupAlsoByWindowViaIteratorsFn.processElement(BatchGroupAlsoByWindowViaIteratorsFn.java:53)
at com.google.cloud.dataflow.worker.GroupAlsoByWindowFnRunner.invokeProcessElement(GroupAlsoByWindowFnRunner.java:115)
at com.google.cloud.dataflow.worker.GroupAlsoByWindowFnRunner.processElement(GroupAlsoByWindowFnRunner.java:73)
at com.google.cloud.dataflow.worker.GroupAlsoByWindowsParDoFn.processElement(GroupAlsoByWindowsParDoFn.java:113)
at com.google.cloud.dataflow.worker.util.common.worker.ParDoOperation.process(ParDoOperation.java:43)
at com.google.cloud.dataflow.worker.util.common.worker.OutputReceiver.process(OutputReceiver.java:48)
at com.google.cloud.dataflow.worker.util.common.worker.ReadOperation.runReadLoop(ReadOperation.java:200)
at com.google.cloud.dataflow.worker.util.common.worker.ReadOperation.start(ReadOperation.java:158)
at com.google.cloud.dataflow.worker.util.common.worker.MapTaskExecutor.execute(MapTaskExecutor.java:75)
at com.google.cloud.dataflow.worker.BatchDataflowWorker.executeWork(BatchDataflowWorker.java:391)
at com.google.cloud.dataflow.worker.BatchDataflowWorker.doWork(BatchDataflowWorker.java:360)
at com.google.cloud.dataflow.worker.BatchDataflowWorker.getAndPerformWork(BatchDataflowWorker.java:288)
at com.google.cloud.dataflow.worker.DataflowBatchWorkerHarness$WorkerThread.doWork(DataflowBatchWorkerHarness.java:134)
at com.google.cloud.dataflow.worker.DataflowBatchWorkerHarness$WorkerThread.call(DataflowBatchWorkerHarness.java:114)
at com.google.cloud.dataflow.worker.DataflowBatchWorkerHarness$WorkerThread.call(DataflowBatchWorkerHarness.java:101)
at java.util.concurrent.FutureTask.run(FutureTask.java:266)
at java.util.concurrent.ThreadPoolExecutor.runWorker(ThreadPoolExecutor.java:1142)
at java.util.concurrent.ThreadPoolExecutor$Worker.run(ThreadPoolExecutor.java:617)
at java.lang.Thread.run(Thread.java:745)
Workflow failed. Causes: S16:PAssert$33/GroupGlobally/GroupDummyAndContents/Read+PAssert$33/GroupGlobally/GroupDummyAndContents/GroupByWindow+PAssert$33/GroupGlobally/Values/Values/Map+PAssert$33/GroupGlobally/ParDo(Concat)+PAssert$33/GetPane/Map+PAssert$33/RunChecks+PAssert$33/VerifyAssertions/ParDo(DefaultConclude) failed., A work item was attempted 4 times without success. Each time the worker eventually lost contact with the service. The work item was attempted on:
viewtest0testsingletonsid-06181044-j3fd-harness-zlr5,
viewtest0testsingletonsid-06181044-j3fd-harness-zlr5,
viewtest0testsingletonsid-06181044-j3fd-harness-zlr5,
viewtest0testsingletonsid-06181044-j3fd-harness-zlr5
at org.apache.beam.runners.dataflow.TestDataflowRunner.run(TestDataflowRunner.java:134)
at org.apache.beam.runners.dataflow.TestDataflowRunner.run(TestDataflowRunner.java:90)
at org.apache.beam.runners.dataflow.TestDataflowRunner.run(TestDataflowRunner.java:55)
at org.apache.beam.sdk.Pipeline.run(Pipeline.java:311)
at org.apache.beam.sdk.testing.TestPipeline.run(TestPipeline.java:348)
at org.apache.beam.sdk.testing.TestPipeline.run(TestPipeline.java:329)
at org.apache.beam.sdk.transforms.ViewTest.testSingletonSideInput(ViewTest.java:109)
Gradle Test Executor 38 finished executing tests.
> Task :beam-runners-google-cloud-dataflow-java:validatesRunnerTest
209 tests completed, 190 failed, 2 skipped
Finished generating test XML results (0.805 secs) into: <https://builds.apache.org/job/beam_PostCommit_Java_ValidatesRunner_Dataflow_Gradle/ws/src/runners/google-cloud-dataflow-java/build/test-results/validatesRunnerTest>
Generating HTML test report...
Finished generating test html results (0.474 secs) into: <https://builds.apache.org/job/beam_PostCommit_Java_ValidatesRunner_Dataflow_Gradle/ws/src/runners/google-cloud-dataflow-java/build/reports/tests/validatesRunnerTest>
> Task :beam-runners-google-cloud-dataflow-java:validatesRunnerTest FAILED
:beam-runners-google-cloud-dataflow-java:validatesRunnerTest (Thread[Task worker for ':' Thread 17,5,main]) completed. Took 2 hrs 33 mins 8.711 secs.
FAILURE: Build failed with an exception.
* What went wrong:
Execution failed for task ':beam-runners-google-cloud-dataflow-java:validatesRunnerTest'.
> There were failing tests. See the report at: file://<https://builds.apache.org/job/beam_PostCommit_Java_ValidatesRunner_Dataflow_Gradle/ws/src/runners/google-cloud-dataflow-java/build/reports/tests/validatesRunnerTest/index.html>
* Try:
Run with --stacktrace option to get the stack trace. Run with --debug option to get more log output. Run with --scan to get full insights.
* Get more help at https://help.gradle.org
Deprecated Gradle features were used in this build, making it incompatible with Gradle 5.0.
See https://docs.gradle.org/4.8/userguide/command_line_interface.html#sec:command_line_warnings
BUILD FAILED in 2h 33m 58s
38 actionable tasks: 34 executed, 4 from cache
Publishing build scan...
https://gradle.com/s/gebsrqolh22r4
Build step 'Invoke Gradle script' changed build result to FAILURE
Build step 'Invoke Gradle script' marked build as failure
Recording test results
Not sending mail to unregistered user apilloud@google.com
Not sending mail to unregistered user robbe.sneyders@ml6.eu
Not sending mail to unregistered user github@alasdairhodge.co.uk
Not sending mail to unregistered user ringwalt@google.com
Not sending mail to unregistered user aaltay@gmail.com
Not sending mail to unregistered user swegner@google.com
Not sending mail to unregistered user robinyq@rodete-desktop-imager.corp.google.com
Not sending mail to unregistered user ehudm@google.com
Not sending mail to unregistered user kedin@google.com
Not sending mail to unregistered user jiangkai@gmail.com
Not sending mail to unregistered user kirpichov@google.com
Not sending mail to unregistered user fvoichick@gmail.com
Build failed in Jenkins:
beam_PostCommit_Java_ValidatesRunner_Dataflow_Gradle #524
Posted by Apache Jenkins Server <je...@builds.apache.org>.
See <https://builds.apache.org/job/beam_PostCommit_Java_ValidatesRunner_Dataflow_Gradle/524/display/redirect>
------------------------------------------
[...truncated 54.48 MB...]
at com.google.cloud.dataflow.worker.DataflowBatchWorkerHarness$WorkerThread.call(DataflowBatchWorkerHarness.java:114)
at com.google.cloud.dataflow.worker.DataflowBatchWorkerHarness$WorkerThread.call(DataflowBatchWorkerHarness.java:101)
at java.util.concurrent.FutureTask.run(FutureTask.java:266)
at java.util.concurrent.ThreadPoolExecutor.runWorker(ThreadPoolExecutor.java:1142)
at java.util.concurrent.ThreadPoolExecutor$Worker.run(ThreadPoolExecutor.java:617)
at java.lang.Thread.run(Thread.java:745)
Caused by: org.apache.beam.sdk.util.UserCodeException: java.lang.AssertionError: OutputSideInputs/ParMultiDo(Anonymous).output: org/hamcrest/Matchers
at org.apache.beam.sdk.util.UserCodeException.wrap(UserCodeException.java:36)
at org.apache.beam.sdk.testing.PAssert$DefaultConcludeFn$DoFnInvoker.invokeProcessElement(Unknown Source)
at org.apache.beam.runners.core.SimpleDoFnRunner.invokeProcessElement(SimpleDoFnRunner.java:185)
at org.apache.beam.runners.core.SimpleDoFnRunner.processElement(SimpleDoFnRunner.java:149)
at com.google.cloud.dataflow.worker.SimpleParDoFn.processElement(SimpleParDoFn.java:323)
at com.google.cloud.dataflow.worker.util.common.worker.ParDoOperation.process(ParDoOperation.java:43)
at com.google.cloud.dataflow.worker.util.common.worker.OutputReceiver.process(OutputReceiver.java:48)
at com.google.cloud.dataflow.worker.SimpleParDoFn$1.output(SimpleParDoFn.java:271)
at org.apache.beam.runners.core.SimpleDoFnRunner.outputWindowedValue(SimpleDoFnRunner.java:219)
at org.apache.beam.runners.core.SimpleDoFnRunner.access$700(SimpleDoFnRunner.java:69)
at org.apache.beam.runners.core.SimpleDoFnRunner$DoFnProcessContext.output(SimpleDoFnRunner.java:517)
at org.apache.beam.runners.core.SimpleDoFnRunner$DoFnProcessContext.output(SimpleDoFnRunner.java:505)
at org.apache.beam.sdk.testing.PAssert$GroupedValuesCheckerDoFn.processElement(PAssert.java:1215)
at org.apache.beam.sdk.testing.PAssert$GroupedValuesCheckerDoFn$DoFnInvoker.invokeProcessElement(Unknown Source)
at org.apache.beam.runners.core.SimpleDoFnRunner.invokeProcessElement(SimpleDoFnRunner.java:185)
at org.apache.beam.runners.core.SimpleDoFnRunner.processElement(SimpleDoFnRunner.java:149)
at com.google.cloud.dataflow.worker.SimpleParDoFn.processElement(SimpleParDoFn.java:323)
at com.google.cloud.dataflow.worker.util.common.worker.ParDoOperation.process(ParDoOperation.java:43)
at com.google.cloud.dataflow.worker.util.common.worker.OutputReceiver.process(OutputReceiver.java:48)
at com.google.cloud.dataflow.worker.SimpleParDoFn$1.output(SimpleParDoFn.java:271)
at org.apache.beam.runners.core.SimpleDoFnRunner.outputWindowedValue(SimpleDoFnRunner.java:219)
at org.apache.beam.runners.core.SimpleDoFnRunner.access$700(SimpleDoFnRunner.java:69)
at org.apache.beam.runners.core.SimpleDoFnRunner$DoFnProcessContext.output(SimpleDoFnRunner.java:517)
at org.apache.beam.sdk.transforms.DoFnOutputReceivers$WindowedContextOutputReceiver.output(DoFnOutputReceivers.java:42)
at org.apache.beam.sdk.transforms.MapElements$1.processElement(MapElements.java:131)
at org.apache.beam.sdk.transforms.MapElements$1$DoFnInvoker.invokeProcessElement(Unknown Source)
at org.apache.beam.runners.core.SimpleDoFnRunner.invokeProcessElement(SimpleDoFnRunner.java:185)
at org.apache.beam.runners.core.SimpleDoFnRunner.processElement(SimpleDoFnRunner.java:149)
at com.google.cloud.dataflow.worker.SimpleParDoFn.processElement(SimpleParDoFn.java:323)
at com.google.cloud.dataflow.worker.util.common.worker.ParDoOperation.process(ParDoOperation.java:43)
at com.google.cloud.dataflow.worker.util.common.worker.OutputReceiver.process(OutputReceiver.java:48)
at com.google.cloud.dataflow.worker.SimpleParDoFn$1.output(SimpleParDoFn.java:271)
at org.apache.beam.runners.core.SimpleDoFnRunner.outputWindowedValue(SimpleDoFnRunner.java:219)
at org.apache.beam.runners.core.SimpleDoFnRunner.access$700(SimpleDoFnRunner.java:69)
at org.apache.beam.runners.core.SimpleDoFnRunner$DoFnProcessContext.output(SimpleDoFnRunner.java:517)
at org.apache.beam.runners.core.SimpleDoFnRunner$DoFnProcessContext.output(SimpleDoFnRunner.java:505)
at org.apache.beam.sdk.testing.PAssert$ConcatFn.processElement(PAssert.java:1049)
at org.apache.beam.sdk.testing.PAssert$ConcatFn$DoFnInvoker.invokeProcessElement(Unknown Source)
at org.apache.beam.runners.core.SimpleDoFnRunner.invokeProcessElement(SimpleDoFnRunner.java:185)
at org.apache.beam.runners.core.SimpleDoFnRunner.processElement(SimpleDoFnRunner.java:149)
at com.google.cloud.dataflow.worker.SimpleParDoFn.processElement(SimpleParDoFn.java:323)
at com.google.cloud.dataflow.worker.util.common.worker.ParDoOperation.process(ParDoOperation.java:43)
at com.google.cloud.dataflow.worker.util.common.worker.OutputReceiver.process(OutputReceiver.java:48)
at com.google.cloud.dataflow.worker.SimpleParDoFn$1.output(SimpleParDoFn.java:271)
at org.apache.beam.runners.core.SimpleDoFnRunner.outputWindowedValue(SimpleDoFnRunner.java:219)
at org.apache.beam.runners.core.SimpleDoFnRunner.access$700(SimpleDoFnRunner.java:69)
at org.apache.beam.runners.core.SimpleDoFnRunner$DoFnProcessContext.output(SimpleDoFnRunner.java:517)
at org.apache.beam.sdk.transforms.DoFnOutputReceivers$WindowedContextOutputReceiver.output(DoFnOutputReceivers.java:42)
at org.apache.beam.sdk.transforms.MapElements$1.processElement(MapElements.java:131)
at org.apache.beam.sdk.transforms.MapElements$1$DoFnInvoker.invokeProcessElement(Unknown Source)
at org.apache.beam.runners.core.SimpleDoFnRunner.invokeProcessElement(SimpleDoFnRunner.java:185)
at org.apache.beam.runners.core.SimpleDoFnRunner.processElement(SimpleDoFnRunner.java:149)
at com.google.cloud.dataflow.worker.SimpleParDoFn.processElement(SimpleParDoFn.java:323)
at com.google.cloud.dataflow.worker.util.common.worker.ParDoOperation.process(ParDoOperation.java:43)
at com.google.cloud.dataflow.worker.util.common.worker.OutputReceiver.process(OutputReceiver.java:48)
at com.google.cloud.dataflow.worker.GroupAlsoByWindowsParDoFn$1.output(GroupAlsoByWindowsParDoFn.java:181)
... 21 more
Caused by: java.lang.AssertionError: OutputSideInputs/ParMultiDo(Anonymous).output: org/hamcrest/Matchers
at org.apache.beam.sdk.testing.PAssert$PAssertionSite.capture(PAssert.java:168)
at org.apache.beam.sdk.testing.PAssert.that(PAssert.java:378)
at org.apache.beam.sdk.testing.PAssert.that(PAssert.java:370)
at org.apache.beam.sdk.transforms.ViewTest.testSingletonSideInput(ViewTest.java:107)
at sun.reflect.NativeMethodAccessorImpl.invoke0(Native Method)
at sun.reflect.NativeMethodAccessorImpl.invoke(NativeMethodAccessorImpl.java:62)
at sun.reflect.DelegatingMethodAccessorImpl.invoke(DelegatingMethodAccessorImpl.java:43)
at java.lang.reflect.Method.invoke(Method.java:498)
at org.junit.runners.model.FrameworkMethod$1.runReflectiveCall(FrameworkMethod.java:50)
at org.junit.internal.runners.model.ReflectiveCallable.run(ReflectiveCallable.java:12)
at org.junit.runners.model.FrameworkMethod.invokeExplosively(FrameworkMethod.java:47)
at org.junit.internal.runners.statements.InvokeMethod.evaluate(InvokeMethod.java:17)
at org.apache.beam.sdk.testing.TestPipeline$1.evaluate(TestPipeline.java:317)
at org.junit.rules.ExpectedException$ExpectedExceptionStatement.evaluate(ExpectedException.java:239)
at org.junit.rules.RunRules.evaluate(RunRules.java:20)
at org.junit.runners.ParentRunner.runLeaf(ParentRunner.java:325)
at org.junit.runners.BlockJUnit4ClassRunner.runChild(BlockJUnit4ClassRunner.java:78)
at org.junit.runners.BlockJUnit4ClassRunner.runChild(BlockJUnit4ClassRunner.java:57)
at org.junit.runners.ParentRunner$3.run(ParentRunner.java:290)
at org.junit.runners.ParentRunner$1.schedule(ParentRunner.java:71)
at org.junit.runners.ParentRunner.runChildren(ParentRunner.java:288)
at org.junit.runners.ParentRunner.access$000(ParentRunner.java:58)
at org.junit.runners.ParentRunner$2.evaluate(ParentRunner.java:268)
at org.junit.runners.ParentRunner.run(ParentRunner.java:363)
at org.gradle.api.internal.tasks.testing.junit.JUnitTestClassExecutor.runTestClass(JUnitTestClassExecutor.java:106)
at org.gradle.api.internal.tasks.testing.junit.JUnitTestClassExecutor.execute(JUnitTestClassExecutor.java:58)
at org.gradle.api.internal.tasks.testing.junit.JUnitTestClassExecutor.execute(JUnitTestClassExecutor.java:38)
at org.gradle.api.internal.tasks.testing.junit.AbstractJUnitTestClassProcessor.processTestClass(AbstractJUnitTestClassProcessor.java:66)
at org.gradle.api.internal.tasks.testing.SuiteTestClassProcessor.processTestClass(SuiteTestClassProcessor.java:51)
at sun.reflect.NativeMethodAccessorImpl.invoke0(Native Method)
at sun.reflect.NativeMethodAccessorImpl.invoke(NativeMethodAccessorImpl.java:62)
at sun.reflect.DelegatingMethodAccessorImpl.invoke(DelegatingMethodAccessorImpl.java:43)
at java.lang.reflect.Method.invoke(Method.java:498)
at org.gradle.internal.dispatch.ReflectionDispatch.dispatch(ReflectionDispatch.java:35)
at org.gradle.internal.dispatch.ReflectionDispatch.dispatch(ReflectionDispatch.java:24)
at org.gradle.internal.dispatch.ContextClassLoaderDispatch.dispatch(ContextClassLoaderDispatch.java:32)
at org.gradle.internal.dispatch.ProxyDispatchAdapter$DispatchingInvocationHandler.invoke(ProxyDispatchAdapter.java:93)
at com.sun.proxy.$Proxy2.processTestClass(Unknown Source)
at org.gradle.api.internal.tasks.testing.worker.TestWorker.processTestClass(TestWorker.java:109)
at sun.reflect.NativeMethodAccessorImpl.invoke0(Native Method)
at sun.reflect.NativeMethodAccessorImpl.invoke(NativeMethodAccessorImpl.java:62)
at sun.reflect.DelegatingMethodAccessorImpl.invoke(DelegatingMethodAccessorImpl.java:43)
at java.lang.reflect.Method.invoke(Method.java:498)
at org.gradle.internal.dispatch.ReflectionDispatch.dispatch(ReflectionDispatch.java:35)
at org.gradle.internal.dispatch.ReflectionDispatch.dispatch(ReflectionDispatch.java:24)
at org.gradle.internal.remote.internal.hub.MessageHubBackedObjectConnection$DispatchWrapper.dispatch(MessageHubBackedObjectConnection.java:155)
at org.gradle.internal.remote.internal.hub.MessageHubBackedObjectConnection$DispatchWrapper.dispatch(MessageHubBackedObjectConnection.java:137)
at org.gradle.internal.remote.internal.hub.MessageHub$Handler.run(MessageHub.java:404)
at org.gradle.internal.concurrent.ExecutorPolicy$CatchAndRecordFailures.onExecute(ExecutorPolicy.java:63)
at org.gradle.internal.concurrent.ManagedExecutorImpl$1.run(ManagedExecutorImpl.java:46)
at java.util.concurrent.ThreadPoolExecutor.runWorker(ThreadPoolExecutor.java:1149)
at java.util.concurrent.ThreadPoolExecutor$Worker.run(ThreadPoolExecutor.java:624)
at org.gradle.internal.concurrent.ThreadFactoryImpl$ManagedThreadRunnable.run(ThreadFactoryImpl.java:55)
Caused by: java.lang.NoClassDefFoundError: org/hamcrest/Matchers
at org.apache.beam.sdk.testing.PAssert$AssertContainsInAnyOrder.apply(PAssert.java:1322)
at org.apache.beam.sdk.testing.PAssert$AssertContainsInAnyOrder.apply(PAssert.java:1301)
at org.apache.beam.sdk.testing.PAssert$CheckRelationAgainstExpected.apply(PAssert.java:966)
at org.apache.beam.sdk.testing.PAssert$CheckRelationAgainstExpected.apply(PAssert.java:946)
at org.apache.beam.sdk.testing.PAssert.doChecks(PAssert.java:1250)
at org.apache.beam.sdk.testing.PAssert$GroupedValuesCheckerDoFn.processElement(PAssert.java:1215)
at org.apache.beam.sdk.testing.PAssert$GroupedValuesCheckerDoFn$DoFnInvoker.invokeProcessElement(Unknown Source)
at org.apache.beam.runners.core.SimpleDoFnRunner.invokeProcessElement(SimpleDoFnRunner.java:185)
at org.apache.beam.runners.core.SimpleDoFnRunner.processElement(SimpleDoFnRunner.java:149)
at com.google.cloud.dataflow.worker.SimpleParDoFn.processElement(SimpleParDoFn.java:323)
at com.google.cloud.dataflow.worker.util.common.worker.ParDoOperation.process(ParDoOperation.java:43)
at com.google.cloud.dataflow.worker.util.common.worker.OutputReceiver.process(OutputReceiver.java:48)
at com.google.cloud.dataflow.worker.SimpleParDoFn$1.output(SimpleParDoFn.java:271)
at org.apache.beam.runners.core.SimpleDoFnRunner.outputWindowedValue(SimpleDoFnRunner.java:219)
at org.apache.beam.runners.core.SimpleDoFnRunner.access$700(SimpleDoFnRunner.java:69)
at org.apache.beam.runners.core.SimpleDoFnRunner$DoFnProcessContext.output(SimpleDoFnRunner.java:517)
at org.apache.beam.sdk.transforms.DoFnOutputReceivers$WindowedContextOutputReceiver.output(DoFnOutputReceivers.java:42)
at org.apache.beam.sdk.transforms.MapElements$1.processElement(MapElements.java:131)
at org.apache.beam.sdk.transforms.MapElements$1$DoFnInvoker.invokeProcessElement(Unknown Source)
at org.apache.beam.runners.core.SimpleDoFnRunner.invokeProcessElement(SimpleDoFnRunner.java:185)
at org.apache.beam.runners.core.SimpleDoFnRunner.processElement(SimpleDoFnRunner.java:149)
at com.google.cloud.dataflow.worker.SimpleParDoFn.processElement(SimpleParDoFn.java:323)
at com.google.cloud.dataflow.worker.util.common.worker.ParDoOperation.process(ParDoOperation.java:43)
at com.google.cloud.dataflow.worker.util.common.worker.OutputReceiver.process(OutputReceiver.java:48)
at com.google.cloud.dataflow.worker.SimpleParDoFn$1.output(SimpleParDoFn.java:271)
at org.apache.beam.runners.core.SimpleDoFnRunner.outputWindowedValue(SimpleDoFnRunner.java:219)
at org.apache.beam.runners.core.SimpleDoFnRunner.access$700(SimpleDoFnRunner.java:69)
at org.apache.beam.runners.core.SimpleDoFnRunner$DoFnProcessContext.output(SimpleDoFnRunner.java:517)
at org.apache.beam.runners.core.SimpleDoFnRunner$DoFnProcessContext.output(SimpleDoFnRunner.java:505)
at org.apache.beam.sdk.testing.PAssert$ConcatFn.processElement(PAssert.java:1049)
at org.apache.beam.sdk.testing.PAssert$ConcatFn$DoFnInvoker.invokeProcessElement(Unknown Source)
at org.apache.beam.runners.core.SimpleDoFnRunner.invokeProcessElement(SimpleDoFnRunner.java:185)
at org.apache.beam.runners.core.SimpleDoFnRunner.processElement(SimpleDoFnRunner.java:149)
at com.google.cloud.dataflow.worker.SimpleParDoFn.processElement(SimpleParDoFn.java:323)
at com.google.cloud.dataflow.worker.util.common.worker.ParDoOperation.process(ParDoOperation.java:43)
at com.google.cloud.dataflow.worker.util.common.worker.OutputReceiver.process(OutputReceiver.java:48)
at com.google.cloud.dataflow.worker.SimpleParDoFn$1.output(SimpleParDoFn.java:271)
at org.apache.beam.runners.core.SimpleDoFnRunner.outputWindowedValue(SimpleDoFnRunner.java:219)
at org.apache.beam.runners.core.SimpleDoFnRunner.access$700(SimpleDoFnRunner.java:69)
at org.apache.beam.runners.core.SimpleDoFnRunner$DoFnProcessContext.output(SimpleDoFnRunner.java:517)
at org.apache.beam.sdk.transforms.DoFnOutputReceivers$WindowedContextOutputReceiver.output(DoFnOutputReceivers.java:42)
at org.apache.beam.sdk.transforms.MapElements$1.processElement(MapElements.java:131)
at org.apache.beam.sdk.transforms.MapElements$1$DoFnInvoker.invokeProcessElement(Unknown Source)
at org.apache.beam.runners.core.SimpleDoFnRunner.invokeProcessElement(SimpleDoFnRunner.java:185)
at org.apache.beam.runners.core.SimpleDoFnRunner.processElement(SimpleDoFnRunner.java:149)
at com.google.cloud.dataflow.worker.SimpleParDoFn.processElement(SimpleParDoFn.java:323)
at com.google.cloud.dataflow.worker.util.common.worker.ParDoOperation.process(ParDoOperation.java:43)
at com.google.cloud.dataflow.worker.util.common.worker.OutputReceiver.process(OutputReceiver.java:48)
at com.google.cloud.dataflow.worker.GroupAlsoByWindowsParDoFn$1.output(GroupAlsoByWindowsParDoFn.java:181)
at com.google.cloud.dataflow.worker.GroupAlsoByWindowFnRunner$1.outputWindowedValue(GroupAlsoByWindowFnRunner.java:102)
at com.google.cloud.dataflow.worker.util.BatchGroupAlsoByWindowViaIteratorsFn.processElement(BatchGroupAlsoByWindowViaIteratorsFn.java:124)
at com.google.cloud.dataflow.worker.util.BatchGroupAlsoByWindowViaIteratorsFn.processElement(BatchGroupAlsoByWindowViaIteratorsFn.java:53)
at com.google.cloud.dataflow.worker.GroupAlsoByWindowFnRunner.invokeProcessElement(GroupAlsoByWindowFnRunner.java:115)
at com.google.cloud.dataflow.worker.GroupAlsoByWindowFnRunner.processElement(GroupAlsoByWindowFnRunner.java:73)
at com.google.cloud.dataflow.worker.GroupAlsoByWindowsParDoFn.processElement(GroupAlsoByWindowsParDoFn.java:113)
at com.google.cloud.dataflow.worker.util.common.worker.ParDoOperation.process(ParDoOperation.java:43)
at com.google.cloud.dataflow.worker.util.common.worker.OutputReceiver.process(OutputReceiver.java:48)
at com.google.cloud.dataflow.worker.util.common.worker.ReadOperation.runReadLoop(ReadOperation.java:200)
at com.google.cloud.dataflow.worker.util.common.worker.ReadOperation.start(ReadOperation.java:158)
at com.google.cloud.dataflow.worker.util.common.worker.MapTaskExecutor.execute(MapTaskExecutor.java:75)
at com.google.cloud.dataflow.worker.BatchDataflowWorker.executeWork(BatchDataflowWorker.java:391)
at com.google.cloud.dataflow.worker.BatchDataflowWorker.doWork(BatchDataflowWorker.java:360)
at com.google.cloud.dataflow.worker.BatchDataflowWorker.getAndPerformWork(BatchDataflowWorker.java:288)
at com.google.cloud.dataflow.worker.DataflowBatchWorkerHarness$WorkerThread.doWork(DataflowBatchWorkerHarness.java:134)
at com.google.cloud.dataflow.worker.DataflowBatchWorkerHarness$WorkerThread.call(DataflowBatchWorkerHarness.java:114)
at com.google.cloud.dataflow.worker.DataflowBatchWorkerHarness$WorkerThread.call(DataflowBatchWorkerHarness.java:101)
at java.util.concurrent.FutureTask.run(FutureTask.java:266)
at java.util.concurrent.ThreadPoolExecutor.runWorker(ThreadPoolExecutor.java:1142)
at java.util.concurrent.ThreadPoolExecutor$Worker.run(ThreadPoolExecutor.java:617)
at java.lang.Thread.run(Thread.java:745)
Workflow failed. Causes: S16:PAssert$33/GroupGlobally/GroupDummyAndContents/Read+PAssert$33/GroupGlobally/GroupDummyAndContents/GroupByWindow+PAssert$33/GroupGlobally/Values/Values/Map+PAssert$33/GroupGlobally/ParDo(Concat)+PAssert$33/GetPane/Map+PAssert$33/RunChecks+PAssert$33/VerifyAssertions/ParDo(DefaultConclude) failed., A work item was attempted 4 times without success. Each time the worker eventually lost contact with the service. The work item was attempted on:
viewtest0testsingletonsid-06180325-159x-harness-j0r9,
viewtest0testsingletonsid-06180325-159x-harness-j0r9,
viewtest0testsingletonsid-06180325-159x-harness-j0r9,
viewtest0testsingletonsid-06180325-159x-harness-j0r9
at org.apache.beam.runners.dataflow.TestDataflowRunner.run(TestDataflowRunner.java:134)
at org.apache.beam.runners.dataflow.TestDataflowRunner.run(TestDataflowRunner.java:90)
at org.apache.beam.runners.dataflow.TestDataflowRunner.run(TestDataflowRunner.java:55)
at org.apache.beam.sdk.Pipeline.run(Pipeline.java:311)
at org.apache.beam.sdk.testing.TestPipeline.run(TestPipeline.java:348)
at org.apache.beam.sdk.testing.TestPipeline.run(TestPipeline.java:329)
at org.apache.beam.sdk.transforms.ViewTest.testSingletonSideInput(ViewTest.java:109)
Gradle Test Executor 39 finished executing tests.
> Task :beam-runners-google-cloud-dataflow-java:validatesRunnerTest
209 tests completed, 190 failed, 2 skipped
Finished generating test XML results (1.466 secs) into: <https://builds.apache.org/job/beam_PostCommit_Java_ValidatesRunner_Dataflow_Gradle/ws/src/runners/google-cloud-dataflow-java/build/test-results/validatesRunnerTest>
Generating HTML test report...
Finished generating test html results (0.431 secs) into: <https://builds.apache.org/job/beam_PostCommit_Java_ValidatesRunner_Dataflow_Gradle/ws/src/runners/google-cloud-dataflow-java/build/reports/tests/validatesRunnerTest>
> Task :beam-runners-google-cloud-dataflow-java:validatesRunnerTest FAILED
:beam-runners-google-cloud-dataflow-java:validatesRunnerTest (Thread[Task worker for ':' Thread 16,5,main]) completed. Took 2 hrs 26 mins 3.536 secs.
FAILURE: Build failed with an exception.
* What went wrong:
Execution failed for task ':beam-runners-google-cloud-dataflow-java:validatesRunnerTest'.
> There were failing tests. See the report at: file://<https://builds.apache.org/job/beam_PostCommit_Java_ValidatesRunner_Dataflow_Gradle/ws/src/runners/google-cloud-dataflow-java/build/reports/tests/validatesRunnerTest/index.html>
* Try:
Run with --stacktrace option to get the stack trace. Run with --debug option to get more log output. Run with --scan to get full insights.
* Get more help at https://help.gradle.org
Deprecated Gradle features were used in this build, making it incompatible with Gradle 5.0.
See https://docs.gradle.org/4.8/userguide/command_line_interface.html#sec:command_line_warnings
BUILD FAILED in 2h 27m 7s
38 actionable tasks: 34 executed, 4 from cache
Publishing build scan...
https://gradle.com/s/o2xdrkyiwkzsy
Build step 'Invoke Gradle script' changed build result to FAILURE
Build step 'Invoke Gradle script' marked build as failure
Recording test results
Not sending mail to unregistered user apilloud@google.com
Not sending mail to unregistered user robbe.sneyders@ml6.eu
Not sending mail to unregistered user github@alasdairhodge.co.uk
Not sending mail to unregistered user ringwalt@google.com
Not sending mail to unregistered user aaltay@gmail.com
Not sending mail to unregistered user swegner@google.com
Not sending mail to unregistered user robinyq@rodete-desktop-imager.corp.google.com
Not sending mail to unregistered user ehudm@google.com
Not sending mail to unregistered user kedin@google.com
Not sending mail to unregistered user jiangkai@gmail.com
Not sending mail to unregistered user kirpichov@google.com
Not sending mail to unregistered user fvoichick@gmail.com
Build failed in Jenkins:
beam_PostCommit_Java_ValidatesRunner_Dataflow_Gradle #523
Posted by Apache Jenkins Server <je...@builds.apache.org>.
See <https://builds.apache.org/job/beam_PostCommit_Java_ValidatesRunner_Dataflow_Gradle/523/display/redirect>
------------------------------------------
[...truncated 54.42 MB...]
at com.google.cloud.dataflow.worker.DataflowBatchWorkerHarness$WorkerThread.call(DataflowBatchWorkerHarness.java:114)
at com.google.cloud.dataflow.worker.DataflowBatchWorkerHarness$WorkerThread.call(DataflowBatchWorkerHarness.java:101)
at java.util.concurrent.FutureTask.run(FutureTask.java:266)
at java.util.concurrent.ThreadPoolExecutor.runWorker(ThreadPoolExecutor.java:1142)
at java.util.concurrent.ThreadPoolExecutor$Worker.run(ThreadPoolExecutor.java:617)
at java.lang.Thread.run(Thread.java:745)
Caused by: org.apache.beam.sdk.util.UserCodeException: java.lang.AssertionError: OutputSideInputs/ParMultiDo(Anonymous).output: org/hamcrest/Matchers
at org.apache.beam.sdk.util.UserCodeException.wrap(UserCodeException.java:36)
at org.apache.beam.sdk.testing.PAssert$DefaultConcludeFn$DoFnInvoker.invokeProcessElement(Unknown Source)
at org.apache.beam.runners.core.SimpleDoFnRunner.invokeProcessElement(SimpleDoFnRunner.java:185)
at org.apache.beam.runners.core.SimpleDoFnRunner.processElement(SimpleDoFnRunner.java:149)
at com.google.cloud.dataflow.worker.SimpleParDoFn.processElement(SimpleParDoFn.java:323)
at com.google.cloud.dataflow.worker.util.common.worker.ParDoOperation.process(ParDoOperation.java:43)
at com.google.cloud.dataflow.worker.util.common.worker.OutputReceiver.process(OutputReceiver.java:48)
at com.google.cloud.dataflow.worker.SimpleParDoFn$1.output(SimpleParDoFn.java:271)
at org.apache.beam.runners.core.SimpleDoFnRunner.outputWindowedValue(SimpleDoFnRunner.java:219)
at org.apache.beam.runners.core.SimpleDoFnRunner.access$700(SimpleDoFnRunner.java:69)
at org.apache.beam.runners.core.SimpleDoFnRunner$DoFnProcessContext.output(SimpleDoFnRunner.java:517)
at org.apache.beam.runners.core.SimpleDoFnRunner$DoFnProcessContext.output(SimpleDoFnRunner.java:505)
at org.apache.beam.sdk.testing.PAssert$GroupedValuesCheckerDoFn.processElement(PAssert.java:1215)
at org.apache.beam.sdk.testing.PAssert$GroupedValuesCheckerDoFn$DoFnInvoker.invokeProcessElement(Unknown Source)
at org.apache.beam.runners.core.SimpleDoFnRunner.invokeProcessElement(SimpleDoFnRunner.java:185)
at org.apache.beam.runners.core.SimpleDoFnRunner.processElement(SimpleDoFnRunner.java:149)
at com.google.cloud.dataflow.worker.SimpleParDoFn.processElement(SimpleParDoFn.java:323)
at com.google.cloud.dataflow.worker.util.common.worker.ParDoOperation.process(ParDoOperation.java:43)
at com.google.cloud.dataflow.worker.util.common.worker.OutputReceiver.process(OutputReceiver.java:48)
at com.google.cloud.dataflow.worker.SimpleParDoFn$1.output(SimpleParDoFn.java:271)
at org.apache.beam.runners.core.SimpleDoFnRunner.outputWindowedValue(SimpleDoFnRunner.java:219)
at org.apache.beam.runners.core.SimpleDoFnRunner.access$700(SimpleDoFnRunner.java:69)
at org.apache.beam.runners.core.SimpleDoFnRunner$DoFnProcessContext.output(SimpleDoFnRunner.java:517)
at org.apache.beam.sdk.transforms.DoFnOutputReceivers$WindowedContextOutputReceiver.output(DoFnOutputReceivers.java:42)
at org.apache.beam.sdk.transforms.MapElements$1.processElement(MapElements.java:131)
at org.apache.beam.sdk.transforms.MapElements$1$DoFnInvoker.invokeProcessElement(Unknown Source)
at org.apache.beam.runners.core.SimpleDoFnRunner.invokeProcessElement(SimpleDoFnRunner.java:185)
at org.apache.beam.runners.core.SimpleDoFnRunner.processElement(SimpleDoFnRunner.java:149)
at com.google.cloud.dataflow.worker.SimpleParDoFn.processElement(SimpleParDoFn.java:323)
at com.google.cloud.dataflow.worker.util.common.worker.ParDoOperation.process(ParDoOperation.java:43)
at com.google.cloud.dataflow.worker.util.common.worker.OutputReceiver.process(OutputReceiver.java:48)
at com.google.cloud.dataflow.worker.SimpleParDoFn$1.output(SimpleParDoFn.java:271)
at org.apache.beam.runners.core.SimpleDoFnRunner.outputWindowedValue(SimpleDoFnRunner.java:219)
at org.apache.beam.runners.core.SimpleDoFnRunner.access$700(SimpleDoFnRunner.java:69)
at org.apache.beam.runners.core.SimpleDoFnRunner$DoFnProcessContext.output(SimpleDoFnRunner.java:517)
at org.apache.beam.runners.core.SimpleDoFnRunner$DoFnProcessContext.output(SimpleDoFnRunner.java:505)
at org.apache.beam.sdk.testing.PAssert$ConcatFn.processElement(PAssert.java:1049)
at org.apache.beam.sdk.testing.PAssert$ConcatFn$DoFnInvoker.invokeProcessElement(Unknown Source)
at org.apache.beam.runners.core.SimpleDoFnRunner.invokeProcessElement(SimpleDoFnRunner.java:185)
at org.apache.beam.runners.core.SimpleDoFnRunner.processElement(SimpleDoFnRunner.java:149)
at com.google.cloud.dataflow.worker.SimpleParDoFn.processElement(SimpleParDoFn.java:323)
at com.google.cloud.dataflow.worker.util.common.worker.ParDoOperation.process(ParDoOperation.java:43)
at com.google.cloud.dataflow.worker.util.common.worker.OutputReceiver.process(OutputReceiver.java:48)
at com.google.cloud.dataflow.worker.SimpleParDoFn$1.output(SimpleParDoFn.java:271)
at org.apache.beam.runners.core.SimpleDoFnRunner.outputWindowedValue(SimpleDoFnRunner.java:219)
at org.apache.beam.runners.core.SimpleDoFnRunner.access$700(SimpleDoFnRunner.java:69)
at org.apache.beam.runners.core.SimpleDoFnRunner$DoFnProcessContext.output(SimpleDoFnRunner.java:517)
at org.apache.beam.sdk.transforms.DoFnOutputReceivers$WindowedContextOutputReceiver.output(DoFnOutputReceivers.java:42)
at org.apache.beam.sdk.transforms.MapElements$1.processElement(MapElements.java:131)
at org.apache.beam.sdk.transforms.MapElements$1$DoFnInvoker.invokeProcessElement(Unknown Source)
at org.apache.beam.runners.core.SimpleDoFnRunner.invokeProcessElement(SimpleDoFnRunner.java:185)
at org.apache.beam.runners.core.SimpleDoFnRunner.processElement(SimpleDoFnRunner.java:149)
at com.google.cloud.dataflow.worker.SimpleParDoFn.processElement(SimpleParDoFn.java:323)
at com.google.cloud.dataflow.worker.util.common.worker.ParDoOperation.process(ParDoOperation.java:43)
at com.google.cloud.dataflow.worker.util.common.worker.OutputReceiver.process(OutputReceiver.java:48)
at com.google.cloud.dataflow.worker.GroupAlsoByWindowsParDoFn$1.output(GroupAlsoByWindowsParDoFn.java:181)
... 21 more
Caused by: java.lang.AssertionError: OutputSideInputs/ParMultiDo(Anonymous).output: org/hamcrest/Matchers
at org.apache.beam.sdk.testing.PAssert$PAssertionSite.capture(PAssert.java:168)
at org.apache.beam.sdk.testing.PAssert.that(PAssert.java:378)
at org.apache.beam.sdk.testing.PAssert.that(PAssert.java:370)
at org.apache.beam.sdk.transforms.ViewTest.testSingletonSideInput(ViewTest.java:107)
at sun.reflect.NativeMethodAccessorImpl.invoke0(Native Method)
at sun.reflect.NativeMethodAccessorImpl.invoke(NativeMethodAccessorImpl.java:62)
at sun.reflect.DelegatingMethodAccessorImpl.invoke(DelegatingMethodAccessorImpl.java:43)
at java.lang.reflect.Method.invoke(Method.java:498)
at org.junit.runners.model.FrameworkMethod$1.runReflectiveCall(FrameworkMethod.java:50)
at org.junit.internal.runners.model.ReflectiveCallable.run(ReflectiveCallable.java:12)
at org.junit.runners.model.FrameworkMethod.invokeExplosively(FrameworkMethod.java:47)
at org.junit.internal.runners.statements.InvokeMethod.evaluate(InvokeMethod.java:17)
at org.apache.beam.sdk.testing.TestPipeline$1.evaluate(TestPipeline.java:317)
at org.junit.rules.ExpectedException$ExpectedExceptionStatement.evaluate(ExpectedException.java:239)
at org.junit.rules.RunRules.evaluate(RunRules.java:20)
at org.junit.runners.ParentRunner.runLeaf(ParentRunner.java:325)
at org.junit.runners.BlockJUnit4ClassRunner.runChild(BlockJUnit4ClassRunner.java:78)
at org.junit.runners.BlockJUnit4ClassRunner.runChild(BlockJUnit4ClassRunner.java:57)
at org.junit.runners.ParentRunner$3.run(ParentRunner.java:290)
at org.junit.runners.ParentRunner$1.schedule(ParentRunner.java:71)
at org.junit.runners.ParentRunner.runChildren(ParentRunner.java:288)
at org.junit.runners.ParentRunner.access$000(ParentRunner.java:58)
at org.junit.runners.ParentRunner$2.evaluate(ParentRunner.java:268)
at org.junit.runners.ParentRunner.run(ParentRunner.java:363)
at org.gradle.api.internal.tasks.testing.junit.JUnitTestClassExecutor.runTestClass(JUnitTestClassExecutor.java:106)
at org.gradle.api.internal.tasks.testing.junit.JUnitTestClassExecutor.execute(JUnitTestClassExecutor.java:58)
at org.gradle.api.internal.tasks.testing.junit.JUnitTestClassExecutor.execute(JUnitTestClassExecutor.java:38)
at org.gradle.api.internal.tasks.testing.junit.AbstractJUnitTestClassProcessor.processTestClass(AbstractJUnitTestClassProcessor.java:66)
at org.gradle.api.internal.tasks.testing.SuiteTestClassProcessor.processTestClass(SuiteTestClassProcessor.java:51)
at sun.reflect.NativeMethodAccessorImpl.invoke0(Native Method)
at sun.reflect.NativeMethodAccessorImpl.invoke(NativeMethodAccessorImpl.java:62)
at sun.reflect.DelegatingMethodAccessorImpl.invoke(DelegatingMethodAccessorImpl.java:43)
at java.lang.reflect.Method.invoke(Method.java:498)
at org.gradle.internal.dispatch.ReflectionDispatch.dispatch(ReflectionDispatch.java:35)
at org.gradle.internal.dispatch.ReflectionDispatch.dispatch(ReflectionDispatch.java:24)
at org.gradle.internal.dispatch.ContextClassLoaderDispatch.dispatch(ContextClassLoaderDispatch.java:32)
at org.gradle.internal.dispatch.ProxyDispatchAdapter$DispatchingInvocationHandler.invoke(ProxyDispatchAdapter.java:93)
at com.sun.proxy.$Proxy2.processTestClass(Unknown Source)
at org.gradle.api.internal.tasks.testing.worker.TestWorker.processTestClass(TestWorker.java:109)
at sun.reflect.NativeMethodAccessorImpl.invoke0(Native Method)
at sun.reflect.NativeMethodAccessorImpl.invoke(NativeMethodAccessorImpl.java:62)
at sun.reflect.DelegatingMethodAccessorImpl.invoke(DelegatingMethodAccessorImpl.java:43)
at java.lang.reflect.Method.invoke(Method.java:498)
at org.gradle.internal.dispatch.ReflectionDispatch.dispatch(ReflectionDispatch.java:35)
at org.gradle.internal.dispatch.ReflectionDispatch.dispatch(ReflectionDispatch.java:24)
at org.gradle.internal.remote.internal.hub.MessageHubBackedObjectConnection$DispatchWrapper.dispatch(MessageHubBackedObjectConnection.java:155)
at org.gradle.internal.remote.internal.hub.MessageHubBackedObjectConnection$DispatchWrapper.dispatch(MessageHubBackedObjectConnection.java:137)
at org.gradle.internal.remote.internal.hub.MessageHub$Handler.run(MessageHub.java:404)
at org.gradle.internal.concurrent.ExecutorPolicy$CatchAndRecordFailures.onExecute(ExecutorPolicy.java:63)
at org.gradle.internal.concurrent.ManagedExecutorImpl$1.run(ManagedExecutorImpl.java:46)
at java.util.concurrent.ThreadPoolExecutor.runWorker(ThreadPoolExecutor.java:1149)
at java.util.concurrent.ThreadPoolExecutor$Worker.run(ThreadPoolExecutor.java:624)
at org.gradle.internal.concurrent.ThreadFactoryImpl$ManagedThreadRunnable.run(ThreadFactoryImpl.java:55)
Caused by: java.lang.NoClassDefFoundError: org/hamcrest/Matchers
at org.apache.beam.sdk.testing.PAssert$AssertContainsInAnyOrder.apply(PAssert.java:1322)
at org.apache.beam.sdk.testing.PAssert$AssertContainsInAnyOrder.apply(PAssert.java:1301)
at org.apache.beam.sdk.testing.PAssert$CheckRelationAgainstExpected.apply(PAssert.java:966)
at org.apache.beam.sdk.testing.PAssert$CheckRelationAgainstExpected.apply(PAssert.java:946)
at org.apache.beam.sdk.testing.PAssert.doChecks(PAssert.java:1250)
at org.apache.beam.sdk.testing.PAssert$GroupedValuesCheckerDoFn.processElement(PAssert.java:1215)
at org.apache.beam.sdk.testing.PAssert$GroupedValuesCheckerDoFn$DoFnInvoker.invokeProcessElement(Unknown Source)
at org.apache.beam.runners.core.SimpleDoFnRunner.invokeProcessElement(SimpleDoFnRunner.java:185)
at org.apache.beam.runners.core.SimpleDoFnRunner.processElement(SimpleDoFnRunner.java:149)
at com.google.cloud.dataflow.worker.SimpleParDoFn.processElement(SimpleParDoFn.java:323)
at com.google.cloud.dataflow.worker.util.common.worker.ParDoOperation.process(ParDoOperation.java:43)
at com.google.cloud.dataflow.worker.util.common.worker.OutputReceiver.process(OutputReceiver.java:48)
at com.google.cloud.dataflow.worker.SimpleParDoFn$1.output(SimpleParDoFn.java:271)
at org.apache.beam.runners.core.SimpleDoFnRunner.outputWindowedValue(SimpleDoFnRunner.java:219)
at org.apache.beam.runners.core.SimpleDoFnRunner.access$700(SimpleDoFnRunner.java:69)
at org.apache.beam.runners.core.SimpleDoFnRunner$DoFnProcessContext.output(SimpleDoFnRunner.java:517)
at org.apache.beam.sdk.transforms.DoFnOutputReceivers$WindowedContextOutputReceiver.output(DoFnOutputReceivers.java:42)
at org.apache.beam.sdk.transforms.MapElements$1.processElement(MapElements.java:131)
at org.apache.beam.sdk.transforms.MapElements$1$DoFnInvoker.invokeProcessElement(Unknown Source)
at org.apache.beam.runners.core.SimpleDoFnRunner.invokeProcessElement(SimpleDoFnRunner.java:185)
at org.apache.beam.runners.core.SimpleDoFnRunner.processElement(SimpleDoFnRunner.java:149)
at com.google.cloud.dataflow.worker.SimpleParDoFn.processElement(SimpleParDoFn.java:323)
at com.google.cloud.dataflow.worker.util.common.worker.ParDoOperation.process(ParDoOperation.java:43)
at com.google.cloud.dataflow.worker.util.common.worker.OutputReceiver.process(OutputReceiver.java:48)
at com.google.cloud.dataflow.worker.SimpleParDoFn$1.output(SimpleParDoFn.java:271)
at org.apache.beam.runners.core.SimpleDoFnRunner.outputWindowedValue(SimpleDoFnRunner.java:219)
at org.apache.beam.runners.core.SimpleDoFnRunner.access$700(SimpleDoFnRunner.java:69)
at org.apache.beam.runners.core.SimpleDoFnRunner$DoFnProcessContext.output(SimpleDoFnRunner.java:517)
at org.apache.beam.runners.core.SimpleDoFnRunner$DoFnProcessContext.output(SimpleDoFnRunner.java:505)
at org.apache.beam.sdk.testing.PAssert$ConcatFn.processElement(PAssert.java:1049)
at org.apache.beam.sdk.testing.PAssert$ConcatFn$DoFnInvoker.invokeProcessElement(Unknown Source)
at org.apache.beam.runners.core.SimpleDoFnRunner.invokeProcessElement(SimpleDoFnRunner.java:185)
at org.apache.beam.runners.core.SimpleDoFnRunner.processElement(SimpleDoFnRunner.java:149)
at com.google.cloud.dataflow.worker.SimpleParDoFn.processElement(SimpleParDoFn.java:323)
at com.google.cloud.dataflow.worker.util.common.worker.ParDoOperation.process(ParDoOperation.java:43)
at com.google.cloud.dataflow.worker.util.common.worker.OutputReceiver.process(OutputReceiver.java:48)
at com.google.cloud.dataflow.worker.SimpleParDoFn$1.output(SimpleParDoFn.java:271)
at org.apache.beam.runners.core.SimpleDoFnRunner.outputWindowedValue(SimpleDoFnRunner.java:219)
at org.apache.beam.runners.core.SimpleDoFnRunner.access$700(SimpleDoFnRunner.java:69)
at org.apache.beam.runners.core.SimpleDoFnRunner$DoFnProcessContext.output(SimpleDoFnRunner.java:517)
at org.apache.beam.sdk.transforms.DoFnOutputReceivers$WindowedContextOutputReceiver.output(DoFnOutputReceivers.java:42)
at org.apache.beam.sdk.transforms.MapElements$1.processElement(MapElements.java:131)
at org.apache.beam.sdk.transforms.MapElements$1$DoFnInvoker.invokeProcessElement(Unknown Source)
at org.apache.beam.runners.core.SimpleDoFnRunner.invokeProcessElement(SimpleDoFnRunner.java:185)
at org.apache.beam.runners.core.SimpleDoFnRunner.processElement(SimpleDoFnRunner.java:149)
at com.google.cloud.dataflow.worker.SimpleParDoFn.processElement(SimpleParDoFn.java:323)
at com.google.cloud.dataflow.worker.util.common.worker.ParDoOperation.process(ParDoOperation.java:43)
at com.google.cloud.dataflow.worker.util.common.worker.OutputReceiver.process(OutputReceiver.java:48)
at com.google.cloud.dataflow.worker.GroupAlsoByWindowsParDoFn$1.output(GroupAlsoByWindowsParDoFn.java:181)
at com.google.cloud.dataflow.worker.GroupAlsoByWindowFnRunner$1.outputWindowedValue(GroupAlsoByWindowFnRunner.java:102)
at com.google.cloud.dataflow.worker.util.BatchGroupAlsoByWindowViaIteratorsFn.processElement(BatchGroupAlsoByWindowViaIteratorsFn.java:124)
at com.google.cloud.dataflow.worker.util.BatchGroupAlsoByWindowViaIteratorsFn.processElement(BatchGroupAlsoByWindowViaIteratorsFn.java:53)
at com.google.cloud.dataflow.worker.GroupAlsoByWindowFnRunner.invokeProcessElement(GroupAlsoByWindowFnRunner.java:115)
at com.google.cloud.dataflow.worker.GroupAlsoByWindowFnRunner.processElement(GroupAlsoByWindowFnRunner.java:73)
at com.google.cloud.dataflow.worker.GroupAlsoByWindowsParDoFn.processElement(GroupAlsoByWindowsParDoFn.java:113)
at com.google.cloud.dataflow.worker.util.common.worker.ParDoOperation.process(ParDoOperation.java:43)
at com.google.cloud.dataflow.worker.util.common.worker.OutputReceiver.process(OutputReceiver.java:48)
at com.google.cloud.dataflow.worker.util.common.worker.ReadOperation.runReadLoop(ReadOperation.java:200)
at com.google.cloud.dataflow.worker.util.common.worker.ReadOperation.start(ReadOperation.java:158)
at com.google.cloud.dataflow.worker.util.common.worker.MapTaskExecutor.execute(MapTaskExecutor.java:75)
at com.google.cloud.dataflow.worker.BatchDataflowWorker.executeWork(BatchDataflowWorker.java:391)
at com.google.cloud.dataflow.worker.BatchDataflowWorker.doWork(BatchDataflowWorker.java:360)
at com.google.cloud.dataflow.worker.BatchDataflowWorker.getAndPerformWork(BatchDataflowWorker.java:288)
at com.google.cloud.dataflow.worker.DataflowBatchWorkerHarness$WorkerThread.doWork(DataflowBatchWorkerHarness.java:134)
at com.google.cloud.dataflow.worker.DataflowBatchWorkerHarness$WorkerThread.call(DataflowBatchWorkerHarness.java:114)
at com.google.cloud.dataflow.worker.DataflowBatchWorkerHarness$WorkerThread.call(DataflowBatchWorkerHarness.java:101)
at java.util.concurrent.FutureTask.run(FutureTask.java:266)
at java.util.concurrent.ThreadPoolExecutor.runWorker(ThreadPoolExecutor.java:1142)
at java.util.concurrent.ThreadPoolExecutor$Worker.run(ThreadPoolExecutor.java:617)
at java.lang.Thread.run(Thread.java:745)
Workflow failed. Causes: S16:PAssert$33/GroupGlobally/GroupDummyAndContents/Read+PAssert$33/GroupGlobally/GroupDummyAndContents/GroupByWindow+PAssert$33/GroupGlobally/Values/Values/Map+PAssert$33/GroupGlobally/ParDo(Concat)+PAssert$33/GetPane/Map+PAssert$33/RunChecks+PAssert$33/VerifyAssertions/ParDo(DefaultConclude) failed., A work item was attempted 4 times without success. Each time the worker eventually lost contact with the service. The work item was attempted on:
viewtest0testsingletonsid-06172120-r2wl-harness-qtp5,
viewtest0testsingletonsid-06172120-r2wl-harness-qtp5,
viewtest0testsingletonsid-06172120-r2wl-harness-qtp5,
viewtest0testsingletonsid-06172120-r2wl-harness-qtp5
at org.apache.beam.runners.dataflow.TestDataflowRunner.run(TestDataflowRunner.java:134)
at org.apache.beam.runners.dataflow.TestDataflowRunner.run(TestDataflowRunner.java:90)
at org.apache.beam.runners.dataflow.TestDataflowRunner.run(TestDataflowRunner.java:55)
at org.apache.beam.sdk.Pipeline.run(Pipeline.java:311)
at org.apache.beam.sdk.testing.TestPipeline.run(TestPipeline.java:348)
at org.apache.beam.sdk.testing.TestPipeline.run(TestPipeline.java:329)
at org.apache.beam.sdk.transforms.ViewTest.testSingletonSideInput(ViewTest.java:109)
Gradle Test Executor 36 finished executing tests.
> Task :beam-runners-google-cloud-dataflow-java:validatesRunnerTest
209 tests completed, 190 failed, 2 skipped
Finished generating test XML results (1.323 secs) into: <https://builds.apache.org/job/beam_PostCommit_Java_ValidatesRunner_Dataflow_Gradle/ws/src/runners/google-cloud-dataflow-java/build/test-results/validatesRunnerTest>
Generating HTML test report...
Finished generating test html results (0.801 secs) into: <https://builds.apache.org/job/beam_PostCommit_Java_ValidatesRunner_Dataflow_Gradle/ws/src/runners/google-cloud-dataflow-java/build/reports/tests/validatesRunnerTest>
> Task :beam-runners-google-cloud-dataflow-java:validatesRunnerTest FAILED
:beam-runners-google-cloud-dataflow-java:validatesRunnerTest (Thread[Task worker for ':' Thread 38,5,main]) completed. Took 2 hrs 21 mins 5.298 secs.
FAILURE: Build failed with an exception.
* What went wrong:
Execution failed for task ':beam-runners-google-cloud-dataflow-java:validatesRunnerTest'.
> There were failing tests. See the report at: file://<https://builds.apache.org/job/beam_PostCommit_Java_ValidatesRunner_Dataflow_Gradle/ws/src/runners/google-cloud-dataflow-java/build/reports/tests/validatesRunnerTest/index.html>
* Try:
Run with --stacktrace option to get the stack trace. Run with --debug option to get more log output. Run with --scan to get full insights.
* Get more help at https://help.gradle.org
Deprecated Gradle features were used in this build, making it incompatible with Gradle 5.0.
See https://docs.gradle.org/4.8/userguide/command_line_interface.html#sec:command_line_warnings
BUILD FAILED in 2h 22m 28s
38 actionable tasks: 34 executed, 4 from cache
Publishing build scan...
https://gradle.com/s/6tkkazdeao2ak
Build step 'Invoke Gradle script' changed build result to FAILURE
Build step 'Invoke Gradle script' marked build as failure
Recording test results
Not sending mail to unregistered user apilloud@google.com
Not sending mail to unregistered user robbe.sneyders@ml6.eu
Not sending mail to unregistered user github@alasdairhodge.co.uk
Not sending mail to unregistered user ringwalt@google.com
Not sending mail to unregistered user aaltay@gmail.com
Not sending mail to unregistered user swegner@google.com
Not sending mail to unregistered user robinyq@rodete-desktop-imager.corp.google.com
Not sending mail to unregistered user ehudm@google.com
Not sending mail to unregistered user kedin@google.com
Not sending mail to unregistered user jiangkai@gmail.com
Not sending mail to unregistered user kirpichov@google.com
Not sending mail to unregistered user fvoichick@gmail.com
Build failed in Jenkins:
beam_PostCommit_Java_ValidatesRunner_Dataflow_Gradle #522
Posted by Apache Jenkins Server <je...@builds.apache.org>.
See <https://builds.apache.org/job/beam_PostCommit_Java_ValidatesRunner_Dataflow_Gradle/522/display/redirect?page=changes>
Changes:
[thw] Fix ValidatesRunner_Apex #5604
------------------------------------------
[...truncated 54.98 MB...]
at com.google.cloud.dataflow.worker.DataflowBatchWorkerHarness$WorkerThread.call(DataflowBatchWorkerHarness.java:114)
at com.google.cloud.dataflow.worker.DataflowBatchWorkerHarness$WorkerThread.call(DataflowBatchWorkerHarness.java:101)
at java.util.concurrent.FutureTask.run(FutureTask.java:266)
at java.util.concurrent.ThreadPoolExecutor.runWorker(ThreadPoolExecutor.java:1142)
at java.util.concurrent.ThreadPoolExecutor$Worker.run(ThreadPoolExecutor.java:617)
at java.lang.Thread.run(Thread.java:745)
Caused by: org.apache.beam.sdk.util.UserCodeException: java.lang.AssertionError: OutputSideInputs/ParMultiDo(Anonymous).output: org/hamcrest/Matchers
at org.apache.beam.sdk.util.UserCodeException.wrap(UserCodeException.java:36)
at org.apache.beam.sdk.testing.PAssert$DefaultConcludeFn$DoFnInvoker.invokeProcessElement(Unknown Source)
at org.apache.beam.runners.core.SimpleDoFnRunner.invokeProcessElement(SimpleDoFnRunner.java:185)
at org.apache.beam.runners.core.SimpleDoFnRunner.processElement(SimpleDoFnRunner.java:149)
at com.google.cloud.dataflow.worker.SimpleParDoFn.processElement(SimpleParDoFn.java:323)
at com.google.cloud.dataflow.worker.util.common.worker.ParDoOperation.process(ParDoOperation.java:43)
at com.google.cloud.dataflow.worker.util.common.worker.OutputReceiver.process(OutputReceiver.java:48)
at com.google.cloud.dataflow.worker.SimpleParDoFn$1.output(SimpleParDoFn.java:271)
at org.apache.beam.runners.core.SimpleDoFnRunner.outputWindowedValue(SimpleDoFnRunner.java:219)
at org.apache.beam.runners.core.SimpleDoFnRunner.access$700(SimpleDoFnRunner.java:69)
at org.apache.beam.runners.core.SimpleDoFnRunner$DoFnProcessContext.output(SimpleDoFnRunner.java:517)
at org.apache.beam.runners.core.SimpleDoFnRunner$DoFnProcessContext.output(SimpleDoFnRunner.java:505)
at org.apache.beam.sdk.testing.PAssert$GroupedValuesCheckerDoFn.processElement(PAssert.java:1215)
at org.apache.beam.sdk.testing.PAssert$GroupedValuesCheckerDoFn$DoFnInvoker.invokeProcessElement(Unknown Source)
at org.apache.beam.runners.core.SimpleDoFnRunner.invokeProcessElement(SimpleDoFnRunner.java:185)
at org.apache.beam.runners.core.SimpleDoFnRunner.processElement(SimpleDoFnRunner.java:149)
at com.google.cloud.dataflow.worker.SimpleParDoFn.processElement(SimpleParDoFn.java:323)
at com.google.cloud.dataflow.worker.util.common.worker.ParDoOperation.process(ParDoOperation.java:43)
at com.google.cloud.dataflow.worker.util.common.worker.OutputReceiver.process(OutputReceiver.java:48)
at com.google.cloud.dataflow.worker.SimpleParDoFn$1.output(SimpleParDoFn.java:271)
at org.apache.beam.runners.core.SimpleDoFnRunner.outputWindowedValue(SimpleDoFnRunner.java:219)
at org.apache.beam.runners.core.SimpleDoFnRunner.access$700(SimpleDoFnRunner.java:69)
at org.apache.beam.runners.core.SimpleDoFnRunner$DoFnProcessContext.output(SimpleDoFnRunner.java:517)
at org.apache.beam.sdk.transforms.DoFnOutputReceivers$WindowedContextOutputReceiver.output(DoFnOutputReceivers.java:42)
at org.apache.beam.sdk.transforms.MapElements$1.processElement(MapElements.java:131)
at org.apache.beam.sdk.transforms.MapElements$1$DoFnInvoker.invokeProcessElement(Unknown Source)
at org.apache.beam.runners.core.SimpleDoFnRunner.invokeProcessElement(SimpleDoFnRunner.java:185)
at org.apache.beam.runners.core.SimpleDoFnRunner.processElement(SimpleDoFnRunner.java:149)
at com.google.cloud.dataflow.worker.SimpleParDoFn.processElement(SimpleParDoFn.java:323)
at com.google.cloud.dataflow.worker.util.common.worker.ParDoOperation.process(ParDoOperation.java:43)
at com.google.cloud.dataflow.worker.util.common.worker.OutputReceiver.process(OutputReceiver.java:48)
at com.google.cloud.dataflow.worker.SimpleParDoFn$1.output(SimpleParDoFn.java:271)
at org.apache.beam.runners.core.SimpleDoFnRunner.outputWindowedValue(SimpleDoFnRunner.java:219)
at org.apache.beam.runners.core.SimpleDoFnRunner.access$700(SimpleDoFnRunner.java:69)
at org.apache.beam.runners.core.SimpleDoFnRunner$DoFnProcessContext.output(SimpleDoFnRunner.java:517)
at org.apache.beam.runners.core.SimpleDoFnRunner$DoFnProcessContext.output(SimpleDoFnRunner.java:505)
at org.apache.beam.sdk.testing.PAssert$ConcatFn.processElement(PAssert.java:1049)
at org.apache.beam.sdk.testing.PAssert$ConcatFn$DoFnInvoker.invokeProcessElement(Unknown Source)
at org.apache.beam.runners.core.SimpleDoFnRunner.invokeProcessElement(SimpleDoFnRunner.java:185)
at org.apache.beam.runners.core.SimpleDoFnRunner.processElement(SimpleDoFnRunner.java:149)
at com.google.cloud.dataflow.worker.SimpleParDoFn.processElement(SimpleParDoFn.java:323)
at com.google.cloud.dataflow.worker.util.common.worker.ParDoOperation.process(ParDoOperation.java:43)
at com.google.cloud.dataflow.worker.util.common.worker.OutputReceiver.process(OutputReceiver.java:48)
at com.google.cloud.dataflow.worker.SimpleParDoFn$1.output(SimpleParDoFn.java:271)
at org.apache.beam.runners.core.SimpleDoFnRunner.outputWindowedValue(SimpleDoFnRunner.java:219)
at org.apache.beam.runners.core.SimpleDoFnRunner.access$700(SimpleDoFnRunner.java:69)
at org.apache.beam.runners.core.SimpleDoFnRunner$DoFnProcessContext.output(SimpleDoFnRunner.java:517)
at org.apache.beam.sdk.transforms.DoFnOutputReceivers$WindowedContextOutputReceiver.output(DoFnOutputReceivers.java:42)
at org.apache.beam.sdk.transforms.MapElements$1.processElement(MapElements.java:131)
at org.apache.beam.sdk.transforms.MapElements$1$DoFnInvoker.invokeProcessElement(Unknown Source)
at org.apache.beam.runners.core.SimpleDoFnRunner.invokeProcessElement(SimpleDoFnRunner.java:185)
at org.apache.beam.runners.core.SimpleDoFnRunner.processElement(SimpleDoFnRunner.java:149)
at com.google.cloud.dataflow.worker.SimpleParDoFn.processElement(SimpleParDoFn.java:323)
at com.google.cloud.dataflow.worker.util.common.worker.ParDoOperation.process(ParDoOperation.java:43)
at com.google.cloud.dataflow.worker.util.common.worker.OutputReceiver.process(OutputReceiver.java:48)
at com.google.cloud.dataflow.worker.GroupAlsoByWindowsParDoFn$1.output(GroupAlsoByWindowsParDoFn.java:181)
... 21 more
Caused by: java.lang.AssertionError: OutputSideInputs/ParMultiDo(Anonymous).output: org/hamcrest/Matchers
at org.apache.beam.sdk.testing.PAssert$PAssertionSite.capture(PAssert.java:168)
at org.apache.beam.sdk.testing.PAssert.that(PAssert.java:378)
at org.apache.beam.sdk.testing.PAssert.that(PAssert.java:370)
at org.apache.beam.sdk.transforms.ViewTest.testSingletonSideInput(ViewTest.java:107)
at sun.reflect.NativeMethodAccessorImpl.invoke0(Native Method)
at sun.reflect.NativeMethodAccessorImpl.invoke(NativeMethodAccessorImpl.java:62)
at sun.reflect.DelegatingMethodAccessorImpl.invoke(DelegatingMethodAccessorImpl.java:43)
at java.lang.reflect.Method.invoke(Method.java:498)
at org.junit.runners.model.FrameworkMethod$1.runReflectiveCall(FrameworkMethod.java:50)
at org.junit.internal.runners.model.ReflectiveCallable.run(ReflectiveCallable.java:12)
at org.junit.runners.model.FrameworkMethod.invokeExplosively(FrameworkMethod.java:47)
at org.junit.internal.runners.statements.InvokeMethod.evaluate(InvokeMethod.java:17)
at org.apache.beam.sdk.testing.TestPipeline$1.evaluate(TestPipeline.java:317)
at org.junit.rules.ExpectedException$ExpectedExceptionStatement.evaluate(ExpectedException.java:239)
at org.junit.rules.RunRules.evaluate(RunRules.java:20)
at org.junit.runners.ParentRunner.runLeaf(ParentRunner.java:325)
at org.junit.runners.BlockJUnit4ClassRunner.runChild(BlockJUnit4ClassRunner.java:78)
at org.junit.runners.BlockJUnit4ClassRunner.runChild(BlockJUnit4ClassRunner.java:57)
at org.junit.runners.ParentRunner$3.run(ParentRunner.java:290)
at org.junit.runners.ParentRunner$1.schedule(ParentRunner.java:71)
at org.junit.runners.ParentRunner.runChildren(ParentRunner.java:288)
at org.junit.runners.ParentRunner.access$000(ParentRunner.java:58)
at org.junit.runners.ParentRunner$2.evaluate(ParentRunner.java:268)
at org.junit.runners.ParentRunner.run(ParentRunner.java:363)
at org.gradle.api.internal.tasks.testing.junit.JUnitTestClassExecutor.runTestClass(JUnitTestClassExecutor.java:106)
at org.gradle.api.internal.tasks.testing.junit.JUnitTestClassExecutor.execute(JUnitTestClassExecutor.java:58)
at org.gradle.api.internal.tasks.testing.junit.JUnitTestClassExecutor.execute(JUnitTestClassExecutor.java:38)
at org.gradle.api.internal.tasks.testing.junit.AbstractJUnitTestClassProcessor.processTestClass(AbstractJUnitTestClassProcessor.java:66)
at org.gradle.api.internal.tasks.testing.SuiteTestClassProcessor.processTestClass(SuiteTestClassProcessor.java:51)
at sun.reflect.NativeMethodAccessorImpl.invoke0(Native Method)
at sun.reflect.NativeMethodAccessorImpl.invoke(NativeMethodAccessorImpl.java:62)
at sun.reflect.DelegatingMethodAccessorImpl.invoke(DelegatingMethodAccessorImpl.java:43)
at java.lang.reflect.Method.invoke(Method.java:498)
at org.gradle.internal.dispatch.ReflectionDispatch.dispatch(ReflectionDispatch.java:35)
at org.gradle.internal.dispatch.ReflectionDispatch.dispatch(ReflectionDispatch.java:24)
at org.gradle.internal.dispatch.ContextClassLoaderDispatch.dispatch(ContextClassLoaderDispatch.java:32)
at org.gradle.internal.dispatch.ProxyDispatchAdapter$DispatchingInvocationHandler.invoke(ProxyDispatchAdapter.java:93)
at com.sun.proxy.$Proxy2.processTestClass(Unknown Source)
at org.gradle.api.internal.tasks.testing.worker.TestWorker.processTestClass(TestWorker.java:109)
at sun.reflect.NativeMethodAccessorImpl.invoke0(Native Method)
at sun.reflect.NativeMethodAccessorImpl.invoke(NativeMethodAccessorImpl.java:62)
at sun.reflect.DelegatingMethodAccessorImpl.invoke(DelegatingMethodAccessorImpl.java:43)
at java.lang.reflect.Method.invoke(Method.java:498)
at org.gradle.internal.dispatch.ReflectionDispatch.dispatch(ReflectionDispatch.java:35)
at org.gradle.internal.dispatch.ReflectionDispatch.dispatch(ReflectionDispatch.java:24)
at org.gradle.internal.remote.internal.hub.MessageHubBackedObjectConnection$DispatchWrapper.dispatch(MessageHubBackedObjectConnection.java:155)
at org.gradle.internal.remote.internal.hub.MessageHubBackedObjectConnection$DispatchWrapper.dispatch(MessageHubBackedObjectConnection.java:137)
at org.gradle.internal.remote.internal.hub.MessageHub$Handler.run(MessageHub.java:404)
at org.gradle.internal.concurrent.ExecutorPolicy$CatchAndRecordFailures.onExecute(ExecutorPolicy.java:63)
at org.gradle.internal.concurrent.ManagedExecutorImpl$1.run(ManagedExecutorImpl.java:46)
at java.util.concurrent.ThreadPoolExecutor.runWorker(ThreadPoolExecutor.java:1149)
at java.util.concurrent.ThreadPoolExecutor$Worker.run(ThreadPoolExecutor.java:624)
at org.gradle.internal.concurrent.ThreadFactoryImpl$ManagedThreadRunnable.run(ThreadFactoryImpl.java:55)
Caused by: java.lang.NoClassDefFoundError: org/hamcrest/Matchers
at org.apache.beam.sdk.testing.PAssert$AssertContainsInAnyOrder.apply(PAssert.java:1322)
at org.apache.beam.sdk.testing.PAssert$AssertContainsInAnyOrder.apply(PAssert.java:1301)
at org.apache.beam.sdk.testing.PAssert$CheckRelationAgainstExpected.apply(PAssert.java:966)
at org.apache.beam.sdk.testing.PAssert$CheckRelationAgainstExpected.apply(PAssert.java:946)
at org.apache.beam.sdk.testing.PAssert.doChecks(PAssert.java:1250)
at org.apache.beam.sdk.testing.PAssert$GroupedValuesCheckerDoFn.processElement(PAssert.java:1215)
at org.apache.beam.sdk.testing.PAssert$GroupedValuesCheckerDoFn$DoFnInvoker.invokeProcessElement(Unknown Source)
at org.apache.beam.runners.core.SimpleDoFnRunner.invokeProcessElement(SimpleDoFnRunner.java:185)
at org.apache.beam.runners.core.SimpleDoFnRunner.processElement(SimpleDoFnRunner.java:149)
at com.google.cloud.dataflow.worker.SimpleParDoFn.processElement(SimpleParDoFn.java:323)
at com.google.cloud.dataflow.worker.util.common.worker.ParDoOperation.process(ParDoOperation.java:43)
at com.google.cloud.dataflow.worker.util.common.worker.OutputReceiver.process(OutputReceiver.java:48)
at com.google.cloud.dataflow.worker.SimpleParDoFn$1.output(SimpleParDoFn.java:271)
at org.apache.beam.runners.core.SimpleDoFnRunner.outputWindowedValue(SimpleDoFnRunner.java:219)
at org.apache.beam.runners.core.SimpleDoFnRunner.access$700(SimpleDoFnRunner.java:69)
at org.apache.beam.runners.core.SimpleDoFnRunner$DoFnProcessContext.output(SimpleDoFnRunner.java:517)
at org.apache.beam.sdk.transforms.DoFnOutputReceivers$WindowedContextOutputReceiver.output(DoFnOutputReceivers.java:42)
at org.apache.beam.sdk.transforms.MapElements$1.processElement(MapElements.java:131)
at org.apache.beam.sdk.transforms.MapElements$1$DoFnInvoker.invokeProcessElement(Unknown Source)
at org.apache.beam.runners.core.SimpleDoFnRunner.invokeProcessElement(SimpleDoFnRunner.java:185)
at org.apache.beam.runners.core.SimpleDoFnRunner.processElement(SimpleDoFnRunner.java:149)
at com.google.cloud.dataflow.worker.SimpleParDoFn.processElement(SimpleParDoFn.java:323)
at com.google.cloud.dataflow.worker.util.common.worker.ParDoOperation.process(ParDoOperation.java:43)
at com.google.cloud.dataflow.worker.util.common.worker.OutputReceiver.process(OutputReceiver.java:48)
at com.google.cloud.dataflow.worker.SimpleParDoFn$1.output(SimpleParDoFn.java:271)
at org.apache.beam.runners.core.SimpleDoFnRunner.outputWindowedValue(SimpleDoFnRunner.java:219)
at org.apache.beam.runners.core.SimpleDoFnRunner.access$700(SimpleDoFnRunner.java:69)
at org.apache.beam.runners.core.SimpleDoFnRunner$DoFnProcessContext.output(SimpleDoFnRunner.java:517)
at org.apache.beam.runners.core.SimpleDoFnRunner$DoFnProcessContext.output(SimpleDoFnRunner.java:505)
at org.apache.beam.sdk.testing.PAssert$ConcatFn.processElement(PAssert.java:1049)
at org.apache.beam.sdk.testing.PAssert$ConcatFn$DoFnInvoker.invokeProcessElement(Unknown Source)
at org.apache.beam.runners.core.SimpleDoFnRunner.invokeProcessElement(SimpleDoFnRunner.java:185)
at org.apache.beam.runners.core.SimpleDoFnRunner.processElement(SimpleDoFnRunner.java:149)
at com.google.cloud.dataflow.worker.SimpleParDoFn.processElement(SimpleParDoFn.java:323)
at com.google.cloud.dataflow.worker.util.common.worker.ParDoOperation.process(ParDoOperation.java:43)
at com.google.cloud.dataflow.worker.util.common.worker.OutputReceiver.process(OutputReceiver.java:48)
at com.google.cloud.dataflow.worker.SimpleParDoFn$1.output(SimpleParDoFn.java:271)
at org.apache.beam.runners.core.SimpleDoFnRunner.outputWindowedValue(SimpleDoFnRunner.java:219)
at org.apache.beam.runners.core.SimpleDoFnRunner.access$700(SimpleDoFnRunner.java:69)
at org.apache.beam.runners.core.SimpleDoFnRunner$DoFnProcessContext.output(SimpleDoFnRunner.java:517)
at org.apache.beam.sdk.transforms.DoFnOutputReceivers$WindowedContextOutputReceiver.output(DoFnOutputReceivers.java:42)
at org.apache.beam.sdk.transforms.MapElements$1.processElement(MapElements.java:131)
at org.apache.beam.sdk.transforms.MapElements$1$DoFnInvoker.invokeProcessElement(Unknown Source)
at org.apache.beam.runners.core.SimpleDoFnRunner.invokeProcessElement(SimpleDoFnRunner.java:185)
at org.apache.beam.runners.core.SimpleDoFnRunner.processElement(SimpleDoFnRunner.java:149)
at com.google.cloud.dataflow.worker.SimpleParDoFn.processElement(SimpleParDoFn.java:323)
at com.google.cloud.dataflow.worker.util.common.worker.ParDoOperation.process(ParDoOperation.java:43)
at com.google.cloud.dataflow.worker.util.common.worker.OutputReceiver.process(OutputReceiver.java:48)
at com.google.cloud.dataflow.worker.GroupAlsoByWindowsParDoFn$1.output(GroupAlsoByWindowsParDoFn.java:181)
at com.google.cloud.dataflow.worker.GroupAlsoByWindowFnRunner$1.outputWindowedValue(GroupAlsoByWindowFnRunner.java:102)
at com.google.cloud.dataflow.worker.util.BatchGroupAlsoByWindowViaIteratorsFn.processElement(BatchGroupAlsoByWindowViaIteratorsFn.java:124)
at com.google.cloud.dataflow.worker.util.BatchGroupAlsoByWindowViaIteratorsFn.processElement(BatchGroupAlsoByWindowViaIteratorsFn.java:53)
at com.google.cloud.dataflow.worker.GroupAlsoByWindowFnRunner.invokeProcessElement(GroupAlsoByWindowFnRunner.java:115)
at com.google.cloud.dataflow.worker.GroupAlsoByWindowFnRunner.processElement(GroupAlsoByWindowFnRunner.java:73)
at com.google.cloud.dataflow.worker.GroupAlsoByWindowsParDoFn.processElement(GroupAlsoByWindowsParDoFn.java:113)
at com.google.cloud.dataflow.worker.util.common.worker.ParDoOperation.process(ParDoOperation.java:43)
at com.google.cloud.dataflow.worker.util.common.worker.OutputReceiver.process(OutputReceiver.java:48)
at com.google.cloud.dataflow.worker.util.common.worker.ReadOperation.runReadLoop(ReadOperation.java:200)
at com.google.cloud.dataflow.worker.util.common.worker.ReadOperation.start(ReadOperation.java:158)
at com.google.cloud.dataflow.worker.util.common.worker.MapTaskExecutor.execute(MapTaskExecutor.java:75)
at com.google.cloud.dataflow.worker.BatchDataflowWorker.executeWork(BatchDataflowWorker.java:391)
at com.google.cloud.dataflow.worker.BatchDataflowWorker.doWork(BatchDataflowWorker.java:360)
at com.google.cloud.dataflow.worker.BatchDataflowWorker.getAndPerformWork(BatchDataflowWorker.java:288)
at com.google.cloud.dataflow.worker.DataflowBatchWorkerHarness$WorkerThread.doWork(DataflowBatchWorkerHarness.java:134)
at com.google.cloud.dataflow.worker.DataflowBatchWorkerHarness$WorkerThread.call(DataflowBatchWorkerHarness.java:114)
at com.google.cloud.dataflow.worker.DataflowBatchWorkerHarness$WorkerThread.call(DataflowBatchWorkerHarness.java:101)
at java.util.concurrent.FutureTask.run(FutureTask.java:266)
at java.util.concurrent.ThreadPoolExecutor.runWorker(ThreadPoolExecutor.java:1142)
at java.util.concurrent.ThreadPoolExecutor$Worker.run(ThreadPoolExecutor.java:617)
at java.lang.Thread.run(Thread.java:745)
Workflow failed. Causes: S16:PAssert$33/GroupGlobally/GroupDummyAndContents/Read+PAssert$33/GroupGlobally/GroupDummyAndContents/GroupByWindow+PAssert$33/GroupGlobally/Values/Values/Map+PAssert$33/GroupGlobally/ParDo(Concat)+PAssert$33/GetPane/Map+PAssert$33/RunChecks+PAssert$33/VerifyAssertions/ParDo(DefaultConclude) failed., A work item was attempted 4 times without success. Each time the worker eventually lost contact with the service. The work item was attempted on:
viewtest0testsingletonsid-06171647-ta7x-harness-bjxc,
viewtest0testsingletonsid-06171647-ta7x-harness-bjxc,
viewtest0testsingletonsid-06171647-ta7x-harness-bjxc,
viewtest0testsingletonsid-06171647-ta7x-harness-bjxc
at org.apache.beam.runners.dataflow.TestDataflowRunner.run(TestDataflowRunner.java:134)
at org.apache.beam.runners.dataflow.TestDataflowRunner.run(TestDataflowRunner.java:90)
at org.apache.beam.runners.dataflow.TestDataflowRunner.run(TestDataflowRunner.java:55)
at org.apache.beam.sdk.Pipeline.run(Pipeline.java:311)
at org.apache.beam.sdk.testing.TestPipeline.run(TestPipeline.java:348)
at org.apache.beam.sdk.testing.TestPipeline.run(TestPipeline.java:329)
at org.apache.beam.sdk.transforms.ViewTest.testSingletonSideInput(ViewTest.java:109)
Gradle Test Executor 38 finished executing tests.
> Task :beam-runners-google-cloud-dataflow-java:validatesRunnerTest
209 tests completed, 190 failed, 2 skipped
Finished generating test XML results (0.812 secs) into: <https://builds.apache.org/job/beam_PostCommit_Java_ValidatesRunner_Dataflow_Gradle/ws/src/runners/google-cloud-dataflow-java/build/test-results/validatesRunnerTest>
Generating HTML test report...
Finished generating test html results (0.52 secs) into: <https://builds.apache.org/job/beam_PostCommit_Java_ValidatesRunner_Dataflow_Gradle/ws/src/runners/google-cloud-dataflow-java/build/reports/tests/validatesRunnerTest>
> Task :beam-runners-google-cloud-dataflow-java:validatesRunnerTest FAILED
:beam-runners-google-cloud-dataflow-java:validatesRunnerTest (Thread[Task worker for ':' Thread 13,5,main]) completed. Took 2 hrs 21 mins 42.647 secs.
FAILURE: Build failed with an exception.
* What went wrong:
Execution failed for task ':beam-runners-google-cloud-dataflow-java:validatesRunnerTest'.
> There were failing tests. See the report at: file://<https://builds.apache.org/job/beam_PostCommit_Java_ValidatesRunner_Dataflow_Gradle/ws/src/runners/google-cloud-dataflow-java/build/reports/tests/validatesRunnerTest/index.html>
* Try:
Run with --stacktrace option to get the stack trace. Run with --debug option to get more log output. Run with --scan to get full insights.
* Get more help at https://help.gradle.org
Deprecated Gradle features were used in this build, making it incompatible with Gradle 5.0.
See https://docs.gradle.org/4.8/userguide/command_line_interface.html#sec:command_line_warnings
BUILD FAILED in 2h 22m 34s
38 actionable tasks: 34 executed, 4 from cache
Publishing build scan...
https://gradle.com/s/asrpfrzt5tnsy
Build step 'Invoke Gradle script' changed build result to FAILURE
Build step 'Invoke Gradle script' marked build as failure
Recording test results
Not sending mail to unregistered user apilloud@google.com
Not sending mail to unregistered user robbe.sneyders@ml6.eu
Not sending mail to unregistered user github@alasdairhodge.co.uk
Not sending mail to unregistered user ringwalt@google.com
Not sending mail to unregistered user aaltay@gmail.com
Not sending mail to unregistered user swegner@google.com
Not sending mail to unregistered user robinyq@rodete-desktop-imager.corp.google.com
Not sending mail to unregistered user ehudm@google.com
Not sending mail to unregistered user kedin@google.com
Not sending mail to unregistered user jiangkai@gmail.com
Not sending mail to unregistered user kirpichov@google.com
Not sending mail to unregistered user fvoichick@gmail.com
Build failed in Jenkins:
beam_PostCommit_Java_ValidatesRunner_Dataflow_Gradle #521
Posted by Apache Jenkins Server <je...@builds.apache.org>.
See <https://builds.apache.org/job/beam_PostCommit_Java_ValidatesRunner_Dataflow_Gradle/521/display/redirect>
------------------------------------------
[...truncated 54.50 MB...]
at com.google.cloud.dataflow.worker.DataflowBatchWorkerHarness$WorkerThread.call(DataflowBatchWorkerHarness.java:114)
at com.google.cloud.dataflow.worker.DataflowBatchWorkerHarness$WorkerThread.call(DataflowBatchWorkerHarness.java:101)
at java.util.concurrent.FutureTask.run(FutureTask.java:266)
at java.util.concurrent.ThreadPoolExecutor.runWorker(ThreadPoolExecutor.java:1142)
at java.util.concurrent.ThreadPoolExecutor$Worker.run(ThreadPoolExecutor.java:617)
at java.lang.Thread.run(Thread.java:745)
Caused by: org.apache.beam.sdk.util.UserCodeException: java.lang.AssertionError: OutputSideInputs/ParMultiDo(Anonymous).output: org/hamcrest/Matchers
at org.apache.beam.sdk.util.UserCodeException.wrap(UserCodeException.java:36)
at org.apache.beam.sdk.testing.PAssert$DefaultConcludeFn$DoFnInvoker.invokeProcessElement(Unknown Source)
at org.apache.beam.runners.core.SimpleDoFnRunner.invokeProcessElement(SimpleDoFnRunner.java:185)
at org.apache.beam.runners.core.SimpleDoFnRunner.processElement(SimpleDoFnRunner.java:149)
at com.google.cloud.dataflow.worker.SimpleParDoFn.processElement(SimpleParDoFn.java:323)
at com.google.cloud.dataflow.worker.util.common.worker.ParDoOperation.process(ParDoOperation.java:43)
at com.google.cloud.dataflow.worker.util.common.worker.OutputReceiver.process(OutputReceiver.java:48)
at com.google.cloud.dataflow.worker.SimpleParDoFn$1.output(SimpleParDoFn.java:271)
at org.apache.beam.runners.core.SimpleDoFnRunner.outputWindowedValue(SimpleDoFnRunner.java:219)
at org.apache.beam.runners.core.SimpleDoFnRunner.access$700(SimpleDoFnRunner.java:69)
at org.apache.beam.runners.core.SimpleDoFnRunner$DoFnProcessContext.output(SimpleDoFnRunner.java:517)
at org.apache.beam.runners.core.SimpleDoFnRunner$DoFnProcessContext.output(SimpleDoFnRunner.java:505)
at org.apache.beam.sdk.testing.PAssert$GroupedValuesCheckerDoFn.processElement(PAssert.java:1215)
at org.apache.beam.sdk.testing.PAssert$GroupedValuesCheckerDoFn$DoFnInvoker.invokeProcessElement(Unknown Source)
at org.apache.beam.runners.core.SimpleDoFnRunner.invokeProcessElement(SimpleDoFnRunner.java:185)
at org.apache.beam.runners.core.SimpleDoFnRunner.processElement(SimpleDoFnRunner.java:149)
at com.google.cloud.dataflow.worker.SimpleParDoFn.processElement(SimpleParDoFn.java:323)
at com.google.cloud.dataflow.worker.util.common.worker.ParDoOperation.process(ParDoOperation.java:43)
at com.google.cloud.dataflow.worker.util.common.worker.OutputReceiver.process(OutputReceiver.java:48)
at com.google.cloud.dataflow.worker.SimpleParDoFn$1.output(SimpleParDoFn.java:271)
at org.apache.beam.runners.core.SimpleDoFnRunner.outputWindowedValue(SimpleDoFnRunner.java:219)
at org.apache.beam.runners.core.SimpleDoFnRunner.access$700(SimpleDoFnRunner.java:69)
at org.apache.beam.runners.core.SimpleDoFnRunner$DoFnProcessContext.output(SimpleDoFnRunner.java:517)
at org.apache.beam.sdk.transforms.DoFnOutputReceivers$WindowedContextOutputReceiver.output(DoFnOutputReceivers.java:42)
at org.apache.beam.sdk.transforms.MapElements$1.processElement(MapElements.java:131)
at org.apache.beam.sdk.transforms.MapElements$1$DoFnInvoker.invokeProcessElement(Unknown Source)
at org.apache.beam.runners.core.SimpleDoFnRunner.invokeProcessElement(SimpleDoFnRunner.java:185)
at org.apache.beam.runners.core.SimpleDoFnRunner.processElement(SimpleDoFnRunner.java:149)
at com.google.cloud.dataflow.worker.SimpleParDoFn.processElement(SimpleParDoFn.java:323)
at com.google.cloud.dataflow.worker.util.common.worker.ParDoOperation.process(ParDoOperation.java:43)
at com.google.cloud.dataflow.worker.util.common.worker.OutputReceiver.process(OutputReceiver.java:48)
at com.google.cloud.dataflow.worker.SimpleParDoFn$1.output(SimpleParDoFn.java:271)
at org.apache.beam.runners.core.SimpleDoFnRunner.outputWindowedValue(SimpleDoFnRunner.java:219)
at org.apache.beam.runners.core.SimpleDoFnRunner.access$700(SimpleDoFnRunner.java:69)
at org.apache.beam.runners.core.SimpleDoFnRunner$DoFnProcessContext.output(SimpleDoFnRunner.java:517)
at org.apache.beam.runners.core.SimpleDoFnRunner$DoFnProcessContext.output(SimpleDoFnRunner.java:505)
at org.apache.beam.sdk.testing.PAssert$ConcatFn.processElement(PAssert.java:1049)
at org.apache.beam.sdk.testing.PAssert$ConcatFn$DoFnInvoker.invokeProcessElement(Unknown Source)
at org.apache.beam.runners.core.SimpleDoFnRunner.invokeProcessElement(SimpleDoFnRunner.java:185)
at org.apache.beam.runners.core.SimpleDoFnRunner.processElement(SimpleDoFnRunner.java:149)
at com.google.cloud.dataflow.worker.SimpleParDoFn.processElement(SimpleParDoFn.java:323)
at com.google.cloud.dataflow.worker.util.common.worker.ParDoOperation.process(ParDoOperation.java:43)
at com.google.cloud.dataflow.worker.util.common.worker.OutputReceiver.process(OutputReceiver.java:48)
at com.google.cloud.dataflow.worker.SimpleParDoFn$1.output(SimpleParDoFn.java:271)
at org.apache.beam.runners.core.SimpleDoFnRunner.outputWindowedValue(SimpleDoFnRunner.java:219)
at org.apache.beam.runners.core.SimpleDoFnRunner.access$700(SimpleDoFnRunner.java:69)
at org.apache.beam.runners.core.SimpleDoFnRunner$DoFnProcessContext.output(SimpleDoFnRunner.java:517)
at org.apache.beam.sdk.transforms.DoFnOutputReceivers$WindowedContextOutputReceiver.output(DoFnOutputReceivers.java:42)
at org.apache.beam.sdk.transforms.MapElements$1.processElement(MapElements.java:131)
at org.apache.beam.sdk.transforms.MapElements$1$DoFnInvoker.invokeProcessElement(Unknown Source)
at org.apache.beam.runners.core.SimpleDoFnRunner.invokeProcessElement(SimpleDoFnRunner.java:185)
at org.apache.beam.runners.core.SimpleDoFnRunner.processElement(SimpleDoFnRunner.java:149)
at com.google.cloud.dataflow.worker.SimpleParDoFn.processElement(SimpleParDoFn.java:323)
at com.google.cloud.dataflow.worker.util.common.worker.ParDoOperation.process(ParDoOperation.java:43)
at com.google.cloud.dataflow.worker.util.common.worker.OutputReceiver.process(OutputReceiver.java:48)
at com.google.cloud.dataflow.worker.GroupAlsoByWindowsParDoFn$1.output(GroupAlsoByWindowsParDoFn.java:181)
... 21 more
Caused by: java.lang.AssertionError: OutputSideInputs/ParMultiDo(Anonymous).output: org/hamcrest/Matchers
at org.apache.beam.sdk.testing.PAssert$PAssertionSite.capture(PAssert.java:168)
at org.apache.beam.sdk.testing.PAssert.that(PAssert.java:378)
at org.apache.beam.sdk.testing.PAssert.that(PAssert.java:370)
at org.apache.beam.sdk.transforms.ViewTest.testSingletonSideInput(ViewTest.java:107)
at sun.reflect.NativeMethodAccessorImpl.invoke0(Native Method)
at sun.reflect.NativeMethodAccessorImpl.invoke(NativeMethodAccessorImpl.java:62)
at sun.reflect.DelegatingMethodAccessorImpl.invoke(DelegatingMethodAccessorImpl.java:43)
at java.lang.reflect.Method.invoke(Method.java:498)
at org.junit.runners.model.FrameworkMethod$1.runReflectiveCall(FrameworkMethod.java:50)
at org.junit.internal.runners.model.ReflectiveCallable.run(ReflectiveCallable.java:12)
at org.junit.runners.model.FrameworkMethod.invokeExplosively(FrameworkMethod.java:47)
at org.junit.internal.runners.statements.InvokeMethod.evaluate(InvokeMethod.java:17)
at org.apache.beam.sdk.testing.TestPipeline$1.evaluate(TestPipeline.java:317)
at org.junit.rules.ExpectedException$ExpectedExceptionStatement.evaluate(ExpectedException.java:239)
at org.junit.rules.RunRules.evaluate(RunRules.java:20)
at org.junit.runners.ParentRunner.runLeaf(ParentRunner.java:325)
at org.junit.runners.BlockJUnit4ClassRunner.runChild(BlockJUnit4ClassRunner.java:78)
at org.junit.runners.BlockJUnit4ClassRunner.runChild(BlockJUnit4ClassRunner.java:57)
at org.junit.runners.ParentRunner$3.run(ParentRunner.java:290)
at org.junit.runners.ParentRunner$1.schedule(ParentRunner.java:71)
at org.junit.runners.ParentRunner.runChildren(ParentRunner.java:288)
at org.junit.runners.ParentRunner.access$000(ParentRunner.java:58)
at org.junit.runners.ParentRunner$2.evaluate(ParentRunner.java:268)
at org.junit.runners.ParentRunner.run(ParentRunner.java:363)
at org.gradle.api.internal.tasks.testing.junit.JUnitTestClassExecutor.runTestClass(JUnitTestClassExecutor.java:106)
at org.gradle.api.internal.tasks.testing.junit.JUnitTestClassExecutor.execute(JUnitTestClassExecutor.java:58)
at org.gradle.api.internal.tasks.testing.junit.JUnitTestClassExecutor.execute(JUnitTestClassExecutor.java:38)
at org.gradle.api.internal.tasks.testing.junit.AbstractJUnitTestClassProcessor.processTestClass(AbstractJUnitTestClassProcessor.java:66)
at org.gradle.api.internal.tasks.testing.SuiteTestClassProcessor.processTestClass(SuiteTestClassProcessor.java:51)
at sun.reflect.NativeMethodAccessorImpl.invoke0(Native Method)
at sun.reflect.NativeMethodAccessorImpl.invoke(NativeMethodAccessorImpl.java:62)
at sun.reflect.DelegatingMethodAccessorImpl.invoke(DelegatingMethodAccessorImpl.java:43)
at java.lang.reflect.Method.invoke(Method.java:498)
at org.gradle.internal.dispatch.ReflectionDispatch.dispatch(ReflectionDispatch.java:35)
at org.gradle.internal.dispatch.ReflectionDispatch.dispatch(ReflectionDispatch.java:24)
at org.gradle.internal.dispatch.ContextClassLoaderDispatch.dispatch(ContextClassLoaderDispatch.java:32)
at org.gradle.internal.dispatch.ProxyDispatchAdapter$DispatchingInvocationHandler.invoke(ProxyDispatchAdapter.java:93)
at com.sun.proxy.$Proxy2.processTestClass(Unknown Source)
at org.gradle.api.internal.tasks.testing.worker.TestWorker.processTestClass(TestWorker.java:109)
at sun.reflect.NativeMethodAccessorImpl.invoke0(Native Method)
at sun.reflect.NativeMethodAccessorImpl.invoke(NativeMethodAccessorImpl.java:62)
at sun.reflect.DelegatingMethodAccessorImpl.invoke(DelegatingMethodAccessorImpl.java:43)
at java.lang.reflect.Method.invoke(Method.java:498)
at org.gradle.internal.dispatch.ReflectionDispatch.dispatch(ReflectionDispatch.java:35)
at org.gradle.internal.dispatch.ReflectionDispatch.dispatch(ReflectionDispatch.java:24)
at org.gradle.internal.remote.internal.hub.MessageHubBackedObjectConnection$DispatchWrapper.dispatch(MessageHubBackedObjectConnection.java:155)
at org.gradle.internal.remote.internal.hub.MessageHubBackedObjectConnection$DispatchWrapper.dispatch(MessageHubBackedObjectConnection.java:137)
at org.gradle.internal.remote.internal.hub.MessageHub$Handler.run(MessageHub.java:404)
at org.gradle.internal.concurrent.ExecutorPolicy$CatchAndRecordFailures.onExecute(ExecutorPolicy.java:63)
at org.gradle.internal.concurrent.ManagedExecutorImpl$1.run(ManagedExecutorImpl.java:46)
at java.util.concurrent.ThreadPoolExecutor.runWorker(ThreadPoolExecutor.java:1149)
at java.util.concurrent.ThreadPoolExecutor$Worker.run(ThreadPoolExecutor.java:624)
at org.gradle.internal.concurrent.ThreadFactoryImpl$ManagedThreadRunnable.run(ThreadFactoryImpl.java:55)
Caused by: java.lang.NoClassDefFoundError: org/hamcrest/Matchers
at org.apache.beam.sdk.testing.PAssert$AssertContainsInAnyOrder.apply(PAssert.java:1322)
at org.apache.beam.sdk.testing.PAssert$AssertContainsInAnyOrder.apply(PAssert.java:1301)
at org.apache.beam.sdk.testing.PAssert$CheckRelationAgainstExpected.apply(PAssert.java:966)
at org.apache.beam.sdk.testing.PAssert$CheckRelationAgainstExpected.apply(PAssert.java:946)
at org.apache.beam.sdk.testing.PAssert.doChecks(PAssert.java:1250)
at org.apache.beam.sdk.testing.PAssert$GroupedValuesCheckerDoFn.processElement(PAssert.java:1215)
at org.apache.beam.sdk.testing.PAssert$GroupedValuesCheckerDoFn$DoFnInvoker.invokeProcessElement(Unknown Source)
at org.apache.beam.runners.core.SimpleDoFnRunner.invokeProcessElement(SimpleDoFnRunner.java:185)
at org.apache.beam.runners.core.SimpleDoFnRunner.processElement(SimpleDoFnRunner.java:149)
at com.google.cloud.dataflow.worker.SimpleParDoFn.processElement(SimpleParDoFn.java:323)
at com.google.cloud.dataflow.worker.util.common.worker.ParDoOperation.process(ParDoOperation.java:43)
at com.google.cloud.dataflow.worker.util.common.worker.OutputReceiver.process(OutputReceiver.java:48)
at com.google.cloud.dataflow.worker.SimpleParDoFn$1.output(SimpleParDoFn.java:271)
at org.apache.beam.runners.core.SimpleDoFnRunner.outputWindowedValue(SimpleDoFnRunner.java:219)
at org.apache.beam.runners.core.SimpleDoFnRunner.access$700(SimpleDoFnRunner.java:69)
at org.apache.beam.runners.core.SimpleDoFnRunner$DoFnProcessContext.output(SimpleDoFnRunner.java:517)
at org.apache.beam.sdk.transforms.DoFnOutputReceivers$WindowedContextOutputReceiver.output(DoFnOutputReceivers.java:42)
at org.apache.beam.sdk.transforms.MapElements$1.processElement(MapElements.java:131)
at org.apache.beam.sdk.transforms.MapElements$1$DoFnInvoker.invokeProcessElement(Unknown Source)
at org.apache.beam.runners.core.SimpleDoFnRunner.invokeProcessElement(SimpleDoFnRunner.java:185)
at org.apache.beam.runners.core.SimpleDoFnRunner.processElement(SimpleDoFnRunner.java:149)
at com.google.cloud.dataflow.worker.SimpleParDoFn.processElement(SimpleParDoFn.java:323)
at com.google.cloud.dataflow.worker.util.common.worker.ParDoOperation.process(ParDoOperation.java:43)
at com.google.cloud.dataflow.worker.util.common.worker.OutputReceiver.process(OutputReceiver.java:48)
at com.google.cloud.dataflow.worker.SimpleParDoFn$1.output(SimpleParDoFn.java:271)
at org.apache.beam.runners.core.SimpleDoFnRunner.outputWindowedValue(SimpleDoFnRunner.java:219)
at org.apache.beam.runners.core.SimpleDoFnRunner.access$700(SimpleDoFnRunner.java:69)
at org.apache.beam.runners.core.SimpleDoFnRunner$DoFnProcessContext.output(SimpleDoFnRunner.java:517)
at org.apache.beam.runners.core.SimpleDoFnRunner$DoFnProcessContext.output(SimpleDoFnRunner.java:505)
at org.apache.beam.sdk.testing.PAssert$ConcatFn.processElement(PAssert.java:1049)
at org.apache.beam.sdk.testing.PAssert$ConcatFn$DoFnInvoker.invokeProcessElement(Unknown Source)
at org.apache.beam.runners.core.SimpleDoFnRunner.invokeProcessElement(SimpleDoFnRunner.java:185)
at org.apache.beam.runners.core.SimpleDoFnRunner.processElement(SimpleDoFnRunner.java:149)
at com.google.cloud.dataflow.worker.SimpleParDoFn.processElement(SimpleParDoFn.java:323)
at com.google.cloud.dataflow.worker.util.common.worker.ParDoOperation.process(ParDoOperation.java:43)
at com.google.cloud.dataflow.worker.util.common.worker.OutputReceiver.process(OutputReceiver.java:48)
at com.google.cloud.dataflow.worker.SimpleParDoFn$1.output(SimpleParDoFn.java:271)
at org.apache.beam.runners.core.SimpleDoFnRunner.outputWindowedValue(SimpleDoFnRunner.java:219)
at org.apache.beam.runners.core.SimpleDoFnRunner.access$700(SimpleDoFnRunner.java:69)
at org.apache.beam.runners.core.SimpleDoFnRunner$DoFnProcessContext.output(SimpleDoFnRunner.java:517)
at org.apache.beam.sdk.transforms.DoFnOutputReceivers$WindowedContextOutputReceiver.output(DoFnOutputReceivers.java:42)
at org.apache.beam.sdk.transforms.MapElements$1.processElement(MapElements.java:131)
at org.apache.beam.sdk.transforms.MapElements$1$DoFnInvoker.invokeProcessElement(Unknown Source)
at org.apache.beam.runners.core.SimpleDoFnRunner.invokeProcessElement(SimpleDoFnRunner.java:185)
at org.apache.beam.runners.core.SimpleDoFnRunner.processElement(SimpleDoFnRunner.java:149)
at com.google.cloud.dataflow.worker.SimpleParDoFn.processElement(SimpleParDoFn.java:323)
at com.google.cloud.dataflow.worker.util.common.worker.ParDoOperation.process(ParDoOperation.java:43)
at com.google.cloud.dataflow.worker.util.common.worker.OutputReceiver.process(OutputReceiver.java:48)
at com.google.cloud.dataflow.worker.GroupAlsoByWindowsParDoFn$1.output(GroupAlsoByWindowsParDoFn.java:181)
at com.google.cloud.dataflow.worker.GroupAlsoByWindowFnRunner$1.outputWindowedValue(GroupAlsoByWindowFnRunner.java:102)
at com.google.cloud.dataflow.worker.util.BatchGroupAlsoByWindowViaIteratorsFn.processElement(BatchGroupAlsoByWindowViaIteratorsFn.java:124)
at com.google.cloud.dataflow.worker.util.BatchGroupAlsoByWindowViaIteratorsFn.processElement(BatchGroupAlsoByWindowViaIteratorsFn.java:53)
at com.google.cloud.dataflow.worker.GroupAlsoByWindowFnRunner.invokeProcessElement(GroupAlsoByWindowFnRunner.java:115)
at com.google.cloud.dataflow.worker.GroupAlsoByWindowFnRunner.processElement(GroupAlsoByWindowFnRunner.java:73)
at com.google.cloud.dataflow.worker.GroupAlsoByWindowsParDoFn.processElement(GroupAlsoByWindowsParDoFn.java:113)
at com.google.cloud.dataflow.worker.util.common.worker.ParDoOperation.process(ParDoOperation.java:43)
at com.google.cloud.dataflow.worker.util.common.worker.OutputReceiver.process(OutputReceiver.java:48)
at com.google.cloud.dataflow.worker.util.common.worker.ReadOperation.runReadLoop(ReadOperation.java:200)
at com.google.cloud.dataflow.worker.util.common.worker.ReadOperation.start(ReadOperation.java:158)
at com.google.cloud.dataflow.worker.util.common.worker.MapTaskExecutor.execute(MapTaskExecutor.java:75)
at com.google.cloud.dataflow.worker.BatchDataflowWorker.executeWork(BatchDataflowWorker.java:391)
at com.google.cloud.dataflow.worker.BatchDataflowWorker.doWork(BatchDataflowWorker.java:360)
at com.google.cloud.dataflow.worker.BatchDataflowWorker.getAndPerformWork(BatchDataflowWorker.java:288)
at com.google.cloud.dataflow.worker.DataflowBatchWorkerHarness$WorkerThread.doWork(DataflowBatchWorkerHarness.java:134)
at com.google.cloud.dataflow.worker.DataflowBatchWorkerHarness$WorkerThread.call(DataflowBatchWorkerHarness.java:114)
at com.google.cloud.dataflow.worker.DataflowBatchWorkerHarness$WorkerThread.call(DataflowBatchWorkerHarness.java:101)
at java.util.concurrent.FutureTask.run(FutureTask.java:266)
at java.util.concurrent.ThreadPoolExecutor.runWorker(ThreadPoolExecutor.java:1142)
at java.util.concurrent.ThreadPoolExecutor$Worker.run(ThreadPoolExecutor.java:617)
at java.lang.Thread.run(Thread.java:745)
Workflow failed. Causes: S16:PAssert$33/GroupGlobally/GroupDummyAndContents/Read+PAssert$33/GroupGlobally/GroupDummyAndContents/GroupByWindow+PAssert$33/GroupGlobally/Values/Values/Map+PAssert$33/GroupGlobally/ParDo(Concat)+PAssert$33/GetPane/Map+PAssert$33/RunChecks+PAssert$33/VerifyAssertions/ParDo(DefaultConclude) failed., A work item was attempted 4 times without success. Each time the worker eventually lost contact with the service. The work item was attempted on:
viewtest0testsingletonsid-06171424-xfdp-harness-4stq,
viewtest0testsingletonsid-06171424-xfdp-harness-4stq,
viewtest0testsingletonsid-06171424-xfdp-harness-4stq,
viewtest0testsingletonsid-06171424-xfdp-harness-4stq
at org.apache.beam.runners.dataflow.TestDataflowRunner.run(TestDataflowRunner.java:134)
at org.apache.beam.runners.dataflow.TestDataflowRunner.run(TestDataflowRunner.java:90)
at org.apache.beam.runners.dataflow.TestDataflowRunner.run(TestDataflowRunner.java:55)
at org.apache.beam.sdk.Pipeline.run(Pipeline.java:311)
at org.apache.beam.sdk.testing.TestPipeline.run(TestPipeline.java:348)
at org.apache.beam.sdk.testing.TestPipeline.run(TestPipeline.java:329)
at org.apache.beam.sdk.transforms.ViewTest.testSingletonSideInput(ViewTest.java:109)
Gradle Test Executor 38 finished executing tests.
> Task :beam-runners-google-cloud-dataflow-java:validatesRunnerTest
209 tests completed, 190 failed, 2 skipped
Finished generating test XML results (1.888 secs) into: <https://builds.apache.org/job/beam_PostCommit_Java_ValidatesRunner_Dataflow_Gradle/ws/src/runners/google-cloud-dataflow-java/build/test-results/validatesRunnerTest>
Generating HTML test report...
Finished generating test html results (0.602 secs) into: <https://builds.apache.org/job/beam_PostCommit_Java_ValidatesRunner_Dataflow_Gradle/ws/src/runners/google-cloud-dataflow-java/build/reports/tests/validatesRunnerTest>
> Task :beam-runners-google-cloud-dataflow-java:validatesRunnerTest FAILED
:beam-runners-google-cloud-dataflow-java:validatesRunnerTest (Thread[Task worker for ':' Thread 4,5,main]) completed. Took 2 hrs 22 mins 4.467 secs.
FAILURE: Build failed with an exception.
* What went wrong:
Execution failed for task ':beam-runners-google-cloud-dataflow-java:validatesRunnerTest'.
> There were failing tests. See the report at: file://<https://builds.apache.org/job/beam_PostCommit_Java_ValidatesRunner_Dataflow_Gradle/ws/src/runners/google-cloud-dataflow-java/build/reports/tests/validatesRunnerTest/index.html>
* Try:
Run with --stacktrace option to get the stack trace. Run with --debug option to get more log output. Run with --scan to get full insights.
* Get more help at https://help.gradle.org
Deprecated Gradle features were used in this build, making it incompatible with Gradle 5.0.
See https://docs.gradle.org/4.8/userguide/command_line_interface.html#sec:command_line_warnings
BUILD FAILED in 2h 23m 25s
38 actionable tasks: 31 executed, 7 from cache
Publishing build scan...
https://gradle.com/s/ub2zk4344pq6o
Build step 'Invoke Gradle script' changed build result to FAILURE
Build step 'Invoke Gradle script' marked build as failure
Recording test results
Not sending mail to unregistered user apilloud@google.com
Not sending mail to unregistered user robbe.sneyders@ml6.eu
Not sending mail to unregistered user github@alasdairhodge.co.uk
Not sending mail to unregistered user ringwalt@google.com
Not sending mail to unregistered user aaltay@gmail.com
Not sending mail to unregistered user swegner@google.com
Not sending mail to unregistered user robinyq@rodete-desktop-imager.corp.google.com
Not sending mail to unregistered user ehudm@google.com
Not sending mail to unregistered user kedin@google.com
Not sending mail to unregistered user jiangkai@gmail.com
Not sending mail to unregistered user kirpichov@google.com
Not sending mail to unregistered user fvoichick@gmail.com
Build failed in Jenkins:
beam_PostCommit_Java_ValidatesRunner_Dataflow_Gradle #520
Posted by Apache Jenkins Server <je...@builds.apache.org>.
See <https://builds.apache.org/job/beam_PostCommit_Java_ValidatesRunner_Dataflow_Gradle/520/display/redirect>
------------------------------------------
[...truncated 54.75 MB...]
at com.google.cloud.dataflow.worker.DataflowBatchWorkerHarness$WorkerThread.call(DataflowBatchWorkerHarness.java:114)
at com.google.cloud.dataflow.worker.DataflowBatchWorkerHarness$WorkerThread.call(DataflowBatchWorkerHarness.java:101)
at java.util.concurrent.FutureTask.run(FutureTask.java:266)
at java.util.concurrent.ThreadPoolExecutor.runWorker(ThreadPoolExecutor.java:1142)
at java.util.concurrent.ThreadPoolExecutor$Worker.run(ThreadPoolExecutor.java:617)
at java.lang.Thread.run(Thread.java:745)
Caused by: org.apache.beam.sdk.util.UserCodeException: java.lang.AssertionError: OutputSideInputs/ParMultiDo(Anonymous).output: org/hamcrest/Matchers
at org.apache.beam.sdk.util.UserCodeException.wrap(UserCodeException.java:36)
at org.apache.beam.sdk.testing.PAssert$DefaultConcludeFn$DoFnInvoker.invokeProcessElement(Unknown Source)
at org.apache.beam.runners.core.SimpleDoFnRunner.invokeProcessElement(SimpleDoFnRunner.java:185)
at org.apache.beam.runners.core.SimpleDoFnRunner.processElement(SimpleDoFnRunner.java:149)
at com.google.cloud.dataflow.worker.SimpleParDoFn.processElement(SimpleParDoFn.java:323)
at com.google.cloud.dataflow.worker.util.common.worker.ParDoOperation.process(ParDoOperation.java:43)
at com.google.cloud.dataflow.worker.util.common.worker.OutputReceiver.process(OutputReceiver.java:48)
at com.google.cloud.dataflow.worker.SimpleParDoFn$1.output(SimpleParDoFn.java:271)
at org.apache.beam.runners.core.SimpleDoFnRunner.outputWindowedValue(SimpleDoFnRunner.java:219)
at org.apache.beam.runners.core.SimpleDoFnRunner.access$700(SimpleDoFnRunner.java:69)
at org.apache.beam.runners.core.SimpleDoFnRunner$DoFnProcessContext.output(SimpleDoFnRunner.java:517)
at org.apache.beam.runners.core.SimpleDoFnRunner$DoFnProcessContext.output(SimpleDoFnRunner.java:505)
at org.apache.beam.sdk.testing.PAssert$GroupedValuesCheckerDoFn.processElement(PAssert.java:1215)
at org.apache.beam.sdk.testing.PAssert$GroupedValuesCheckerDoFn$DoFnInvoker.invokeProcessElement(Unknown Source)
at org.apache.beam.runners.core.SimpleDoFnRunner.invokeProcessElement(SimpleDoFnRunner.java:185)
at org.apache.beam.runners.core.SimpleDoFnRunner.processElement(SimpleDoFnRunner.java:149)
at com.google.cloud.dataflow.worker.SimpleParDoFn.processElement(SimpleParDoFn.java:323)
at com.google.cloud.dataflow.worker.util.common.worker.ParDoOperation.process(ParDoOperation.java:43)
at com.google.cloud.dataflow.worker.util.common.worker.OutputReceiver.process(OutputReceiver.java:48)
at com.google.cloud.dataflow.worker.SimpleParDoFn$1.output(SimpleParDoFn.java:271)
at org.apache.beam.runners.core.SimpleDoFnRunner.outputWindowedValue(SimpleDoFnRunner.java:219)
at org.apache.beam.runners.core.SimpleDoFnRunner.access$700(SimpleDoFnRunner.java:69)
at org.apache.beam.runners.core.SimpleDoFnRunner$DoFnProcessContext.output(SimpleDoFnRunner.java:517)
at org.apache.beam.sdk.transforms.DoFnOutputReceivers$WindowedContextOutputReceiver.output(DoFnOutputReceivers.java:42)
at org.apache.beam.sdk.transforms.MapElements$1.processElement(MapElements.java:131)
at org.apache.beam.sdk.transforms.MapElements$1$DoFnInvoker.invokeProcessElement(Unknown Source)
at org.apache.beam.runners.core.SimpleDoFnRunner.invokeProcessElement(SimpleDoFnRunner.java:185)
at org.apache.beam.runners.core.SimpleDoFnRunner.processElement(SimpleDoFnRunner.java:149)
at com.google.cloud.dataflow.worker.SimpleParDoFn.processElement(SimpleParDoFn.java:323)
at com.google.cloud.dataflow.worker.util.common.worker.ParDoOperation.process(ParDoOperation.java:43)
at com.google.cloud.dataflow.worker.util.common.worker.OutputReceiver.process(OutputReceiver.java:48)
at com.google.cloud.dataflow.worker.SimpleParDoFn$1.output(SimpleParDoFn.java:271)
at org.apache.beam.runners.core.SimpleDoFnRunner.outputWindowedValue(SimpleDoFnRunner.java:219)
at org.apache.beam.runners.core.SimpleDoFnRunner.access$700(SimpleDoFnRunner.java:69)
at org.apache.beam.runners.core.SimpleDoFnRunner$DoFnProcessContext.output(SimpleDoFnRunner.java:517)
at org.apache.beam.runners.core.SimpleDoFnRunner$DoFnProcessContext.output(SimpleDoFnRunner.java:505)
at org.apache.beam.sdk.testing.PAssert$ConcatFn.processElement(PAssert.java:1049)
at org.apache.beam.sdk.testing.PAssert$ConcatFn$DoFnInvoker.invokeProcessElement(Unknown Source)
at org.apache.beam.runners.core.SimpleDoFnRunner.invokeProcessElement(SimpleDoFnRunner.java:185)
at org.apache.beam.runners.core.SimpleDoFnRunner.processElement(SimpleDoFnRunner.java:149)
at com.google.cloud.dataflow.worker.SimpleParDoFn.processElement(SimpleParDoFn.java:323)
at com.google.cloud.dataflow.worker.util.common.worker.ParDoOperation.process(ParDoOperation.java:43)
at com.google.cloud.dataflow.worker.util.common.worker.OutputReceiver.process(OutputReceiver.java:48)
at com.google.cloud.dataflow.worker.SimpleParDoFn$1.output(SimpleParDoFn.java:271)
at org.apache.beam.runners.core.SimpleDoFnRunner.outputWindowedValue(SimpleDoFnRunner.java:219)
at org.apache.beam.runners.core.SimpleDoFnRunner.access$700(SimpleDoFnRunner.java:69)
at org.apache.beam.runners.core.SimpleDoFnRunner$DoFnProcessContext.output(SimpleDoFnRunner.java:517)
at org.apache.beam.sdk.transforms.DoFnOutputReceivers$WindowedContextOutputReceiver.output(DoFnOutputReceivers.java:42)
at org.apache.beam.sdk.transforms.MapElements$1.processElement(MapElements.java:131)
at org.apache.beam.sdk.transforms.MapElements$1$DoFnInvoker.invokeProcessElement(Unknown Source)
at org.apache.beam.runners.core.SimpleDoFnRunner.invokeProcessElement(SimpleDoFnRunner.java:185)
at org.apache.beam.runners.core.SimpleDoFnRunner.processElement(SimpleDoFnRunner.java:149)
at com.google.cloud.dataflow.worker.SimpleParDoFn.processElement(SimpleParDoFn.java:323)
at com.google.cloud.dataflow.worker.util.common.worker.ParDoOperation.process(ParDoOperation.java:43)
at com.google.cloud.dataflow.worker.util.common.worker.OutputReceiver.process(OutputReceiver.java:48)
at com.google.cloud.dataflow.worker.GroupAlsoByWindowsParDoFn$1.output(GroupAlsoByWindowsParDoFn.java:181)
... 21 more
Caused by: java.lang.AssertionError: OutputSideInputs/ParMultiDo(Anonymous).output: org/hamcrest/Matchers
at org.apache.beam.sdk.testing.PAssert$PAssertionSite.capture(PAssert.java:168)
at org.apache.beam.sdk.testing.PAssert.that(PAssert.java:378)
at org.apache.beam.sdk.testing.PAssert.that(PAssert.java:370)
at org.apache.beam.sdk.transforms.ViewTest.testSingletonSideInput(ViewTest.java:107)
at sun.reflect.NativeMethodAccessorImpl.invoke0(Native Method)
at sun.reflect.NativeMethodAccessorImpl.invoke(NativeMethodAccessorImpl.java:62)
at sun.reflect.DelegatingMethodAccessorImpl.invoke(DelegatingMethodAccessorImpl.java:43)
at java.lang.reflect.Method.invoke(Method.java:498)
at org.junit.runners.model.FrameworkMethod$1.runReflectiveCall(FrameworkMethod.java:50)
at org.junit.internal.runners.model.ReflectiveCallable.run(ReflectiveCallable.java:12)
at org.junit.runners.model.FrameworkMethod.invokeExplosively(FrameworkMethod.java:47)
at org.junit.internal.runners.statements.InvokeMethod.evaluate(InvokeMethod.java:17)
at org.apache.beam.sdk.testing.TestPipeline$1.evaluate(TestPipeline.java:317)
at org.junit.rules.ExpectedException$ExpectedExceptionStatement.evaluate(ExpectedException.java:239)
at org.junit.rules.RunRules.evaluate(RunRules.java:20)
at org.junit.runners.ParentRunner.runLeaf(ParentRunner.java:325)
at org.junit.runners.BlockJUnit4ClassRunner.runChild(BlockJUnit4ClassRunner.java:78)
at org.junit.runners.BlockJUnit4ClassRunner.runChild(BlockJUnit4ClassRunner.java:57)
at org.junit.runners.ParentRunner$3.run(ParentRunner.java:290)
at org.junit.runners.ParentRunner$1.schedule(ParentRunner.java:71)
at org.junit.runners.ParentRunner.runChildren(ParentRunner.java:288)
at org.junit.runners.ParentRunner.access$000(ParentRunner.java:58)
at org.junit.runners.ParentRunner$2.evaluate(ParentRunner.java:268)
at org.junit.runners.ParentRunner.run(ParentRunner.java:363)
at org.gradle.api.internal.tasks.testing.junit.JUnitTestClassExecutor.runTestClass(JUnitTestClassExecutor.java:106)
at org.gradle.api.internal.tasks.testing.junit.JUnitTestClassExecutor.execute(JUnitTestClassExecutor.java:58)
at org.gradle.api.internal.tasks.testing.junit.JUnitTestClassExecutor.execute(JUnitTestClassExecutor.java:38)
at org.gradle.api.internal.tasks.testing.junit.AbstractJUnitTestClassProcessor.processTestClass(AbstractJUnitTestClassProcessor.java:66)
at org.gradle.api.internal.tasks.testing.SuiteTestClassProcessor.processTestClass(SuiteTestClassProcessor.java:51)
at sun.reflect.NativeMethodAccessorImpl.invoke0(Native Method)
at sun.reflect.NativeMethodAccessorImpl.invoke(NativeMethodAccessorImpl.java:62)
at sun.reflect.DelegatingMethodAccessorImpl.invoke(DelegatingMethodAccessorImpl.java:43)
at java.lang.reflect.Method.invoke(Method.java:498)
at org.gradle.internal.dispatch.ReflectionDispatch.dispatch(ReflectionDispatch.java:35)
at org.gradle.internal.dispatch.ReflectionDispatch.dispatch(ReflectionDispatch.java:24)
at org.gradle.internal.dispatch.ContextClassLoaderDispatch.dispatch(ContextClassLoaderDispatch.java:32)
at org.gradle.internal.dispatch.ProxyDispatchAdapter$DispatchingInvocationHandler.invoke(ProxyDispatchAdapter.java:93)
at com.sun.proxy.$Proxy2.processTestClass(Unknown Source)
at org.gradle.api.internal.tasks.testing.worker.TestWorker.processTestClass(TestWorker.java:109)
at sun.reflect.NativeMethodAccessorImpl.invoke0(Native Method)
at sun.reflect.NativeMethodAccessorImpl.invoke(NativeMethodAccessorImpl.java:62)
at sun.reflect.DelegatingMethodAccessorImpl.invoke(DelegatingMethodAccessorImpl.java:43)
at java.lang.reflect.Method.invoke(Method.java:498)
at org.gradle.internal.dispatch.ReflectionDispatch.dispatch(ReflectionDispatch.java:35)
at org.gradle.internal.dispatch.ReflectionDispatch.dispatch(ReflectionDispatch.java:24)
at org.gradle.internal.remote.internal.hub.MessageHubBackedObjectConnection$DispatchWrapper.dispatch(MessageHubBackedObjectConnection.java:155)
at org.gradle.internal.remote.internal.hub.MessageHubBackedObjectConnection$DispatchWrapper.dispatch(MessageHubBackedObjectConnection.java:137)
at org.gradle.internal.remote.internal.hub.MessageHub$Handler.run(MessageHub.java:404)
at org.gradle.internal.concurrent.ExecutorPolicy$CatchAndRecordFailures.onExecute(ExecutorPolicy.java:63)
at org.gradle.internal.concurrent.ManagedExecutorImpl$1.run(ManagedExecutorImpl.java:46)
at java.util.concurrent.ThreadPoolExecutor.runWorker(ThreadPoolExecutor.java:1149)
at java.util.concurrent.ThreadPoolExecutor$Worker.run(ThreadPoolExecutor.java:624)
at org.gradle.internal.concurrent.ThreadFactoryImpl$ManagedThreadRunnable.run(ThreadFactoryImpl.java:55)
Caused by: java.lang.NoClassDefFoundError: org/hamcrest/Matchers
at org.apache.beam.sdk.testing.PAssert$AssertContainsInAnyOrder.apply(PAssert.java:1322)
at org.apache.beam.sdk.testing.PAssert$AssertContainsInAnyOrder.apply(PAssert.java:1301)
at org.apache.beam.sdk.testing.PAssert$CheckRelationAgainstExpected.apply(PAssert.java:966)
at org.apache.beam.sdk.testing.PAssert$CheckRelationAgainstExpected.apply(PAssert.java:946)
at org.apache.beam.sdk.testing.PAssert.doChecks(PAssert.java:1250)
at org.apache.beam.sdk.testing.PAssert$GroupedValuesCheckerDoFn.processElement(PAssert.java:1215)
at org.apache.beam.sdk.testing.PAssert$GroupedValuesCheckerDoFn$DoFnInvoker.invokeProcessElement(Unknown Source)
at org.apache.beam.runners.core.SimpleDoFnRunner.invokeProcessElement(SimpleDoFnRunner.java:185)
at org.apache.beam.runners.core.SimpleDoFnRunner.processElement(SimpleDoFnRunner.java:149)
at com.google.cloud.dataflow.worker.SimpleParDoFn.processElement(SimpleParDoFn.java:323)
at com.google.cloud.dataflow.worker.util.common.worker.ParDoOperation.process(ParDoOperation.java:43)
at com.google.cloud.dataflow.worker.util.common.worker.OutputReceiver.process(OutputReceiver.java:48)
at com.google.cloud.dataflow.worker.SimpleParDoFn$1.output(SimpleParDoFn.java:271)
at org.apache.beam.runners.core.SimpleDoFnRunner.outputWindowedValue(SimpleDoFnRunner.java:219)
at org.apache.beam.runners.core.SimpleDoFnRunner.access$700(SimpleDoFnRunner.java:69)
at org.apache.beam.runners.core.SimpleDoFnRunner$DoFnProcessContext.output(SimpleDoFnRunner.java:517)
at org.apache.beam.sdk.transforms.DoFnOutputReceivers$WindowedContextOutputReceiver.output(DoFnOutputReceivers.java:42)
at org.apache.beam.sdk.transforms.MapElements$1.processElement(MapElements.java:131)
at org.apache.beam.sdk.transforms.MapElements$1$DoFnInvoker.invokeProcessElement(Unknown Source)
at org.apache.beam.runners.core.SimpleDoFnRunner.invokeProcessElement(SimpleDoFnRunner.java:185)
at org.apache.beam.runners.core.SimpleDoFnRunner.processElement(SimpleDoFnRunner.java:149)
at com.google.cloud.dataflow.worker.SimpleParDoFn.processElement(SimpleParDoFn.java:323)
at com.google.cloud.dataflow.worker.util.common.worker.ParDoOperation.process(ParDoOperation.java:43)
at com.google.cloud.dataflow.worker.util.common.worker.OutputReceiver.process(OutputReceiver.java:48)
at com.google.cloud.dataflow.worker.SimpleParDoFn$1.output(SimpleParDoFn.java:271)
at org.apache.beam.runners.core.SimpleDoFnRunner.outputWindowedValue(SimpleDoFnRunner.java:219)
at org.apache.beam.runners.core.SimpleDoFnRunner.access$700(SimpleDoFnRunner.java:69)
at org.apache.beam.runners.core.SimpleDoFnRunner$DoFnProcessContext.output(SimpleDoFnRunner.java:517)
at org.apache.beam.runners.core.SimpleDoFnRunner$DoFnProcessContext.output(SimpleDoFnRunner.java:505)
at org.apache.beam.sdk.testing.PAssert$ConcatFn.processElement(PAssert.java:1049)
at org.apache.beam.sdk.testing.PAssert$ConcatFn$DoFnInvoker.invokeProcessElement(Unknown Source)
at org.apache.beam.runners.core.SimpleDoFnRunner.invokeProcessElement(SimpleDoFnRunner.java:185)
at org.apache.beam.runners.core.SimpleDoFnRunner.processElement(SimpleDoFnRunner.java:149)
at com.google.cloud.dataflow.worker.SimpleParDoFn.processElement(SimpleParDoFn.java:323)
at com.google.cloud.dataflow.worker.util.common.worker.ParDoOperation.process(ParDoOperation.java:43)
at com.google.cloud.dataflow.worker.util.common.worker.OutputReceiver.process(OutputReceiver.java:48)
at com.google.cloud.dataflow.worker.SimpleParDoFn$1.output(SimpleParDoFn.java:271)
at org.apache.beam.runners.core.SimpleDoFnRunner.outputWindowedValue(SimpleDoFnRunner.java:219)
at org.apache.beam.runners.core.SimpleDoFnRunner.access$700(SimpleDoFnRunner.java:69)
at org.apache.beam.runners.core.SimpleDoFnRunner$DoFnProcessContext.output(SimpleDoFnRunner.java:517)
at org.apache.beam.sdk.transforms.DoFnOutputReceivers$WindowedContextOutputReceiver.output(DoFnOutputReceivers.java:42)
at org.apache.beam.sdk.transforms.MapElements$1.processElement(MapElements.java:131)
at org.apache.beam.sdk.transforms.MapElements$1$DoFnInvoker.invokeProcessElement(Unknown Source)
at org.apache.beam.runners.core.SimpleDoFnRunner.invokeProcessElement(SimpleDoFnRunner.java:185)
at org.apache.beam.runners.core.SimpleDoFnRunner.processElement(SimpleDoFnRunner.java:149)
at com.google.cloud.dataflow.worker.SimpleParDoFn.processElement(SimpleParDoFn.java:323)
at com.google.cloud.dataflow.worker.util.common.worker.ParDoOperation.process(ParDoOperation.java:43)
at com.google.cloud.dataflow.worker.util.common.worker.OutputReceiver.process(OutputReceiver.java:48)
at com.google.cloud.dataflow.worker.GroupAlsoByWindowsParDoFn$1.output(GroupAlsoByWindowsParDoFn.java:181)
at com.google.cloud.dataflow.worker.GroupAlsoByWindowFnRunner$1.outputWindowedValue(GroupAlsoByWindowFnRunner.java:102)
at com.google.cloud.dataflow.worker.util.BatchGroupAlsoByWindowViaIteratorsFn.processElement(BatchGroupAlsoByWindowViaIteratorsFn.java:124)
at com.google.cloud.dataflow.worker.util.BatchGroupAlsoByWindowViaIteratorsFn.processElement(BatchGroupAlsoByWindowViaIteratorsFn.java:53)
at com.google.cloud.dataflow.worker.GroupAlsoByWindowFnRunner.invokeProcessElement(GroupAlsoByWindowFnRunner.java:115)
at com.google.cloud.dataflow.worker.GroupAlsoByWindowFnRunner.processElement(GroupAlsoByWindowFnRunner.java:73)
at com.google.cloud.dataflow.worker.GroupAlsoByWindowsParDoFn.processElement(GroupAlsoByWindowsParDoFn.java:113)
at com.google.cloud.dataflow.worker.util.common.worker.ParDoOperation.process(ParDoOperation.java:43)
at com.google.cloud.dataflow.worker.util.common.worker.OutputReceiver.process(OutputReceiver.java:48)
at com.google.cloud.dataflow.worker.util.common.worker.ReadOperation.runReadLoop(ReadOperation.java:200)
at com.google.cloud.dataflow.worker.util.common.worker.ReadOperation.start(ReadOperation.java:158)
at com.google.cloud.dataflow.worker.util.common.worker.MapTaskExecutor.execute(MapTaskExecutor.java:75)
at com.google.cloud.dataflow.worker.BatchDataflowWorker.executeWork(BatchDataflowWorker.java:391)
at com.google.cloud.dataflow.worker.BatchDataflowWorker.doWork(BatchDataflowWorker.java:360)
at com.google.cloud.dataflow.worker.BatchDataflowWorker.getAndPerformWork(BatchDataflowWorker.java:288)
at com.google.cloud.dataflow.worker.DataflowBatchWorkerHarness$WorkerThread.doWork(DataflowBatchWorkerHarness.java:134)
at com.google.cloud.dataflow.worker.DataflowBatchWorkerHarness$WorkerThread.call(DataflowBatchWorkerHarness.java:114)
at com.google.cloud.dataflow.worker.DataflowBatchWorkerHarness$WorkerThread.call(DataflowBatchWorkerHarness.java:101)
at java.util.concurrent.FutureTask.run(FutureTask.java:266)
at java.util.concurrent.ThreadPoolExecutor.runWorker(ThreadPoolExecutor.java:1142)
at java.util.concurrent.ThreadPoolExecutor$Worker.run(ThreadPoolExecutor.java:617)
at java.lang.Thread.run(Thread.java:745)
Workflow failed. Causes: S16:PAssert$33/GroupGlobally/GroupDummyAndContents/Read+PAssert$33/GroupGlobally/GroupDummyAndContents/GroupByWindow+PAssert$33/GroupGlobally/Values/Values/Map+PAssert$33/GroupGlobally/ParDo(Concat)+PAssert$33/GetPane/Map+PAssert$33/RunChecks+PAssert$33/VerifyAssertions/ParDo(DefaultConclude) failed., A work item was attempted 4 times without success. Each time the worker eventually lost contact with the service. The work item was attempted on:
viewtest0testsingletonsid-06170831-jur3-harness-1bvz,
viewtest0testsingletonsid-06170831-jur3-harness-1bvz,
viewtest0testsingletonsid-06170831-jur3-harness-1bvz,
viewtest0testsingletonsid-06170831-jur3-harness-1bvz
at org.apache.beam.runners.dataflow.TestDataflowRunner.run(TestDataflowRunner.java:134)
at org.apache.beam.runners.dataflow.TestDataflowRunner.run(TestDataflowRunner.java:90)
at org.apache.beam.runners.dataflow.TestDataflowRunner.run(TestDataflowRunner.java:55)
at org.apache.beam.sdk.Pipeline.run(Pipeline.java:311)
at org.apache.beam.sdk.testing.TestPipeline.run(TestPipeline.java:348)
at org.apache.beam.sdk.testing.TestPipeline.run(TestPipeline.java:329)
at org.apache.beam.sdk.transforms.ViewTest.testSingletonSideInput(ViewTest.java:109)
Gradle Test Executor 38 finished executing tests.
> Task :beam-runners-google-cloud-dataflow-java:validatesRunnerTest
209 tests completed, 190 failed, 2 skipped
Finished generating test XML results (1.57 secs) into: <https://builds.apache.org/job/beam_PostCommit_Java_ValidatesRunner_Dataflow_Gradle/ws/src/runners/google-cloud-dataflow-java/build/test-results/validatesRunnerTest>
Generating HTML test report...
Finished generating test html results (0.79 secs) into: <https://builds.apache.org/job/beam_PostCommit_Java_ValidatesRunner_Dataflow_Gradle/ws/src/runners/google-cloud-dataflow-java/build/reports/tests/validatesRunnerTest>
> Task :beam-runners-google-cloud-dataflow-java:validatesRunnerTest FAILED
:beam-runners-google-cloud-dataflow-java:validatesRunnerTest (Thread[Task worker for ':' Thread 47,5,main]) completed. Took 2 hrs 18 mins 7.833 secs.
FAILURE: Build failed with an exception.
* What went wrong:
Execution failed for task ':beam-runners-google-cloud-dataflow-java:validatesRunnerTest'.
> There were failing tests. See the report at: file://<https://builds.apache.org/job/beam_PostCommit_Java_ValidatesRunner_Dataflow_Gradle/ws/src/runners/google-cloud-dataflow-java/build/reports/tests/validatesRunnerTest/index.html>
* Try:
Run with --stacktrace option to get the stack trace. Run with --debug option to get more log output. Run with --scan to get full insights.
* Get more help at https://help.gradle.org
Deprecated Gradle features were used in this build, making it incompatible with Gradle 5.0.
See https://docs.gradle.org/4.8/userguide/command_line_interface.html#sec:command_line_warnings
BUILD FAILED in 2h 19m 28s
38 actionable tasks: 32 executed, 6 from cache
Publishing build scan...
https://gradle.com/s/lqpl54djn4l6e
Build step 'Invoke Gradle script' changed build result to FAILURE
Build step 'Invoke Gradle script' marked build as failure
Recording test results
Not sending mail to unregistered user apilloud@google.com
Not sending mail to unregistered user robbe.sneyders@ml6.eu
Not sending mail to unregistered user github@alasdairhodge.co.uk
Not sending mail to unregistered user ringwalt@google.com
Not sending mail to unregistered user aaltay@gmail.com
Not sending mail to unregistered user swegner@google.com
Not sending mail to unregistered user robinyq@rodete-desktop-imager.corp.google.com
Not sending mail to unregistered user ehudm@google.com
Not sending mail to unregistered user kedin@google.com
Not sending mail to unregistered user jiangkai@gmail.com
Not sending mail to unregistered user kirpichov@google.com
Not sending mail to unregistered user fvoichick@gmail.com
Build failed in Jenkins:
beam_PostCommit_Java_ValidatesRunner_Dataflow_Gradle #519
Posted by Apache Jenkins Server <je...@builds.apache.org>.
See <https://builds.apache.org/job/beam_PostCommit_Java_ValidatesRunner_Dataflow_Gradle/519/display/redirect>
------------------------------------------
[...truncated 54.75 MB...]
at com.google.cloud.dataflow.worker.DataflowBatchWorkerHarness$WorkerThread.call(DataflowBatchWorkerHarness.java:114)
at com.google.cloud.dataflow.worker.DataflowBatchWorkerHarness$WorkerThread.call(DataflowBatchWorkerHarness.java:101)
at java.util.concurrent.FutureTask.run(FutureTask.java:266)
at java.util.concurrent.ThreadPoolExecutor.runWorker(ThreadPoolExecutor.java:1142)
at java.util.concurrent.ThreadPoolExecutor$Worker.run(ThreadPoolExecutor.java:617)
at java.lang.Thread.run(Thread.java:745)
Caused by: org.apache.beam.sdk.util.UserCodeException: java.lang.AssertionError: OutputSideInputs/ParMultiDo(Anonymous).output: org/hamcrest/Matchers
at org.apache.beam.sdk.util.UserCodeException.wrap(UserCodeException.java:36)
at org.apache.beam.sdk.testing.PAssert$DefaultConcludeFn$DoFnInvoker.invokeProcessElement(Unknown Source)
at org.apache.beam.runners.core.SimpleDoFnRunner.invokeProcessElement(SimpleDoFnRunner.java:185)
at org.apache.beam.runners.core.SimpleDoFnRunner.processElement(SimpleDoFnRunner.java:149)
at com.google.cloud.dataflow.worker.SimpleParDoFn.processElement(SimpleParDoFn.java:323)
at com.google.cloud.dataflow.worker.util.common.worker.ParDoOperation.process(ParDoOperation.java:43)
at com.google.cloud.dataflow.worker.util.common.worker.OutputReceiver.process(OutputReceiver.java:48)
at com.google.cloud.dataflow.worker.SimpleParDoFn$1.output(SimpleParDoFn.java:271)
at org.apache.beam.runners.core.SimpleDoFnRunner.outputWindowedValue(SimpleDoFnRunner.java:219)
at org.apache.beam.runners.core.SimpleDoFnRunner.access$700(SimpleDoFnRunner.java:69)
at org.apache.beam.runners.core.SimpleDoFnRunner$DoFnProcessContext.output(SimpleDoFnRunner.java:517)
at org.apache.beam.runners.core.SimpleDoFnRunner$DoFnProcessContext.output(SimpleDoFnRunner.java:505)
at org.apache.beam.sdk.testing.PAssert$GroupedValuesCheckerDoFn.processElement(PAssert.java:1215)
at org.apache.beam.sdk.testing.PAssert$GroupedValuesCheckerDoFn$DoFnInvoker.invokeProcessElement(Unknown Source)
at org.apache.beam.runners.core.SimpleDoFnRunner.invokeProcessElement(SimpleDoFnRunner.java:185)
at org.apache.beam.runners.core.SimpleDoFnRunner.processElement(SimpleDoFnRunner.java:149)
at com.google.cloud.dataflow.worker.SimpleParDoFn.processElement(SimpleParDoFn.java:323)
at com.google.cloud.dataflow.worker.util.common.worker.ParDoOperation.process(ParDoOperation.java:43)
at com.google.cloud.dataflow.worker.util.common.worker.OutputReceiver.process(OutputReceiver.java:48)
at com.google.cloud.dataflow.worker.SimpleParDoFn$1.output(SimpleParDoFn.java:271)
at org.apache.beam.runners.core.SimpleDoFnRunner.outputWindowedValue(SimpleDoFnRunner.java:219)
at org.apache.beam.runners.core.SimpleDoFnRunner.access$700(SimpleDoFnRunner.java:69)
at org.apache.beam.runners.core.SimpleDoFnRunner$DoFnProcessContext.output(SimpleDoFnRunner.java:517)
at org.apache.beam.sdk.transforms.DoFnOutputReceivers$WindowedContextOutputReceiver.output(DoFnOutputReceivers.java:42)
at org.apache.beam.sdk.transforms.MapElements$1.processElement(MapElements.java:131)
at org.apache.beam.sdk.transforms.MapElements$1$DoFnInvoker.invokeProcessElement(Unknown Source)
at org.apache.beam.runners.core.SimpleDoFnRunner.invokeProcessElement(SimpleDoFnRunner.java:185)
at org.apache.beam.runners.core.SimpleDoFnRunner.processElement(SimpleDoFnRunner.java:149)
at com.google.cloud.dataflow.worker.SimpleParDoFn.processElement(SimpleParDoFn.java:323)
at com.google.cloud.dataflow.worker.util.common.worker.ParDoOperation.process(ParDoOperation.java:43)
at com.google.cloud.dataflow.worker.util.common.worker.OutputReceiver.process(OutputReceiver.java:48)
at com.google.cloud.dataflow.worker.SimpleParDoFn$1.output(SimpleParDoFn.java:271)
at org.apache.beam.runners.core.SimpleDoFnRunner.outputWindowedValue(SimpleDoFnRunner.java:219)
at org.apache.beam.runners.core.SimpleDoFnRunner.access$700(SimpleDoFnRunner.java:69)
at org.apache.beam.runners.core.SimpleDoFnRunner$DoFnProcessContext.output(SimpleDoFnRunner.java:517)
at org.apache.beam.runners.core.SimpleDoFnRunner$DoFnProcessContext.output(SimpleDoFnRunner.java:505)
at org.apache.beam.sdk.testing.PAssert$ConcatFn.processElement(PAssert.java:1049)
at org.apache.beam.sdk.testing.PAssert$ConcatFn$DoFnInvoker.invokeProcessElement(Unknown Source)
at org.apache.beam.runners.core.SimpleDoFnRunner.invokeProcessElement(SimpleDoFnRunner.java:185)
at org.apache.beam.runners.core.SimpleDoFnRunner.processElement(SimpleDoFnRunner.java:149)
at com.google.cloud.dataflow.worker.SimpleParDoFn.processElement(SimpleParDoFn.java:323)
at com.google.cloud.dataflow.worker.util.common.worker.ParDoOperation.process(ParDoOperation.java:43)
at com.google.cloud.dataflow.worker.util.common.worker.OutputReceiver.process(OutputReceiver.java:48)
at com.google.cloud.dataflow.worker.SimpleParDoFn$1.output(SimpleParDoFn.java:271)
at org.apache.beam.runners.core.SimpleDoFnRunner.outputWindowedValue(SimpleDoFnRunner.java:219)
at org.apache.beam.runners.core.SimpleDoFnRunner.access$700(SimpleDoFnRunner.java:69)
at org.apache.beam.runners.core.SimpleDoFnRunner$DoFnProcessContext.output(SimpleDoFnRunner.java:517)
at org.apache.beam.sdk.transforms.DoFnOutputReceivers$WindowedContextOutputReceiver.output(DoFnOutputReceivers.java:42)
at org.apache.beam.sdk.transforms.MapElements$1.processElement(MapElements.java:131)
at org.apache.beam.sdk.transforms.MapElements$1$DoFnInvoker.invokeProcessElement(Unknown Source)
at org.apache.beam.runners.core.SimpleDoFnRunner.invokeProcessElement(SimpleDoFnRunner.java:185)
at org.apache.beam.runners.core.SimpleDoFnRunner.processElement(SimpleDoFnRunner.java:149)
at com.google.cloud.dataflow.worker.SimpleParDoFn.processElement(SimpleParDoFn.java:323)
at com.google.cloud.dataflow.worker.util.common.worker.ParDoOperation.process(ParDoOperation.java:43)
at com.google.cloud.dataflow.worker.util.common.worker.OutputReceiver.process(OutputReceiver.java:48)
at com.google.cloud.dataflow.worker.GroupAlsoByWindowsParDoFn$1.output(GroupAlsoByWindowsParDoFn.java:181)
... 21 more
Caused by: java.lang.AssertionError: OutputSideInputs/ParMultiDo(Anonymous).output: org/hamcrest/Matchers
at org.apache.beam.sdk.testing.PAssert$PAssertionSite.capture(PAssert.java:168)
at org.apache.beam.sdk.testing.PAssert.that(PAssert.java:378)
at org.apache.beam.sdk.testing.PAssert.that(PAssert.java:370)
at org.apache.beam.sdk.transforms.ViewTest.testSingletonSideInput(ViewTest.java:107)
at sun.reflect.NativeMethodAccessorImpl.invoke0(Native Method)
at sun.reflect.NativeMethodAccessorImpl.invoke(NativeMethodAccessorImpl.java:62)
at sun.reflect.DelegatingMethodAccessorImpl.invoke(DelegatingMethodAccessorImpl.java:43)
at java.lang.reflect.Method.invoke(Method.java:498)
at org.junit.runners.model.FrameworkMethod$1.runReflectiveCall(FrameworkMethod.java:50)
at org.junit.internal.runners.model.ReflectiveCallable.run(ReflectiveCallable.java:12)
at org.junit.runners.model.FrameworkMethod.invokeExplosively(FrameworkMethod.java:47)
at org.junit.internal.runners.statements.InvokeMethod.evaluate(InvokeMethod.java:17)
at org.apache.beam.sdk.testing.TestPipeline$1.evaluate(TestPipeline.java:317)
at org.junit.rules.ExpectedException$ExpectedExceptionStatement.evaluate(ExpectedException.java:239)
at org.junit.rules.RunRules.evaluate(RunRules.java:20)
at org.junit.runners.ParentRunner.runLeaf(ParentRunner.java:325)
at org.junit.runners.BlockJUnit4ClassRunner.runChild(BlockJUnit4ClassRunner.java:78)
at org.junit.runners.BlockJUnit4ClassRunner.runChild(BlockJUnit4ClassRunner.java:57)
at org.junit.runners.ParentRunner$3.run(ParentRunner.java:290)
at org.junit.runners.ParentRunner$1.schedule(ParentRunner.java:71)
at org.junit.runners.ParentRunner.runChildren(ParentRunner.java:288)
at org.junit.runners.ParentRunner.access$000(ParentRunner.java:58)
at org.junit.runners.ParentRunner$2.evaluate(ParentRunner.java:268)
at org.junit.runners.ParentRunner.run(ParentRunner.java:363)
at org.gradle.api.internal.tasks.testing.junit.JUnitTestClassExecutor.runTestClass(JUnitTestClassExecutor.java:106)
at org.gradle.api.internal.tasks.testing.junit.JUnitTestClassExecutor.execute(JUnitTestClassExecutor.java:58)
at org.gradle.api.internal.tasks.testing.junit.JUnitTestClassExecutor.execute(JUnitTestClassExecutor.java:38)
at org.gradle.api.internal.tasks.testing.junit.AbstractJUnitTestClassProcessor.processTestClass(AbstractJUnitTestClassProcessor.java:66)
at org.gradle.api.internal.tasks.testing.SuiteTestClassProcessor.processTestClass(SuiteTestClassProcessor.java:51)
at sun.reflect.NativeMethodAccessorImpl.invoke0(Native Method)
at sun.reflect.NativeMethodAccessorImpl.invoke(NativeMethodAccessorImpl.java:62)
at sun.reflect.DelegatingMethodAccessorImpl.invoke(DelegatingMethodAccessorImpl.java:43)
at java.lang.reflect.Method.invoke(Method.java:498)
at org.gradle.internal.dispatch.ReflectionDispatch.dispatch(ReflectionDispatch.java:35)
at org.gradle.internal.dispatch.ReflectionDispatch.dispatch(ReflectionDispatch.java:24)
at org.gradle.internal.dispatch.ContextClassLoaderDispatch.dispatch(ContextClassLoaderDispatch.java:32)
at org.gradle.internal.dispatch.ProxyDispatchAdapter$DispatchingInvocationHandler.invoke(ProxyDispatchAdapter.java:93)
at com.sun.proxy.$Proxy2.processTestClass(Unknown Source)
at org.gradle.api.internal.tasks.testing.worker.TestWorker.processTestClass(TestWorker.java:109)
at sun.reflect.NativeMethodAccessorImpl.invoke0(Native Method)
at sun.reflect.NativeMethodAccessorImpl.invoke(NativeMethodAccessorImpl.java:62)
at sun.reflect.DelegatingMethodAccessorImpl.invoke(DelegatingMethodAccessorImpl.java:43)
at java.lang.reflect.Method.invoke(Method.java:498)
at org.gradle.internal.dispatch.ReflectionDispatch.dispatch(ReflectionDispatch.java:35)
at org.gradle.internal.dispatch.ReflectionDispatch.dispatch(ReflectionDispatch.java:24)
at org.gradle.internal.remote.internal.hub.MessageHubBackedObjectConnection$DispatchWrapper.dispatch(MessageHubBackedObjectConnection.java:155)
at org.gradle.internal.remote.internal.hub.MessageHubBackedObjectConnection$DispatchWrapper.dispatch(MessageHubBackedObjectConnection.java:137)
at org.gradle.internal.remote.internal.hub.MessageHub$Handler.run(MessageHub.java:404)
at org.gradle.internal.concurrent.ExecutorPolicy$CatchAndRecordFailures.onExecute(ExecutorPolicy.java:63)
at org.gradle.internal.concurrent.ManagedExecutorImpl$1.run(ManagedExecutorImpl.java:46)
at java.util.concurrent.ThreadPoolExecutor.runWorker(ThreadPoolExecutor.java:1149)
at java.util.concurrent.ThreadPoolExecutor$Worker.run(ThreadPoolExecutor.java:624)
at org.gradle.internal.concurrent.ThreadFactoryImpl$ManagedThreadRunnable.run(ThreadFactoryImpl.java:55)
Caused by: java.lang.NoClassDefFoundError: org/hamcrest/Matchers
at org.apache.beam.sdk.testing.PAssert$AssertContainsInAnyOrder.apply(PAssert.java:1322)
at org.apache.beam.sdk.testing.PAssert$AssertContainsInAnyOrder.apply(PAssert.java:1301)
at org.apache.beam.sdk.testing.PAssert$CheckRelationAgainstExpected.apply(PAssert.java:966)
at org.apache.beam.sdk.testing.PAssert$CheckRelationAgainstExpected.apply(PAssert.java:946)
at org.apache.beam.sdk.testing.PAssert.doChecks(PAssert.java:1250)
at org.apache.beam.sdk.testing.PAssert$GroupedValuesCheckerDoFn.processElement(PAssert.java:1215)
at org.apache.beam.sdk.testing.PAssert$GroupedValuesCheckerDoFn$DoFnInvoker.invokeProcessElement(Unknown Source)
at org.apache.beam.runners.core.SimpleDoFnRunner.invokeProcessElement(SimpleDoFnRunner.java:185)
at org.apache.beam.runners.core.SimpleDoFnRunner.processElement(SimpleDoFnRunner.java:149)
at com.google.cloud.dataflow.worker.SimpleParDoFn.processElement(SimpleParDoFn.java:323)
at com.google.cloud.dataflow.worker.util.common.worker.ParDoOperation.process(ParDoOperation.java:43)
at com.google.cloud.dataflow.worker.util.common.worker.OutputReceiver.process(OutputReceiver.java:48)
at com.google.cloud.dataflow.worker.SimpleParDoFn$1.output(SimpleParDoFn.java:271)
at org.apache.beam.runners.core.SimpleDoFnRunner.outputWindowedValue(SimpleDoFnRunner.java:219)
at org.apache.beam.runners.core.SimpleDoFnRunner.access$700(SimpleDoFnRunner.java:69)
at org.apache.beam.runners.core.SimpleDoFnRunner$DoFnProcessContext.output(SimpleDoFnRunner.java:517)
at org.apache.beam.sdk.transforms.DoFnOutputReceivers$WindowedContextOutputReceiver.output(DoFnOutputReceivers.java:42)
at org.apache.beam.sdk.transforms.MapElements$1.processElement(MapElements.java:131)
at org.apache.beam.sdk.transforms.MapElements$1$DoFnInvoker.invokeProcessElement(Unknown Source)
at org.apache.beam.runners.core.SimpleDoFnRunner.invokeProcessElement(SimpleDoFnRunner.java:185)
at org.apache.beam.runners.core.SimpleDoFnRunner.processElement(SimpleDoFnRunner.java:149)
at com.google.cloud.dataflow.worker.SimpleParDoFn.processElement(SimpleParDoFn.java:323)
at com.google.cloud.dataflow.worker.util.common.worker.ParDoOperation.process(ParDoOperation.java:43)
at com.google.cloud.dataflow.worker.util.common.worker.OutputReceiver.process(OutputReceiver.java:48)
at com.google.cloud.dataflow.worker.SimpleParDoFn$1.output(SimpleParDoFn.java:271)
at org.apache.beam.runners.core.SimpleDoFnRunner.outputWindowedValue(SimpleDoFnRunner.java:219)
at org.apache.beam.runners.core.SimpleDoFnRunner.access$700(SimpleDoFnRunner.java:69)
at org.apache.beam.runners.core.SimpleDoFnRunner$DoFnProcessContext.output(SimpleDoFnRunner.java:517)
at org.apache.beam.runners.core.SimpleDoFnRunner$DoFnProcessContext.output(SimpleDoFnRunner.java:505)
at org.apache.beam.sdk.testing.PAssert$ConcatFn.processElement(PAssert.java:1049)
at org.apache.beam.sdk.testing.PAssert$ConcatFn$DoFnInvoker.invokeProcessElement(Unknown Source)
at org.apache.beam.runners.core.SimpleDoFnRunner.invokeProcessElement(SimpleDoFnRunner.java:185)
at org.apache.beam.runners.core.SimpleDoFnRunner.processElement(SimpleDoFnRunner.java:149)
at com.google.cloud.dataflow.worker.SimpleParDoFn.processElement(SimpleParDoFn.java:323)
at com.google.cloud.dataflow.worker.util.common.worker.ParDoOperation.process(ParDoOperation.java:43)
at com.google.cloud.dataflow.worker.util.common.worker.OutputReceiver.process(OutputReceiver.java:48)
at com.google.cloud.dataflow.worker.SimpleParDoFn$1.output(SimpleParDoFn.java:271)
at org.apache.beam.runners.core.SimpleDoFnRunner.outputWindowedValue(SimpleDoFnRunner.java:219)
at org.apache.beam.runners.core.SimpleDoFnRunner.access$700(SimpleDoFnRunner.java:69)
at org.apache.beam.runners.core.SimpleDoFnRunner$DoFnProcessContext.output(SimpleDoFnRunner.java:517)
at org.apache.beam.sdk.transforms.DoFnOutputReceivers$WindowedContextOutputReceiver.output(DoFnOutputReceivers.java:42)
at org.apache.beam.sdk.transforms.MapElements$1.processElement(MapElements.java:131)
at org.apache.beam.sdk.transforms.MapElements$1$DoFnInvoker.invokeProcessElement(Unknown Source)
at org.apache.beam.runners.core.SimpleDoFnRunner.invokeProcessElement(SimpleDoFnRunner.java:185)
at org.apache.beam.runners.core.SimpleDoFnRunner.processElement(SimpleDoFnRunner.java:149)
at com.google.cloud.dataflow.worker.SimpleParDoFn.processElement(SimpleParDoFn.java:323)
at com.google.cloud.dataflow.worker.util.common.worker.ParDoOperation.process(ParDoOperation.java:43)
at com.google.cloud.dataflow.worker.util.common.worker.OutputReceiver.process(OutputReceiver.java:48)
at com.google.cloud.dataflow.worker.GroupAlsoByWindowsParDoFn$1.output(GroupAlsoByWindowsParDoFn.java:181)
at com.google.cloud.dataflow.worker.GroupAlsoByWindowFnRunner$1.outputWindowedValue(GroupAlsoByWindowFnRunner.java:102)
at com.google.cloud.dataflow.worker.util.BatchGroupAlsoByWindowViaIteratorsFn.processElement(BatchGroupAlsoByWindowViaIteratorsFn.java:124)
at com.google.cloud.dataflow.worker.util.BatchGroupAlsoByWindowViaIteratorsFn.processElement(BatchGroupAlsoByWindowViaIteratorsFn.java:53)
at com.google.cloud.dataflow.worker.GroupAlsoByWindowFnRunner.invokeProcessElement(GroupAlsoByWindowFnRunner.java:115)
at com.google.cloud.dataflow.worker.GroupAlsoByWindowFnRunner.processElement(GroupAlsoByWindowFnRunner.java:73)
at com.google.cloud.dataflow.worker.GroupAlsoByWindowsParDoFn.processElement(GroupAlsoByWindowsParDoFn.java:113)
at com.google.cloud.dataflow.worker.util.common.worker.ParDoOperation.process(ParDoOperation.java:43)
at com.google.cloud.dataflow.worker.util.common.worker.OutputReceiver.process(OutputReceiver.java:48)
at com.google.cloud.dataflow.worker.util.common.worker.ReadOperation.runReadLoop(ReadOperation.java:200)
at com.google.cloud.dataflow.worker.util.common.worker.ReadOperation.start(ReadOperation.java:158)
at com.google.cloud.dataflow.worker.util.common.worker.MapTaskExecutor.execute(MapTaskExecutor.java:75)
at com.google.cloud.dataflow.worker.BatchDataflowWorker.executeWork(BatchDataflowWorker.java:391)
at com.google.cloud.dataflow.worker.BatchDataflowWorker.doWork(BatchDataflowWorker.java:360)
at com.google.cloud.dataflow.worker.BatchDataflowWorker.getAndPerformWork(BatchDataflowWorker.java:288)
at com.google.cloud.dataflow.worker.DataflowBatchWorkerHarness$WorkerThread.doWork(DataflowBatchWorkerHarness.java:134)
at com.google.cloud.dataflow.worker.DataflowBatchWorkerHarness$WorkerThread.call(DataflowBatchWorkerHarness.java:114)
at com.google.cloud.dataflow.worker.DataflowBatchWorkerHarness$WorkerThread.call(DataflowBatchWorkerHarness.java:101)
at java.util.concurrent.FutureTask.run(FutureTask.java:266)
at java.util.concurrent.ThreadPoolExecutor.runWorker(ThreadPoolExecutor.java:1142)
at java.util.concurrent.ThreadPoolExecutor$Worker.run(ThreadPoolExecutor.java:617)
at java.lang.Thread.run(Thread.java:745)
Workflow failed. Causes: S16:PAssert$33/GroupGlobally/GroupDummyAndContents/Read+PAssert$33/GroupGlobally/GroupDummyAndContents/GroupByWindow+PAssert$33/GroupGlobally/Values/Values/Map+PAssert$33/GroupGlobally/ParDo(Concat)+PAssert$33/GetPane/Map+PAssert$33/RunChecks+PAssert$33/VerifyAssertions/ParDo(DefaultConclude) failed., A work item was attempted 4 times without success. Each time the worker eventually lost contact with the service. The work item was attempted on:
viewtest0testsingletonsid-06170240-jbvf-harness-8dp1,
viewtest0testsingletonsid-06170240-jbvf-harness-8dp1,
viewtest0testsingletonsid-06170240-jbvf-harness-8dp1,
viewtest0testsingletonsid-06170240-jbvf-harness-8dp1
at org.apache.beam.runners.dataflow.TestDataflowRunner.run(TestDataflowRunner.java:134)
at org.apache.beam.runners.dataflow.TestDataflowRunner.run(TestDataflowRunner.java:90)
at org.apache.beam.runners.dataflow.TestDataflowRunner.run(TestDataflowRunner.java:55)
at org.apache.beam.sdk.Pipeline.run(Pipeline.java:311)
at org.apache.beam.sdk.testing.TestPipeline.run(TestPipeline.java:348)
at org.apache.beam.sdk.testing.TestPipeline.run(TestPipeline.java:329)
at org.apache.beam.sdk.transforms.ViewTest.testSingletonSideInput(ViewTest.java:109)
Gradle Test Executor 35 finished executing tests.
> Task :beam-runners-google-cloud-dataflow-java:validatesRunnerTest
209 tests completed, 190 failed, 2 skipped
Finished generating test XML results (0.875 secs) into: <https://builds.apache.org/job/beam_PostCommit_Java_ValidatesRunner_Dataflow_Gradle/ws/src/runners/google-cloud-dataflow-java/build/test-results/validatesRunnerTest>
Generating HTML test report...
Finished generating test html results (0.528 secs) into: <https://builds.apache.org/job/beam_PostCommit_Java_ValidatesRunner_Dataflow_Gradle/ws/src/runners/google-cloud-dataflow-java/build/reports/tests/validatesRunnerTest>
> Task :beam-runners-google-cloud-dataflow-java:validatesRunnerTest FAILED
:beam-runners-google-cloud-dataflow-java:validatesRunnerTest (Thread[Task worker for ':' Thread 40,5,main]) completed. Took 2 hrs 19 mins 20.056 secs.
FAILURE: Build failed with an exception.
* What went wrong:
Execution failed for task ':beam-runners-google-cloud-dataflow-java:validatesRunnerTest'.
> There were failing tests. See the report at: file://<https://builds.apache.org/job/beam_PostCommit_Java_ValidatesRunner_Dataflow_Gradle/ws/src/runners/google-cloud-dataflow-java/build/reports/tests/validatesRunnerTest/index.html>
* Try:
Run with --stacktrace option to get the stack trace. Run with --debug option to get more log output. Run with --scan to get full insights.
* Get more help at https://help.gradle.org
Deprecated Gradle features were used in this build, making it incompatible with Gradle 5.0.
See https://docs.gradle.org/4.8/userguide/command_line_interface.html#sec:command_line_warnings
BUILD FAILED in 2h 20m 27s
38 actionable tasks: 34 executed, 4 from cache
Publishing build scan...
https://gradle.com/s/lld7cl4pt4zr6
Build step 'Invoke Gradle script' changed build result to FAILURE
Build step 'Invoke Gradle script' marked build as failure
Recording test results
Not sending mail to unregistered user apilloud@google.com
Not sending mail to unregistered user robbe.sneyders@ml6.eu
Not sending mail to unregistered user github@alasdairhodge.co.uk
Not sending mail to unregistered user ringwalt@google.com
Not sending mail to unregistered user aaltay@gmail.com
Not sending mail to unregistered user swegner@google.com
Not sending mail to unregistered user robinyq@rodete-desktop-imager.corp.google.com
Not sending mail to unregistered user ehudm@google.com
Not sending mail to unregistered user kedin@google.com
Not sending mail to unregistered user jiangkai@gmail.com
Not sending mail to unregistered user kirpichov@google.com
Not sending mail to unregistered user fvoichick@gmail.com
Build failed in Jenkins:
beam_PostCommit_Java_ValidatesRunner_Dataflow_Gradle #518
Posted by Apache Jenkins Server <je...@builds.apache.org>.
See <https://builds.apache.org/job/beam_PostCommit_Java_ValidatesRunner_Dataflow_Gradle/518/display/redirect>
------------------------------------------
[...truncated 55.15 MB...]
at com.google.cloud.dataflow.worker.DataflowBatchWorkerHarness$WorkerThread.call(DataflowBatchWorkerHarness.java:114)
at com.google.cloud.dataflow.worker.DataflowBatchWorkerHarness$WorkerThread.call(DataflowBatchWorkerHarness.java:101)
at java.util.concurrent.FutureTask.run(FutureTask.java:266)
at java.util.concurrent.ThreadPoolExecutor.runWorker(ThreadPoolExecutor.java:1142)
at java.util.concurrent.ThreadPoolExecutor$Worker.run(ThreadPoolExecutor.java:617)
at java.lang.Thread.run(Thread.java:745)
Caused by: org.apache.beam.sdk.util.UserCodeException: java.lang.AssertionError: OutputSideInputs/ParMultiDo(Anonymous).output: org/hamcrest/Matchers
at org.apache.beam.sdk.util.UserCodeException.wrap(UserCodeException.java:36)
at org.apache.beam.sdk.testing.PAssert$DefaultConcludeFn$DoFnInvoker.invokeProcessElement(Unknown Source)
at org.apache.beam.runners.core.SimpleDoFnRunner.invokeProcessElement(SimpleDoFnRunner.java:185)
at org.apache.beam.runners.core.SimpleDoFnRunner.processElement(SimpleDoFnRunner.java:149)
at com.google.cloud.dataflow.worker.SimpleParDoFn.processElement(SimpleParDoFn.java:323)
at com.google.cloud.dataflow.worker.util.common.worker.ParDoOperation.process(ParDoOperation.java:43)
at com.google.cloud.dataflow.worker.util.common.worker.OutputReceiver.process(OutputReceiver.java:48)
at com.google.cloud.dataflow.worker.SimpleParDoFn$1.output(SimpleParDoFn.java:271)
at org.apache.beam.runners.core.SimpleDoFnRunner.outputWindowedValue(SimpleDoFnRunner.java:219)
at org.apache.beam.runners.core.SimpleDoFnRunner.access$700(SimpleDoFnRunner.java:69)
at org.apache.beam.runners.core.SimpleDoFnRunner$DoFnProcessContext.output(SimpleDoFnRunner.java:517)
at org.apache.beam.runners.core.SimpleDoFnRunner$DoFnProcessContext.output(SimpleDoFnRunner.java:505)
at org.apache.beam.sdk.testing.PAssert$GroupedValuesCheckerDoFn.processElement(PAssert.java:1215)
at org.apache.beam.sdk.testing.PAssert$GroupedValuesCheckerDoFn$DoFnInvoker.invokeProcessElement(Unknown Source)
at org.apache.beam.runners.core.SimpleDoFnRunner.invokeProcessElement(SimpleDoFnRunner.java:185)
at org.apache.beam.runners.core.SimpleDoFnRunner.processElement(SimpleDoFnRunner.java:149)
at com.google.cloud.dataflow.worker.SimpleParDoFn.processElement(SimpleParDoFn.java:323)
at com.google.cloud.dataflow.worker.util.common.worker.ParDoOperation.process(ParDoOperation.java:43)
at com.google.cloud.dataflow.worker.util.common.worker.OutputReceiver.process(OutputReceiver.java:48)
at com.google.cloud.dataflow.worker.SimpleParDoFn$1.output(SimpleParDoFn.java:271)
at org.apache.beam.runners.core.SimpleDoFnRunner.outputWindowedValue(SimpleDoFnRunner.java:219)
at org.apache.beam.runners.core.SimpleDoFnRunner.access$700(SimpleDoFnRunner.java:69)
at org.apache.beam.runners.core.SimpleDoFnRunner$DoFnProcessContext.output(SimpleDoFnRunner.java:517)
at org.apache.beam.sdk.transforms.DoFnOutputReceivers$WindowedContextOutputReceiver.output(DoFnOutputReceivers.java:42)
at org.apache.beam.sdk.transforms.MapElements$1.processElement(MapElements.java:131)
at org.apache.beam.sdk.transforms.MapElements$1$DoFnInvoker.invokeProcessElement(Unknown Source)
at org.apache.beam.runners.core.SimpleDoFnRunner.invokeProcessElement(SimpleDoFnRunner.java:185)
at org.apache.beam.runners.core.SimpleDoFnRunner.processElement(SimpleDoFnRunner.java:149)
at com.google.cloud.dataflow.worker.SimpleParDoFn.processElement(SimpleParDoFn.java:323)
at com.google.cloud.dataflow.worker.util.common.worker.ParDoOperation.process(ParDoOperation.java:43)
at com.google.cloud.dataflow.worker.util.common.worker.OutputReceiver.process(OutputReceiver.java:48)
at com.google.cloud.dataflow.worker.SimpleParDoFn$1.output(SimpleParDoFn.java:271)
at org.apache.beam.runners.core.SimpleDoFnRunner.outputWindowedValue(SimpleDoFnRunner.java:219)
at org.apache.beam.runners.core.SimpleDoFnRunner.access$700(SimpleDoFnRunner.java:69)
at org.apache.beam.runners.core.SimpleDoFnRunner$DoFnProcessContext.output(SimpleDoFnRunner.java:517)
at org.apache.beam.runners.core.SimpleDoFnRunner$DoFnProcessContext.output(SimpleDoFnRunner.java:505)
at org.apache.beam.sdk.testing.PAssert$ConcatFn.processElement(PAssert.java:1049)
at org.apache.beam.sdk.testing.PAssert$ConcatFn$DoFnInvoker.invokeProcessElement(Unknown Source)
at org.apache.beam.runners.core.SimpleDoFnRunner.invokeProcessElement(SimpleDoFnRunner.java:185)
at org.apache.beam.runners.core.SimpleDoFnRunner.processElement(SimpleDoFnRunner.java:149)
at com.google.cloud.dataflow.worker.SimpleParDoFn.processElement(SimpleParDoFn.java:323)
at com.google.cloud.dataflow.worker.util.common.worker.ParDoOperation.process(ParDoOperation.java:43)
at com.google.cloud.dataflow.worker.util.common.worker.OutputReceiver.process(OutputReceiver.java:48)
at com.google.cloud.dataflow.worker.SimpleParDoFn$1.output(SimpleParDoFn.java:271)
at org.apache.beam.runners.core.SimpleDoFnRunner.outputWindowedValue(SimpleDoFnRunner.java:219)
at org.apache.beam.runners.core.SimpleDoFnRunner.access$700(SimpleDoFnRunner.java:69)
at org.apache.beam.runners.core.SimpleDoFnRunner$DoFnProcessContext.output(SimpleDoFnRunner.java:517)
at org.apache.beam.sdk.transforms.DoFnOutputReceivers$WindowedContextOutputReceiver.output(DoFnOutputReceivers.java:42)
at org.apache.beam.sdk.transforms.MapElements$1.processElement(MapElements.java:131)
at org.apache.beam.sdk.transforms.MapElements$1$DoFnInvoker.invokeProcessElement(Unknown Source)
at org.apache.beam.runners.core.SimpleDoFnRunner.invokeProcessElement(SimpleDoFnRunner.java:185)
at org.apache.beam.runners.core.SimpleDoFnRunner.processElement(SimpleDoFnRunner.java:149)
at com.google.cloud.dataflow.worker.SimpleParDoFn.processElement(SimpleParDoFn.java:323)
at com.google.cloud.dataflow.worker.util.common.worker.ParDoOperation.process(ParDoOperation.java:43)
at com.google.cloud.dataflow.worker.util.common.worker.OutputReceiver.process(OutputReceiver.java:48)
at com.google.cloud.dataflow.worker.GroupAlsoByWindowsParDoFn$1.output(GroupAlsoByWindowsParDoFn.java:181)
... 21 more
Caused by: java.lang.AssertionError: OutputSideInputs/ParMultiDo(Anonymous).output: org/hamcrest/Matchers
at org.apache.beam.sdk.testing.PAssert$PAssertionSite.capture(PAssert.java:168)
at org.apache.beam.sdk.testing.PAssert.that(PAssert.java:378)
at org.apache.beam.sdk.testing.PAssert.that(PAssert.java:370)
at org.apache.beam.sdk.transforms.ViewTest.testSingletonSideInput(ViewTest.java:107)
at sun.reflect.NativeMethodAccessorImpl.invoke0(Native Method)
at sun.reflect.NativeMethodAccessorImpl.invoke(NativeMethodAccessorImpl.java:62)
at sun.reflect.DelegatingMethodAccessorImpl.invoke(DelegatingMethodAccessorImpl.java:43)
at java.lang.reflect.Method.invoke(Method.java:498)
at org.junit.runners.model.FrameworkMethod$1.runReflectiveCall(FrameworkMethod.java:50)
at org.junit.internal.runners.model.ReflectiveCallable.run(ReflectiveCallable.java:12)
at org.junit.runners.model.FrameworkMethod.invokeExplosively(FrameworkMethod.java:47)
at org.junit.internal.runners.statements.InvokeMethod.evaluate(InvokeMethod.java:17)
at org.apache.beam.sdk.testing.TestPipeline$1.evaluate(TestPipeline.java:317)
at org.junit.rules.ExpectedException$ExpectedExceptionStatement.evaluate(ExpectedException.java:239)
at org.junit.rules.RunRules.evaluate(RunRules.java:20)
at org.junit.runners.ParentRunner.runLeaf(ParentRunner.java:325)
at org.junit.runners.BlockJUnit4ClassRunner.runChild(BlockJUnit4ClassRunner.java:78)
at org.junit.runners.BlockJUnit4ClassRunner.runChild(BlockJUnit4ClassRunner.java:57)
at org.junit.runners.ParentRunner$3.run(ParentRunner.java:290)
at org.junit.runners.ParentRunner$1.schedule(ParentRunner.java:71)
at org.junit.runners.ParentRunner.runChildren(ParentRunner.java:288)
at org.junit.runners.ParentRunner.access$000(ParentRunner.java:58)
at org.junit.runners.ParentRunner$2.evaluate(ParentRunner.java:268)
at org.junit.runners.ParentRunner.run(ParentRunner.java:363)
at org.gradle.api.internal.tasks.testing.junit.JUnitTestClassExecutor.runTestClass(JUnitTestClassExecutor.java:106)
at org.gradle.api.internal.tasks.testing.junit.JUnitTestClassExecutor.execute(JUnitTestClassExecutor.java:58)
at org.gradle.api.internal.tasks.testing.junit.JUnitTestClassExecutor.execute(JUnitTestClassExecutor.java:38)
at org.gradle.api.internal.tasks.testing.junit.AbstractJUnitTestClassProcessor.processTestClass(AbstractJUnitTestClassProcessor.java:66)
at org.gradle.api.internal.tasks.testing.SuiteTestClassProcessor.processTestClass(SuiteTestClassProcessor.java:51)
at sun.reflect.NativeMethodAccessorImpl.invoke0(Native Method)
at sun.reflect.NativeMethodAccessorImpl.invoke(NativeMethodAccessorImpl.java:62)
at sun.reflect.DelegatingMethodAccessorImpl.invoke(DelegatingMethodAccessorImpl.java:43)
at java.lang.reflect.Method.invoke(Method.java:498)
at org.gradle.internal.dispatch.ReflectionDispatch.dispatch(ReflectionDispatch.java:35)
at org.gradle.internal.dispatch.ReflectionDispatch.dispatch(ReflectionDispatch.java:24)
at org.gradle.internal.dispatch.ContextClassLoaderDispatch.dispatch(ContextClassLoaderDispatch.java:32)
at org.gradle.internal.dispatch.ProxyDispatchAdapter$DispatchingInvocationHandler.invoke(ProxyDispatchAdapter.java:93)
at com.sun.proxy.$Proxy2.processTestClass(Unknown Source)
at org.gradle.api.internal.tasks.testing.worker.TestWorker.processTestClass(TestWorker.java:109)
at sun.reflect.NativeMethodAccessorImpl.invoke0(Native Method)
at sun.reflect.NativeMethodAccessorImpl.invoke(NativeMethodAccessorImpl.java:62)
at sun.reflect.DelegatingMethodAccessorImpl.invoke(DelegatingMethodAccessorImpl.java:43)
at java.lang.reflect.Method.invoke(Method.java:498)
at org.gradle.internal.dispatch.ReflectionDispatch.dispatch(ReflectionDispatch.java:35)
at org.gradle.internal.dispatch.ReflectionDispatch.dispatch(ReflectionDispatch.java:24)
at org.gradle.internal.remote.internal.hub.MessageHubBackedObjectConnection$DispatchWrapper.dispatch(MessageHubBackedObjectConnection.java:155)
at org.gradle.internal.remote.internal.hub.MessageHubBackedObjectConnection$DispatchWrapper.dispatch(MessageHubBackedObjectConnection.java:137)
at org.gradle.internal.remote.internal.hub.MessageHub$Handler.run(MessageHub.java:404)
at org.gradle.internal.concurrent.ExecutorPolicy$CatchAndRecordFailures.onExecute(ExecutorPolicy.java:63)
at org.gradle.internal.concurrent.ManagedExecutorImpl$1.run(ManagedExecutorImpl.java:46)
at java.util.concurrent.ThreadPoolExecutor.runWorker(ThreadPoolExecutor.java:1149)
at java.util.concurrent.ThreadPoolExecutor$Worker.run(ThreadPoolExecutor.java:624)
at org.gradle.internal.concurrent.ThreadFactoryImpl$ManagedThreadRunnable.run(ThreadFactoryImpl.java:55)
Caused by: java.lang.NoClassDefFoundError: org/hamcrest/Matchers
at org.apache.beam.sdk.testing.PAssert$AssertContainsInAnyOrder.apply(PAssert.java:1322)
at org.apache.beam.sdk.testing.PAssert$AssertContainsInAnyOrder.apply(PAssert.java:1301)
at org.apache.beam.sdk.testing.PAssert$CheckRelationAgainstExpected.apply(PAssert.java:966)
at org.apache.beam.sdk.testing.PAssert$CheckRelationAgainstExpected.apply(PAssert.java:946)
at org.apache.beam.sdk.testing.PAssert.doChecks(PAssert.java:1250)
at org.apache.beam.sdk.testing.PAssert$GroupedValuesCheckerDoFn.processElement(PAssert.java:1215)
at org.apache.beam.sdk.testing.PAssert$GroupedValuesCheckerDoFn$DoFnInvoker.invokeProcessElement(Unknown Source)
at org.apache.beam.runners.core.SimpleDoFnRunner.invokeProcessElement(SimpleDoFnRunner.java:185)
at org.apache.beam.runners.core.SimpleDoFnRunner.processElement(SimpleDoFnRunner.java:149)
at com.google.cloud.dataflow.worker.SimpleParDoFn.processElement(SimpleParDoFn.java:323)
at com.google.cloud.dataflow.worker.util.common.worker.ParDoOperation.process(ParDoOperation.java:43)
at com.google.cloud.dataflow.worker.util.common.worker.OutputReceiver.process(OutputReceiver.java:48)
at com.google.cloud.dataflow.worker.SimpleParDoFn$1.output(SimpleParDoFn.java:271)
at org.apache.beam.runners.core.SimpleDoFnRunner.outputWindowedValue(SimpleDoFnRunner.java:219)
at org.apache.beam.runners.core.SimpleDoFnRunner.access$700(SimpleDoFnRunner.java:69)
at org.apache.beam.runners.core.SimpleDoFnRunner$DoFnProcessContext.output(SimpleDoFnRunner.java:517)
at org.apache.beam.sdk.transforms.DoFnOutputReceivers$WindowedContextOutputReceiver.output(DoFnOutputReceivers.java:42)
at org.apache.beam.sdk.transforms.MapElements$1.processElement(MapElements.java:131)
at org.apache.beam.sdk.transforms.MapElements$1$DoFnInvoker.invokeProcessElement(Unknown Source)
at org.apache.beam.runners.core.SimpleDoFnRunner.invokeProcessElement(SimpleDoFnRunner.java:185)
at org.apache.beam.runners.core.SimpleDoFnRunner.processElement(SimpleDoFnRunner.java:149)
at com.google.cloud.dataflow.worker.SimpleParDoFn.processElement(SimpleParDoFn.java:323)
at com.google.cloud.dataflow.worker.util.common.worker.ParDoOperation.process(ParDoOperation.java:43)
at com.google.cloud.dataflow.worker.util.common.worker.OutputReceiver.process(OutputReceiver.java:48)
at com.google.cloud.dataflow.worker.SimpleParDoFn$1.output(SimpleParDoFn.java:271)
at org.apache.beam.runners.core.SimpleDoFnRunner.outputWindowedValue(SimpleDoFnRunner.java:219)
at org.apache.beam.runners.core.SimpleDoFnRunner.access$700(SimpleDoFnRunner.java:69)
at org.apache.beam.runners.core.SimpleDoFnRunner$DoFnProcessContext.output(SimpleDoFnRunner.java:517)
at org.apache.beam.runners.core.SimpleDoFnRunner$DoFnProcessContext.output(SimpleDoFnRunner.java:505)
at org.apache.beam.sdk.testing.PAssert$ConcatFn.processElement(PAssert.java:1049)
at org.apache.beam.sdk.testing.PAssert$ConcatFn$DoFnInvoker.invokeProcessElement(Unknown Source)
at org.apache.beam.runners.core.SimpleDoFnRunner.invokeProcessElement(SimpleDoFnRunner.java:185)
at org.apache.beam.runners.core.SimpleDoFnRunner.processElement(SimpleDoFnRunner.java:149)
at com.google.cloud.dataflow.worker.SimpleParDoFn.processElement(SimpleParDoFn.java:323)
at com.google.cloud.dataflow.worker.util.common.worker.ParDoOperation.process(ParDoOperation.java:43)
at com.google.cloud.dataflow.worker.util.common.worker.OutputReceiver.process(OutputReceiver.java:48)
at com.google.cloud.dataflow.worker.SimpleParDoFn$1.output(SimpleParDoFn.java:271)
at org.apache.beam.runners.core.SimpleDoFnRunner.outputWindowedValue(SimpleDoFnRunner.java:219)
at org.apache.beam.runners.core.SimpleDoFnRunner.access$700(SimpleDoFnRunner.java:69)
at org.apache.beam.runners.core.SimpleDoFnRunner$DoFnProcessContext.output(SimpleDoFnRunner.java:517)
at org.apache.beam.sdk.transforms.DoFnOutputReceivers$WindowedContextOutputReceiver.output(DoFnOutputReceivers.java:42)
at org.apache.beam.sdk.transforms.MapElements$1.processElement(MapElements.java:131)
at org.apache.beam.sdk.transforms.MapElements$1$DoFnInvoker.invokeProcessElement(Unknown Source)
at org.apache.beam.runners.core.SimpleDoFnRunner.invokeProcessElement(SimpleDoFnRunner.java:185)
at org.apache.beam.runners.core.SimpleDoFnRunner.processElement(SimpleDoFnRunner.java:149)
at com.google.cloud.dataflow.worker.SimpleParDoFn.processElement(SimpleParDoFn.java:323)
at com.google.cloud.dataflow.worker.util.common.worker.ParDoOperation.process(ParDoOperation.java:43)
at com.google.cloud.dataflow.worker.util.common.worker.OutputReceiver.process(OutputReceiver.java:48)
at com.google.cloud.dataflow.worker.GroupAlsoByWindowsParDoFn$1.output(GroupAlsoByWindowsParDoFn.java:181)
at com.google.cloud.dataflow.worker.GroupAlsoByWindowFnRunner$1.outputWindowedValue(GroupAlsoByWindowFnRunner.java:102)
at com.google.cloud.dataflow.worker.util.BatchGroupAlsoByWindowViaIteratorsFn.processElement(BatchGroupAlsoByWindowViaIteratorsFn.java:124)
at com.google.cloud.dataflow.worker.util.BatchGroupAlsoByWindowViaIteratorsFn.processElement(BatchGroupAlsoByWindowViaIteratorsFn.java:53)
at com.google.cloud.dataflow.worker.GroupAlsoByWindowFnRunner.invokeProcessElement(GroupAlsoByWindowFnRunner.java:115)
at com.google.cloud.dataflow.worker.GroupAlsoByWindowFnRunner.processElement(GroupAlsoByWindowFnRunner.java:73)
at com.google.cloud.dataflow.worker.GroupAlsoByWindowsParDoFn.processElement(GroupAlsoByWindowsParDoFn.java:113)
at com.google.cloud.dataflow.worker.util.common.worker.ParDoOperation.process(ParDoOperation.java:43)
at com.google.cloud.dataflow.worker.util.common.worker.OutputReceiver.process(OutputReceiver.java:48)
at com.google.cloud.dataflow.worker.util.common.worker.ReadOperation.runReadLoop(ReadOperation.java:200)
at com.google.cloud.dataflow.worker.util.common.worker.ReadOperation.start(ReadOperation.java:158)
at com.google.cloud.dataflow.worker.util.common.worker.MapTaskExecutor.execute(MapTaskExecutor.java:75)
at com.google.cloud.dataflow.worker.BatchDataflowWorker.executeWork(BatchDataflowWorker.java:391)
at com.google.cloud.dataflow.worker.BatchDataflowWorker.doWork(BatchDataflowWorker.java:360)
at com.google.cloud.dataflow.worker.BatchDataflowWorker.getAndPerformWork(BatchDataflowWorker.java:288)
at com.google.cloud.dataflow.worker.DataflowBatchWorkerHarness$WorkerThread.doWork(DataflowBatchWorkerHarness.java:134)
at com.google.cloud.dataflow.worker.DataflowBatchWorkerHarness$WorkerThread.call(DataflowBatchWorkerHarness.java:114)
at com.google.cloud.dataflow.worker.DataflowBatchWorkerHarness$WorkerThread.call(DataflowBatchWorkerHarness.java:101)
at java.util.concurrent.FutureTask.run(FutureTask.java:266)
at java.util.concurrent.ThreadPoolExecutor.runWorker(ThreadPoolExecutor.java:1142)
at java.util.concurrent.ThreadPoolExecutor$Worker.run(ThreadPoolExecutor.java:617)
at java.lang.Thread.run(Thread.java:745)
Workflow failed. Causes: S16:PAssert$33/GroupGlobally/GroupDummyAndContents/Read+PAssert$33/GroupGlobally/GroupDummyAndContents/GroupByWindow+PAssert$33/GroupGlobally/Values/Values/Map+PAssert$33/GroupGlobally/ParDo(Concat)+PAssert$33/GetPane/Map+PAssert$33/RunChecks+PAssert$33/VerifyAssertions/ParDo(DefaultConclude) failed., A work item was attempted 4 times without success. Each time the worker eventually lost contact with the service. The work item was attempted on:
viewtest0testsingletonsid-06162029-3ic0-harness-lgh5,
viewtest0testsingletonsid-06162029-3ic0-harness-lgh5,
viewtest0testsingletonsid-06162029-3ic0-harness-lgh5,
viewtest0testsingletonsid-06162029-3ic0-harness-lgh5
at org.apache.beam.runners.dataflow.TestDataflowRunner.run(TestDataflowRunner.java:134)
at org.apache.beam.runners.dataflow.TestDataflowRunner.run(TestDataflowRunner.java:90)
at org.apache.beam.runners.dataflow.TestDataflowRunner.run(TestDataflowRunner.java:55)
at org.apache.beam.sdk.Pipeline.run(Pipeline.java:311)
at org.apache.beam.sdk.testing.TestPipeline.run(TestPipeline.java:348)
at org.apache.beam.sdk.testing.TestPipeline.run(TestPipeline.java:329)
at org.apache.beam.sdk.transforms.ViewTest.testSingletonSideInput(ViewTest.java:109)
Gradle Test Executor 36 finished executing tests.
> Task :beam-runners-google-cloud-dataflow-java:validatesRunnerTest
209 tests completed, 190 failed, 2 skipped
Finished generating test XML results (1.074 secs) into: <https://builds.apache.org/job/beam_PostCommit_Java_ValidatesRunner_Dataflow_Gradle/ws/src/runners/google-cloud-dataflow-java/build/test-results/validatesRunnerTest>
Generating HTML test report...
Finished generating test html results (0.689 secs) into: <https://builds.apache.org/job/beam_PostCommit_Java_ValidatesRunner_Dataflow_Gradle/ws/src/runners/google-cloud-dataflow-java/build/reports/tests/validatesRunnerTest>
> Task :beam-runners-google-cloud-dataflow-java:validatesRunnerTest FAILED
:beam-runners-google-cloud-dataflow-java:validatesRunnerTest (Thread[Task worker for ':',5,main]) completed. Took 2 hrs 24 mins 40.949 secs.
FAILURE: Build failed with an exception.
* What went wrong:
Execution failed for task ':beam-runners-google-cloud-dataflow-java:validatesRunnerTest'.
> There were failing tests. See the report at: file://<https://builds.apache.org/job/beam_PostCommit_Java_ValidatesRunner_Dataflow_Gradle/ws/src/runners/google-cloud-dataflow-java/build/reports/tests/validatesRunnerTest/index.html>
* Try:
Run with --stacktrace option to get the stack trace. Run with --debug option to get more log output. Run with --scan to get full insights.
* Get more help at https://help.gradle.org
Deprecated Gradle features were used in this build, making it incompatible with Gradle 5.0.
See https://docs.gradle.org/4.8/userguide/command_line_interface.html#sec:command_line_warnings
BUILD FAILED in 2h 26m 7s
38 actionable tasks: 34 executed, 4 from cache
Publishing build scan...
https://gradle.com/s/xjysjn6pps53c
Build step 'Invoke Gradle script' changed build result to FAILURE
Build step 'Invoke Gradle script' marked build as failure
Recording test results
Not sending mail to unregistered user apilloud@google.com
Not sending mail to unregistered user robbe.sneyders@ml6.eu
Not sending mail to unregistered user github@alasdairhodge.co.uk
Not sending mail to unregistered user ringwalt@google.com
Not sending mail to unregistered user aaltay@gmail.com
Not sending mail to unregistered user swegner@google.com
Not sending mail to unregistered user robinyq@rodete-desktop-imager.corp.google.com
Not sending mail to unregistered user ehudm@google.com
Not sending mail to unregistered user kedin@google.com
Not sending mail to unregistered user jiangkai@gmail.com
Not sending mail to unregistered user kirpichov@google.com
Not sending mail to unregistered user fvoichick@gmail.com
Build failed in Jenkins:
beam_PostCommit_Java_ValidatesRunner_Dataflow_Gradle #517
Posted by Apache Jenkins Server <je...@builds.apache.org>.
See <https://builds.apache.org/job/beam_PostCommit_Java_ValidatesRunner_Dataflow_Gradle/517/display/redirect?page=changes>
Changes:
[iemejia] Fix Maven build 7
------------------------------------------
[...truncated 55.07 MB...]
at com.google.cloud.dataflow.worker.DataflowBatchWorkerHarness$WorkerThread.call(DataflowBatchWorkerHarness.java:114)
at com.google.cloud.dataflow.worker.DataflowBatchWorkerHarness$WorkerThread.call(DataflowBatchWorkerHarness.java:101)
at java.util.concurrent.FutureTask.run(FutureTask.java:266)
at java.util.concurrent.ThreadPoolExecutor.runWorker(ThreadPoolExecutor.java:1142)
at java.util.concurrent.ThreadPoolExecutor$Worker.run(ThreadPoolExecutor.java:617)
at java.lang.Thread.run(Thread.java:745)
Caused by: org.apache.beam.sdk.util.UserCodeException: java.lang.AssertionError: OutputSideInputs/ParMultiDo(Anonymous).output: org/hamcrest/Matchers
at org.apache.beam.sdk.util.UserCodeException.wrap(UserCodeException.java:36)
at org.apache.beam.sdk.testing.PAssert$DefaultConcludeFn$DoFnInvoker.invokeProcessElement(Unknown Source)
at org.apache.beam.runners.core.SimpleDoFnRunner.invokeProcessElement(SimpleDoFnRunner.java:185)
at org.apache.beam.runners.core.SimpleDoFnRunner.processElement(SimpleDoFnRunner.java:149)
at com.google.cloud.dataflow.worker.SimpleParDoFn.processElement(SimpleParDoFn.java:323)
at com.google.cloud.dataflow.worker.util.common.worker.ParDoOperation.process(ParDoOperation.java:43)
at com.google.cloud.dataflow.worker.util.common.worker.OutputReceiver.process(OutputReceiver.java:48)
at com.google.cloud.dataflow.worker.SimpleParDoFn$1.output(SimpleParDoFn.java:271)
at org.apache.beam.runners.core.SimpleDoFnRunner.outputWindowedValue(SimpleDoFnRunner.java:219)
at org.apache.beam.runners.core.SimpleDoFnRunner.access$700(SimpleDoFnRunner.java:69)
at org.apache.beam.runners.core.SimpleDoFnRunner$DoFnProcessContext.output(SimpleDoFnRunner.java:517)
at org.apache.beam.runners.core.SimpleDoFnRunner$DoFnProcessContext.output(SimpleDoFnRunner.java:505)
at org.apache.beam.sdk.testing.PAssert$GroupedValuesCheckerDoFn.processElement(PAssert.java:1215)
at org.apache.beam.sdk.testing.PAssert$GroupedValuesCheckerDoFn$DoFnInvoker.invokeProcessElement(Unknown Source)
at org.apache.beam.runners.core.SimpleDoFnRunner.invokeProcessElement(SimpleDoFnRunner.java:185)
at org.apache.beam.runners.core.SimpleDoFnRunner.processElement(SimpleDoFnRunner.java:149)
at com.google.cloud.dataflow.worker.SimpleParDoFn.processElement(SimpleParDoFn.java:323)
at com.google.cloud.dataflow.worker.util.common.worker.ParDoOperation.process(ParDoOperation.java:43)
at com.google.cloud.dataflow.worker.util.common.worker.OutputReceiver.process(OutputReceiver.java:48)
at com.google.cloud.dataflow.worker.SimpleParDoFn$1.output(SimpleParDoFn.java:271)
at org.apache.beam.runners.core.SimpleDoFnRunner.outputWindowedValue(SimpleDoFnRunner.java:219)
at org.apache.beam.runners.core.SimpleDoFnRunner.access$700(SimpleDoFnRunner.java:69)
at org.apache.beam.runners.core.SimpleDoFnRunner$DoFnProcessContext.output(SimpleDoFnRunner.java:517)
at org.apache.beam.sdk.transforms.DoFnOutputReceivers$WindowedContextOutputReceiver.output(DoFnOutputReceivers.java:42)
at org.apache.beam.sdk.transforms.MapElements$1.processElement(MapElements.java:131)
at org.apache.beam.sdk.transforms.MapElements$1$DoFnInvoker.invokeProcessElement(Unknown Source)
at org.apache.beam.runners.core.SimpleDoFnRunner.invokeProcessElement(SimpleDoFnRunner.java:185)
at org.apache.beam.runners.core.SimpleDoFnRunner.processElement(SimpleDoFnRunner.java:149)
at com.google.cloud.dataflow.worker.SimpleParDoFn.processElement(SimpleParDoFn.java:323)
at com.google.cloud.dataflow.worker.util.common.worker.ParDoOperation.process(ParDoOperation.java:43)
at com.google.cloud.dataflow.worker.util.common.worker.OutputReceiver.process(OutputReceiver.java:48)
at com.google.cloud.dataflow.worker.SimpleParDoFn$1.output(SimpleParDoFn.java:271)
at org.apache.beam.runners.core.SimpleDoFnRunner.outputWindowedValue(SimpleDoFnRunner.java:219)
at org.apache.beam.runners.core.SimpleDoFnRunner.access$700(SimpleDoFnRunner.java:69)
at org.apache.beam.runners.core.SimpleDoFnRunner$DoFnProcessContext.output(SimpleDoFnRunner.java:517)
at org.apache.beam.runners.core.SimpleDoFnRunner$DoFnProcessContext.output(SimpleDoFnRunner.java:505)
at org.apache.beam.sdk.testing.PAssert$ConcatFn.processElement(PAssert.java:1049)
at org.apache.beam.sdk.testing.PAssert$ConcatFn$DoFnInvoker.invokeProcessElement(Unknown Source)
at org.apache.beam.runners.core.SimpleDoFnRunner.invokeProcessElement(SimpleDoFnRunner.java:185)
at org.apache.beam.runners.core.SimpleDoFnRunner.processElement(SimpleDoFnRunner.java:149)
at com.google.cloud.dataflow.worker.SimpleParDoFn.processElement(SimpleParDoFn.java:323)
at com.google.cloud.dataflow.worker.util.common.worker.ParDoOperation.process(ParDoOperation.java:43)
at com.google.cloud.dataflow.worker.util.common.worker.OutputReceiver.process(OutputReceiver.java:48)
at com.google.cloud.dataflow.worker.SimpleParDoFn$1.output(SimpleParDoFn.java:271)
at org.apache.beam.runners.core.SimpleDoFnRunner.outputWindowedValue(SimpleDoFnRunner.java:219)
at org.apache.beam.runners.core.SimpleDoFnRunner.access$700(SimpleDoFnRunner.java:69)
at org.apache.beam.runners.core.SimpleDoFnRunner$DoFnProcessContext.output(SimpleDoFnRunner.java:517)
at org.apache.beam.sdk.transforms.DoFnOutputReceivers$WindowedContextOutputReceiver.output(DoFnOutputReceivers.java:42)
at org.apache.beam.sdk.transforms.MapElements$1.processElement(MapElements.java:131)
at org.apache.beam.sdk.transforms.MapElements$1$DoFnInvoker.invokeProcessElement(Unknown Source)
at org.apache.beam.runners.core.SimpleDoFnRunner.invokeProcessElement(SimpleDoFnRunner.java:185)
at org.apache.beam.runners.core.SimpleDoFnRunner.processElement(SimpleDoFnRunner.java:149)
at com.google.cloud.dataflow.worker.SimpleParDoFn.processElement(SimpleParDoFn.java:323)
at com.google.cloud.dataflow.worker.util.common.worker.ParDoOperation.process(ParDoOperation.java:43)
at com.google.cloud.dataflow.worker.util.common.worker.OutputReceiver.process(OutputReceiver.java:48)
at com.google.cloud.dataflow.worker.GroupAlsoByWindowsParDoFn$1.output(GroupAlsoByWindowsParDoFn.java:181)
... 21 more
Caused by: java.lang.AssertionError: OutputSideInputs/ParMultiDo(Anonymous).output: org/hamcrest/Matchers
at org.apache.beam.sdk.testing.PAssert$PAssertionSite.capture(PAssert.java:168)
at org.apache.beam.sdk.testing.PAssert.that(PAssert.java:378)
at org.apache.beam.sdk.testing.PAssert.that(PAssert.java:370)
at org.apache.beam.sdk.transforms.ViewTest.testSingletonSideInput(ViewTest.java:107)
at sun.reflect.NativeMethodAccessorImpl.invoke0(Native Method)
at sun.reflect.NativeMethodAccessorImpl.invoke(NativeMethodAccessorImpl.java:62)
at sun.reflect.DelegatingMethodAccessorImpl.invoke(DelegatingMethodAccessorImpl.java:43)
at java.lang.reflect.Method.invoke(Method.java:498)
at org.junit.runners.model.FrameworkMethod$1.runReflectiveCall(FrameworkMethod.java:50)
at org.junit.internal.runners.model.ReflectiveCallable.run(ReflectiveCallable.java:12)
at org.junit.runners.model.FrameworkMethod.invokeExplosively(FrameworkMethod.java:47)
at org.junit.internal.runners.statements.InvokeMethod.evaluate(InvokeMethod.java:17)
at org.apache.beam.sdk.testing.TestPipeline$1.evaluate(TestPipeline.java:317)
at org.junit.rules.ExpectedException$ExpectedExceptionStatement.evaluate(ExpectedException.java:239)
at org.junit.rules.RunRules.evaluate(RunRules.java:20)
at org.junit.runners.ParentRunner.runLeaf(ParentRunner.java:325)
at org.junit.runners.BlockJUnit4ClassRunner.runChild(BlockJUnit4ClassRunner.java:78)
at org.junit.runners.BlockJUnit4ClassRunner.runChild(BlockJUnit4ClassRunner.java:57)
at org.junit.runners.ParentRunner$3.run(ParentRunner.java:290)
at org.junit.runners.ParentRunner$1.schedule(ParentRunner.java:71)
at org.junit.runners.ParentRunner.runChildren(ParentRunner.java:288)
at org.junit.runners.ParentRunner.access$000(ParentRunner.java:58)
at org.junit.runners.ParentRunner$2.evaluate(ParentRunner.java:268)
at org.junit.runners.ParentRunner.run(ParentRunner.java:363)
at org.gradle.api.internal.tasks.testing.junit.JUnitTestClassExecutor.runTestClass(JUnitTestClassExecutor.java:106)
at org.gradle.api.internal.tasks.testing.junit.JUnitTestClassExecutor.execute(JUnitTestClassExecutor.java:58)
at org.gradle.api.internal.tasks.testing.junit.JUnitTestClassExecutor.execute(JUnitTestClassExecutor.java:38)
at org.gradle.api.internal.tasks.testing.junit.AbstractJUnitTestClassProcessor.processTestClass(AbstractJUnitTestClassProcessor.java:66)
at org.gradle.api.internal.tasks.testing.SuiteTestClassProcessor.processTestClass(SuiteTestClassProcessor.java:51)
at sun.reflect.NativeMethodAccessorImpl.invoke0(Native Method)
at sun.reflect.NativeMethodAccessorImpl.invoke(NativeMethodAccessorImpl.java:62)
at sun.reflect.DelegatingMethodAccessorImpl.invoke(DelegatingMethodAccessorImpl.java:43)
at java.lang.reflect.Method.invoke(Method.java:498)
at org.gradle.internal.dispatch.ReflectionDispatch.dispatch(ReflectionDispatch.java:35)
at org.gradle.internal.dispatch.ReflectionDispatch.dispatch(ReflectionDispatch.java:24)
at org.gradle.internal.dispatch.ContextClassLoaderDispatch.dispatch(ContextClassLoaderDispatch.java:32)
at org.gradle.internal.dispatch.ProxyDispatchAdapter$DispatchingInvocationHandler.invoke(ProxyDispatchAdapter.java:93)
at com.sun.proxy.$Proxy2.processTestClass(Unknown Source)
at org.gradle.api.internal.tasks.testing.worker.TestWorker.processTestClass(TestWorker.java:109)
at sun.reflect.NativeMethodAccessorImpl.invoke0(Native Method)
at sun.reflect.NativeMethodAccessorImpl.invoke(NativeMethodAccessorImpl.java:62)
at sun.reflect.DelegatingMethodAccessorImpl.invoke(DelegatingMethodAccessorImpl.java:43)
at java.lang.reflect.Method.invoke(Method.java:498)
at org.gradle.internal.dispatch.ReflectionDispatch.dispatch(ReflectionDispatch.java:35)
at org.gradle.internal.dispatch.ReflectionDispatch.dispatch(ReflectionDispatch.java:24)
at org.gradle.internal.remote.internal.hub.MessageHubBackedObjectConnection$DispatchWrapper.dispatch(MessageHubBackedObjectConnection.java:155)
at org.gradle.internal.remote.internal.hub.MessageHubBackedObjectConnection$DispatchWrapper.dispatch(MessageHubBackedObjectConnection.java:137)
at org.gradle.internal.remote.internal.hub.MessageHub$Handler.run(MessageHub.java:404)
at org.gradle.internal.concurrent.ExecutorPolicy$CatchAndRecordFailures.onExecute(ExecutorPolicy.java:63)
at org.gradle.internal.concurrent.ManagedExecutorImpl$1.run(ManagedExecutorImpl.java:46)
at java.util.concurrent.ThreadPoolExecutor.runWorker(ThreadPoolExecutor.java:1149)
at java.util.concurrent.ThreadPoolExecutor$Worker.run(ThreadPoolExecutor.java:624)
at org.gradle.internal.concurrent.ThreadFactoryImpl$ManagedThreadRunnable.run(ThreadFactoryImpl.java:55)
Caused by: java.lang.NoClassDefFoundError: org/hamcrest/Matchers
at org.apache.beam.sdk.testing.PAssert$AssertContainsInAnyOrder.apply(PAssert.java:1322)
at org.apache.beam.sdk.testing.PAssert$AssertContainsInAnyOrder.apply(PAssert.java:1301)
at org.apache.beam.sdk.testing.PAssert$CheckRelationAgainstExpected.apply(PAssert.java:966)
at org.apache.beam.sdk.testing.PAssert$CheckRelationAgainstExpected.apply(PAssert.java:946)
at org.apache.beam.sdk.testing.PAssert.doChecks(PAssert.java:1250)
at org.apache.beam.sdk.testing.PAssert$GroupedValuesCheckerDoFn.processElement(PAssert.java:1215)
at org.apache.beam.sdk.testing.PAssert$GroupedValuesCheckerDoFn$DoFnInvoker.invokeProcessElement(Unknown Source)
at org.apache.beam.runners.core.SimpleDoFnRunner.invokeProcessElement(SimpleDoFnRunner.java:185)
at org.apache.beam.runners.core.SimpleDoFnRunner.processElement(SimpleDoFnRunner.java:149)
at com.google.cloud.dataflow.worker.SimpleParDoFn.processElement(SimpleParDoFn.java:323)
at com.google.cloud.dataflow.worker.util.common.worker.ParDoOperation.process(ParDoOperation.java:43)
at com.google.cloud.dataflow.worker.util.common.worker.OutputReceiver.process(OutputReceiver.java:48)
at com.google.cloud.dataflow.worker.SimpleParDoFn$1.output(SimpleParDoFn.java:271)
at org.apache.beam.runners.core.SimpleDoFnRunner.outputWindowedValue(SimpleDoFnRunner.java:219)
at org.apache.beam.runners.core.SimpleDoFnRunner.access$700(SimpleDoFnRunner.java:69)
at org.apache.beam.runners.core.SimpleDoFnRunner$DoFnProcessContext.output(SimpleDoFnRunner.java:517)
at org.apache.beam.sdk.transforms.DoFnOutputReceivers$WindowedContextOutputReceiver.output(DoFnOutputReceivers.java:42)
at org.apache.beam.sdk.transforms.MapElements$1.processElement(MapElements.java:131)
at org.apache.beam.sdk.transforms.MapElements$1$DoFnInvoker.invokeProcessElement(Unknown Source)
at org.apache.beam.runners.core.SimpleDoFnRunner.invokeProcessElement(SimpleDoFnRunner.java:185)
at org.apache.beam.runners.core.SimpleDoFnRunner.processElement(SimpleDoFnRunner.java:149)
at com.google.cloud.dataflow.worker.SimpleParDoFn.processElement(SimpleParDoFn.java:323)
at com.google.cloud.dataflow.worker.util.common.worker.ParDoOperation.process(ParDoOperation.java:43)
at com.google.cloud.dataflow.worker.util.common.worker.OutputReceiver.process(OutputReceiver.java:48)
at com.google.cloud.dataflow.worker.SimpleParDoFn$1.output(SimpleParDoFn.java:271)
at org.apache.beam.runners.core.SimpleDoFnRunner.outputWindowedValue(SimpleDoFnRunner.java:219)
at org.apache.beam.runners.core.SimpleDoFnRunner.access$700(SimpleDoFnRunner.java:69)
at org.apache.beam.runners.core.SimpleDoFnRunner$DoFnProcessContext.output(SimpleDoFnRunner.java:517)
at org.apache.beam.runners.core.SimpleDoFnRunner$DoFnProcessContext.output(SimpleDoFnRunner.java:505)
at org.apache.beam.sdk.testing.PAssert$ConcatFn.processElement(PAssert.java:1049)
at org.apache.beam.sdk.testing.PAssert$ConcatFn$DoFnInvoker.invokeProcessElement(Unknown Source)
at org.apache.beam.runners.core.SimpleDoFnRunner.invokeProcessElement(SimpleDoFnRunner.java:185)
at org.apache.beam.runners.core.SimpleDoFnRunner.processElement(SimpleDoFnRunner.java:149)
at com.google.cloud.dataflow.worker.SimpleParDoFn.processElement(SimpleParDoFn.java:323)
at com.google.cloud.dataflow.worker.util.common.worker.ParDoOperation.process(ParDoOperation.java:43)
at com.google.cloud.dataflow.worker.util.common.worker.OutputReceiver.process(OutputReceiver.java:48)
at com.google.cloud.dataflow.worker.SimpleParDoFn$1.output(SimpleParDoFn.java:271)
at org.apache.beam.runners.core.SimpleDoFnRunner.outputWindowedValue(SimpleDoFnRunner.java:219)
at org.apache.beam.runners.core.SimpleDoFnRunner.access$700(SimpleDoFnRunner.java:69)
at org.apache.beam.runners.core.SimpleDoFnRunner$DoFnProcessContext.output(SimpleDoFnRunner.java:517)
at org.apache.beam.sdk.transforms.DoFnOutputReceivers$WindowedContextOutputReceiver.output(DoFnOutputReceivers.java:42)
at org.apache.beam.sdk.transforms.MapElements$1.processElement(MapElements.java:131)
at org.apache.beam.sdk.transforms.MapElements$1$DoFnInvoker.invokeProcessElement(Unknown Source)
at org.apache.beam.runners.core.SimpleDoFnRunner.invokeProcessElement(SimpleDoFnRunner.java:185)
at org.apache.beam.runners.core.SimpleDoFnRunner.processElement(SimpleDoFnRunner.java:149)
at com.google.cloud.dataflow.worker.SimpleParDoFn.processElement(SimpleParDoFn.java:323)
at com.google.cloud.dataflow.worker.util.common.worker.ParDoOperation.process(ParDoOperation.java:43)
at com.google.cloud.dataflow.worker.util.common.worker.OutputReceiver.process(OutputReceiver.java:48)
at com.google.cloud.dataflow.worker.GroupAlsoByWindowsParDoFn$1.output(GroupAlsoByWindowsParDoFn.java:181)
at com.google.cloud.dataflow.worker.GroupAlsoByWindowFnRunner$1.outputWindowedValue(GroupAlsoByWindowFnRunner.java:102)
at com.google.cloud.dataflow.worker.util.BatchGroupAlsoByWindowViaIteratorsFn.processElement(BatchGroupAlsoByWindowViaIteratorsFn.java:124)
at com.google.cloud.dataflow.worker.util.BatchGroupAlsoByWindowViaIteratorsFn.processElement(BatchGroupAlsoByWindowViaIteratorsFn.java:53)
at com.google.cloud.dataflow.worker.GroupAlsoByWindowFnRunner.invokeProcessElement(GroupAlsoByWindowFnRunner.java:115)
at com.google.cloud.dataflow.worker.GroupAlsoByWindowFnRunner.processElement(GroupAlsoByWindowFnRunner.java:73)
at com.google.cloud.dataflow.worker.GroupAlsoByWindowsParDoFn.processElement(GroupAlsoByWindowsParDoFn.java:113)
at com.google.cloud.dataflow.worker.util.common.worker.ParDoOperation.process(ParDoOperation.java:43)
at com.google.cloud.dataflow.worker.util.common.worker.OutputReceiver.process(OutputReceiver.java:48)
at com.google.cloud.dataflow.worker.util.common.worker.ReadOperation.runReadLoop(ReadOperation.java:200)
at com.google.cloud.dataflow.worker.util.common.worker.ReadOperation.start(ReadOperation.java:158)
at com.google.cloud.dataflow.worker.util.common.worker.MapTaskExecutor.execute(MapTaskExecutor.java:75)
at com.google.cloud.dataflow.worker.BatchDataflowWorker.executeWork(BatchDataflowWorker.java:391)
at com.google.cloud.dataflow.worker.BatchDataflowWorker.doWork(BatchDataflowWorker.java:360)
at com.google.cloud.dataflow.worker.BatchDataflowWorker.getAndPerformWork(BatchDataflowWorker.java:288)
at com.google.cloud.dataflow.worker.DataflowBatchWorkerHarness$WorkerThread.doWork(DataflowBatchWorkerHarness.java:134)
at com.google.cloud.dataflow.worker.DataflowBatchWorkerHarness$WorkerThread.call(DataflowBatchWorkerHarness.java:114)
at com.google.cloud.dataflow.worker.DataflowBatchWorkerHarness$WorkerThread.call(DataflowBatchWorkerHarness.java:101)
at java.util.concurrent.FutureTask.run(FutureTask.java:266)
at java.util.concurrent.ThreadPoolExecutor.runWorker(ThreadPoolExecutor.java:1142)
at java.util.concurrent.ThreadPoolExecutor$Worker.run(ThreadPoolExecutor.java:617)
at java.lang.Thread.run(Thread.java:745)
Workflow failed. Causes: S16:PAssert$33/GroupGlobally/GroupDummyAndContents/Read+PAssert$33/GroupGlobally/GroupDummyAndContents/GroupByWindow+PAssert$33/GroupGlobally/Values/Values/Map+PAssert$33/GroupGlobally/ParDo(Concat)+PAssert$33/GetPane/Map+PAssert$33/RunChecks+PAssert$33/VerifyAssertions/ParDo(DefaultConclude) failed., A work item was attempted 4 times without success. Each time the worker eventually lost contact with the service. The work item was attempted on:
viewtest0testsingletonsid-06161650-o3sb-harness-9h7n,
viewtest0testsingletonsid-06161650-o3sb-harness-9h7n,
viewtest0testsingletonsid-06161650-o3sb-harness-9h7n,
viewtest0testsingletonsid-06161650-o3sb-harness-9h7n
at org.apache.beam.runners.dataflow.TestDataflowRunner.run(TestDataflowRunner.java:134)
at org.apache.beam.runners.dataflow.TestDataflowRunner.run(TestDataflowRunner.java:90)
at org.apache.beam.runners.dataflow.TestDataflowRunner.run(TestDataflowRunner.java:55)
at org.apache.beam.sdk.Pipeline.run(Pipeline.java:311)
at org.apache.beam.sdk.testing.TestPipeline.run(TestPipeline.java:348)
at org.apache.beam.sdk.testing.TestPipeline.run(TestPipeline.java:329)
at org.apache.beam.sdk.transforms.ViewTest.testSingletonSideInput(ViewTest.java:109)
Gradle Test Executor 38 finished executing tests.
> Task :beam-runners-google-cloud-dataflow-java:validatesRunnerTest
209 tests completed, 190 failed, 2 skipped
Finished generating test XML results (1.119 secs) into: <https://builds.apache.org/job/beam_PostCommit_Java_ValidatesRunner_Dataflow_Gradle/ws/src/runners/google-cloud-dataflow-java/build/test-results/validatesRunnerTest>
Generating HTML test report...
Finished generating test html results (0.889 secs) into: <https://builds.apache.org/job/beam_PostCommit_Java_ValidatesRunner_Dataflow_Gradle/ws/src/runners/google-cloud-dataflow-java/build/reports/tests/validatesRunnerTest>
> Task :beam-runners-google-cloud-dataflow-java:validatesRunnerTest FAILED
:beam-runners-google-cloud-dataflow-java:validatesRunnerTest (Thread[Task worker for ':' Thread 35,5,main]) completed. Took 2 hrs 12 mins 27.84 secs.
FAILURE: Build failed with an exception.
* What went wrong:
Execution failed for task ':beam-runners-google-cloud-dataflow-java:validatesRunnerTest'.
> There were failing tests. See the report at: file://<https://builds.apache.org/job/beam_PostCommit_Java_ValidatesRunner_Dataflow_Gradle/ws/src/runners/google-cloud-dataflow-java/build/reports/tests/validatesRunnerTest/index.html>
* Try:
Run with --stacktrace option to get the stack trace. Run with --debug option to get more log output. Run with --scan to get full insights.
* Get more help at https://help.gradle.org
Deprecated Gradle features were used in this build, making it incompatible with Gradle 5.0.
See https://docs.gradle.org/4.8/userguide/command_line_interface.html#sec:command_line_warnings
BUILD FAILED in 2h 13m 20s
38 actionable tasks: 34 executed, 4 from cache
Publishing build scan...
https://gradle.com/s/it246lpvkd7yu
Build step 'Invoke Gradle script' changed build result to FAILURE
Build step 'Invoke Gradle script' marked build as failure
Recording test results
Not sending mail to unregistered user apilloud@google.com
Not sending mail to unregistered user robbe.sneyders@ml6.eu
Not sending mail to unregistered user github@alasdairhodge.co.uk
Not sending mail to unregistered user ringwalt@google.com
Not sending mail to unregistered user aaltay@gmail.com
Not sending mail to unregistered user swegner@google.com
Not sending mail to unregistered user robinyq@rodete-desktop-imager.corp.google.com
Not sending mail to unregistered user ehudm@google.com
Not sending mail to unregistered user kedin@google.com
Not sending mail to unregistered user jiangkai@gmail.com
Not sending mail to unregistered user kirpichov@google.com
Not sending mail to unregistered user fvoichick@gmail.com