You are viewing a plain text version of this content. The canonical link for it is here.
Posted to issues-all@impala.apache.org by "Surya Hebbar (Jira)" <ji...@apache.org> on 2025/12/07 08:04:00 UTC

[jira] [Created] (IMPALA-14608) test_scanners.TestPaimonScannerWithLimit.test_limit failure

Surya Hebbar created IMPALA-14608:
-------------------------------------

             Summary: test_scanners.TestPaimonScannerWithLimit.test_limit failure
                 Key: IMPALA-14608
                 URL: https://issues.apache.org/jira/browse/IMPALA-14608
             Project: IMPALA
          Issue Type: Bug
            Reporter: Surya Hebbar
            Assignee: Riza Suminto


{code:java}
query_test.test_scanners.TestPaimonScannerWithLimit.test_limit["table_format: parquet/none" | "protocol: hs2" | "exec_option: {'abort_on_error': 1, 'batch_size': 100, 'disable_codegen': False, 'disable_codegen_rows_threshold': 0, 'exec_single_node_rows_threshold': 0, 'num_nodes': 0, 'test_replan': 1}"] {code}
h3. Error Message
{code:java}
query_test/test_scanners.py:2034: in test_limit     self._test_limit(vector) query_test/test_scanners.py:2047: in _test_limit     result = self.execute_query(query, vector.get_value('exec_option'), common/impala_test_suite.py:1124: in wrapper     return function(*args, **kwargs) common/impala_test_suite.py:1168: in execute_query     return self.__execute_query(self.client, query, query_options) common/impala_test_suite.py:1299: in __execute_query     return impalad_client.execute(query, user=user) common/impala_connection.py:687: in execute     cursor.execute(sql_stmt, configuration=self.__query_options) /data/jenkins/workspace/impala-asf-master-core-s3-arm-data-cache/repos/Impala/infra/python/env-gcc10.4.0-py3/lib/python3.8/site-packages/impala/hiveserver2.py:394: in execute     self._wait_to_finish()  # make execute synchronous /data/jenkins/workspace/impala-asf-master-core-s3-arm-data-cache/repos/Impala/infra/python/env-gcc10.4.0-py3/lib/python3.8/site-packages/impala/hiveserver2.py:484: in _wait_to_finish     raise OperationalError(resp.errorMessage) E   impala.error.OperationalError: Query df43b89e1463e3be:6334094f00000000 failed: E   IllegalStateException: error loading native libraries: java.io.FileNotFoundException: aarch_64/libarrow_cdata_jni.so
{code}

h3. Stacktrace
{code}
query_test/test_scanners.py:2034: in test_limit
    self._test_limit(vector)
query_test/test_scanners.py:2047: in _test_limit
    result = self.execute_query(query, vector.get_value('exec_option'),
common/impala_test_suite.py:1124: in wrapper
    return function(*args, **kwargs)
common/impala_test_suite.py:1168: in execute_query
    return self.__execute_query(self.client, query, query_options)
common/impala_test_suite.py:1299: in __execute_query
    return impalad_client.execute(query, user=user)
common/impala_connection.py:687: in execute
    cursor.execute(sql_stmt, configuration=self.__query_options)
/data/jenkins/workspace/impala-asf-master-core-s3-arm-data-cache/repos/Impala/infra/python/env-gcc10.4.0-py3/lib/python3.8/site-packages/impala/hiveserver2.py:394: in execute
    self._wait_to_finish()  # make execute synchronous
/data/jenkins/workspace/impala-asf-master-core-s3-arm-data-cache/repos/Impala/infra/python/env-gcc10.4.0-py3/lib/python3.8/site-packages/impala/hiveserver2.py:484: in _wait_to_finish
    raise OperationalError(resp.errorMessage)
E   impala.error.OperationalError: Query df43b89e1463e3be:6334094f00000000 failed:
E   IllegalStateException: error loading native libraries: java.io.FileNotFoundException: aarch_64/libarrow_cdata_jni.so
{code}



--
This message was sent by Atlassian Jira
(v8.20.10#820010)

---------------------------------------------------------------------
To unsubscribe, e-mail: issues-all-unsubscribe@impala.apache.org
For additional commands, e-mail: issues-all-help@impala.apache.org