You are viewing a plain text version of this content. The canonical link for it is here.
Posted to dev@kafka.apache.org by Apache Jenkins Server <je...@builds.apache.org> on 2019/09/05 07:24:58 UTC
Build failed in Jenkins: kafka-trunk-jdk8 #3887
See <https://builds.apache.org/job/kafka-trunk-jdk8/3887/display/redirect?page=changes>
Changes:
[wangguoz] KAFKA-8729, pt 1: Add 4 new metrics to keep track of various types of
[manikumar.reddy] MINOR: Fix few typos in the javadocs/docs
------------------------------------------
[...truncated 2.62 MB...]
org.apache.kafka.connect.json.JsonConverterTest > mapToJsonNonStringKeys STARTED
org.apache.kafka.connect.json.JsonConverterTest > mapToJsonNonStringKeys PASSED
org.apache.kafka.connect.json.JsonConverterTest > longToJson STARTED
org.apache.kafka.connect.json.JsonConverterTest > longToJson PASSED
org.apache.kafka.connect.json.JsonConverterTest > mismatchSchemaJson STARTED
org.apache.kafka.connect.json.JsonConverterTest > mismatchSchemaJson PASSED
org.apache.kafka.connect.json.JsonConverterTest > mapToConnectNonStringKeys STARTED
org.apache.kafka.connect.json.JsonConverterTest > mapToConnectNonStringKeys PASSED
org.apache.kafka.connect.json.JsonConverterTest > testJsonSchemaMetadataTranslation STARTED
org.apache.kafka.connect.json.JsonConverterTest > testJsonSchemaMetadataTranslation PASSED
org.apache.kafka.connect.json.JsonConverterTest > bytesToJson STARTED
org.apache.kafka.connect.json.JsonConverterTest > bytesToJson PASSED
org.apache.kafka.connect.json.JsonConverterTest > shortToConnect STARTED
org.apache.kafka.connect.json.JsonConverterTest > shortToConnect PASSED
org.apache.kafka.connect.json.JsonConverterTest > intToJson STARTED
org.apache.kafka.connect.json.JsonConverterTest > intToJson PASSED
org.apache.kafka.connect.json.JsonConverterTest > nullSchemaAndNullValueToJson STARTED
org.apache.kafka.connect.json.JsonConverterTest > nullSchemaAndNullValueToJson PASSED
org.apache.kafka.connect.json.JsonConverterTest > timestampToConnectOptional STARTED
org.apache.kafka.connect.json.JsonConverterTest > timestampToConnectOptional PASSED
org.apache.kafka.connect.json.JsonConverterTest > structToConnect STARTED
org.apache.kafka.connect.json.JsonConverterTest > structToConnect PASSED
org.apache.kafka.connect.json.JsonConverterTest > stringToJson STARTED
org.apache.kafka.connect.json.JsonConverterTest > stringToJson PASSED
org.apache.kafka.connect.json.JsonConverterTest > nullSchemaAndArrayToJson STARTED
org.apache.kafka.connect.json.JsonConverterTest > nullSchemaAndArrayToJson PASSED
org.apache.kafka.connect.json.JsonConverterTest > byteToConnect STARTED
org.apache.kafka.connect.json.JsonConverterTest > byteToConnect PASSED
org.apache.kafka.connect.json.JsonConverterTest > nullSchemaPrimitiveToConnect STARTED
org.apache.kafka.connect.json.JsonConverterTest > nullSchemaPrimitiveToConnect PASSED
org.apache.kafka.connect.json.JsonConverterTest > byteToJson STARTED
org.apache.kafka.connect.json.JsonConverterTest > byteToJson PASSED
org.apache.kafka.connect.json.JsonConverterTest > intToConnect STARTED
org.apache.kafka.connect.json.JsonConverterTest > intToConnect PASSED
org.apache.kafka.connect.json.JsonConverterTest > dateToJson STARTED
org.apache.kafka.connect.json.JsonConverterTest > dateToJson PASSED
org.apache.kafka.connect.json.JsonConverterTest > noSchemaToConnect STARTED
org.apache.kafka.connect.json.JsonConverterTest > noSchemaToConnect PASSED
org.apache.kafka.connect.json.JsonConverterTest > noSchemaToJson STARTED
org.apache.kafka.connect.json.JsonConverterTest > noSchemaToJson PASSED
org.apache.kafka.connect.json.JsonConverterTest > nullSchemaAndPrimitiveToJson STARTED
org.apache.kafka.connect.json.JsonConverterTest > nullSchemaAndPrimitiveToJson PASSED
org.apache.kafka.connect.json.JsonConverterTest > decimalToConnectOptionalWithDefaultValue STARTED
org.apache.kafka.connect.json.JsonConverterTest > decimalToConnectOptionalWithDefaultValue PASSED
org.apache.kafka.connect.json.JsonConverterTest > mapToJsonStringKeys STARTED
org.apache.kafka.connect.json.JsonConverterTest > mapToJsonStringKeys PASSED
org.apache.kafka.connect.json.JsonConverterTest > arrayToJson STARTED
org.apache.kafka.connect.json.JsonConverterTest > arrayToJson PASSED
org.apache.kafka.connect.json.JsonConverterTest > nullToConnect STARTED
org.apache.kafka.connect.json.JsonConverterTest > nullToConnect PASSED
org.apache.kafka.connect.json.JsonConverterTest > timeToJson STARTED
org.apache.kafka.connect.json.JsonConverterTest > timeToJson PASSED
org.apache.kafka.connect.json.JsonConverterTest > structToJson STARTED
org.apache.kafka.connect.json.JsonConverterTest > structToJson PASSED
org.apache.kafka.connect.json.JsonConverterTest > testConnectSchemaMetadataTranslation STARTED
org.apache.kafka.connect.json.JsonConverterTest > testConnectSchemaMetadataTranslation PASSED
org.apache.kafka.connect.json.JsonConverterTest > shortToJson STARTED
org.apache.kafka.connect.json.JsonConverterTest > shortToJson PASSED
org.apache.kafka.connect.json.JsonConverterTest > dateToConnect STARTED
org.apache.kafka.connect.json.JsonConverterTest > dateToConnect PASSED
org.apache.kafka.connect.json.JsonConverterTest > doubleToJson STARTED
org.apache.kafka.connect.json.JsonConverterTest > doubleToJson PASSED
org.apache.kafka.connect.json.JsonConverterTest > testStringHeaderToJson STARTED
org.apache.kafka.connect.json.JsonConverterTest > testStringHeaderToJson PASSED
org.apache.kafka.connect.json.JsonConverterTest > decimalToConnectOptional STARTED
org.apache.kafka.connect.json.JsonConverterTest > decimalToConnectOptional PASSED
org.apache.kafka.connect.json.JsonConverterTest > structSchemaIdentical STARTED
org.apache.kafka.connect.json.JsonConverterTest > structSchemaIdentical PASSED
org.apache.kafka.connect.json.JsonConverterTest > timeToConnectWithDefaultValue STARTED
org.apache.kafka.connect.json.JsonConverterTest > timeToConnectWithDefaultValue PASSED
org.apache.kafka.connect.json.JsonConverterTest > timeToConnect STARTED
org.apache.kafka.connect.json.JsonConverterTest > timeToConnect PASSED
org.apache.kafka.connect.json.JsonConverterTest > dateToConnectOptionalWithDefaultValue STARTED
org.apache.kafka.connect.json.JsonConverterTest > dateToConnectOptionalWithDefaultValue PASSED
org.apache.kafka.connect.json.JsonConverterTest > mapToConnectStringKeys STARTED
org.apache.kafka.connect.json.JsonConverterTest > mapToConnectStringKeys PASSED
org.apache.kafka.connect.json.JsonConverterTest > dateToConnectOptional STARTED
org.apache.kafka.connect.json.JsonConverterTest > dateToConnectOptional PASSED
org.apache.kafka.connect.json.JsonConverterTest > timeToConnectOptionalWithDefaultValue STARTED
org.apache.kafka.connect.json.JsonConverterTest > timeToConnectOptionalWithDefaultValue PASSED
org.apache.kafka.connect.json.JsonConverterTest > floatToConnect STARTED
org.apache.kafka.connect.json.JsonConverterTest > floatToConnect PASSED
org.apache.kafka.connect.json.JsonConverterTest > decimalToConnectWithDefaultValue STARTED
org.apache.kafka.connect.json.JsonConverterTest > decimalToConnectWithDefaultValue PASSED
org.apache.kafka.connect.json.JsonConverterTest > decimalToJson STARTED
org.apache.kafka.connect.json.JsonConverterTest > decimalToJson PASSED
org.apache.kafka.connect.json.JsonConverterTest > arrayToConnect STARTED
org.apache.kafka.connect.json.JsonConverterTest > arrayToConnect PASSED
org.apache.kafka.connect.json.JsonConverterTest > testCacheSchemaToConnectConversion STARTED
org.apache.kafka.connect.json.JsonConverterTest > testCacheSchemaToConnectConversion PASSED
org.apache.kafka.connect.json.JsonConverterTest > booleanToJson STARTED
org.apache.kafka.connect.json.JsonConverterTest > booleanToJson PASSED
org.apache.kafka.connect.json.JsonConverterTest > bytesToConnect STARTED
org.apache.kafka.connect.json.JsonConverterTest > bytesToConnect PASSED
org.apache.kafka.connect.json.JsonConverterTest > doubleToConnect STARTED
org.apache.kafka.connect.json.JsonConverterTest > doubleToConnect PASSED
org.apache.kafka.connect.json.JsonConverterTest > timestampToConnectOptionalWithDefaultValue STARTED
org.apache.kafka.connect.json.JsonConverterTest > timestampToConnectOptionalWithDefaultValue PASSED
FAILURE: Build failed with an exception.
* What went wrong:
Execution failed for task ':streams:test'.
> There were failing tests. See the report at: file://<https://builds.apache.org/job/kafka-trunk-jdk8/ws/streams/build/reports/tests/test/index.html>
* Try:
Run with --stacktrace option to get the stack trace. Run with --info or --debug option to get more log output. Run with --scan to get full insights.
* Get more help at https://help.gradle.org
Deprecated Gradle features were used in this build, making it incompatible with Gradle 6.0.
Use '--warning-mode all' to show the individual deprecation warnings.
See https://docs.gradle.org/5.4.1/userguide/command_line_interface.html#sec:command_line_warnings
BUILD FAILED in 3h 28m 47s
182 actionable tasks: 155 executed, 27 up-to-date
Build step 'Execute shell' marked build as failure
[FINDBUGS] Collecting findbugs analysis files...
Setting GRADLE_4_10_3_HOME=/home/jenkins/tools/gradle/4.10.3
[FINDBUGS] Searching for all files in <https://builds.apache.org/job/kafka-trunk-jdk8/ws/> that match the pattern **/build/reports/*bugs/*.xml
[FINDBUGS] Parsing 17 files in <https://builds.apache.org/job/kafka-trunk-jdk8/ws/>
[FINDBUGS] Successfully parsed file <https://builds.apache.org/job/kafka-trunk-jdk8/ws/clients/build/reports/spotbugs/main.xml> with 0 unique warnings and 0 duplicates.
[FINDBUGS] Successfully parsed file <https://builds.apache.org/job/kafka-trunk-jdk8/ws/connect/api/build/reports/spotbugs/main.xml> with 0 unique warnings and 0 duplicates.
[FINDBUGS] Successfully parsed file <https://builds.apache.org/job/kafka-trunk-jdk8/ws/connect/basic-auth-extension/build/reports/spotbugs/main.xml> with 0 unique warnings and 0 duplicates.
[FINDBUGS] Successfully parsed file <https://builds.apache.org/job/kafka-trunk-jdk8/ws/connect/file/build/reports/spotbugs/main.xml> with 0 unique warnings and 0 duplicates.
[FINDBUGS] Successfully parsed file <https://builds.apache.org/job/kafka-trunk-jdk8/ws/connect/json/build/reports/spotbugs/main.xml> with 0 unique warnings and 0 duplicates.
[FINDBUGS] Successfully parsed file <https://builds.apache.org/job/kafka-trunk-jdk8/ws/connect/runtime/build/reports/spotbugs/main.xml> with 0 unique warnings and 0 duplicates.
[FINDBUGS] Successfully parsed file <https://builds.apache.org/job/kafka-trunk-jdk8/ws/connect/transforms/build/reports/spotbugs/main.xml> with 0 unique warnings and 0 duplicates.
[FINDBUGS] Successfully parsed file <https://builds.apache.org/job/kafka-trunk-jdk8/ws/core/build/reports/spotbugs/main.xml> with 0 unique warnings and 0 duplicates.
[FINDBUGS] Successfully parsed file <https://builds.apache.org/job/kafka-trunk-jdk8/ws/examples/build/reports/spotbugs/main.xml> with 0 unique warnings and 0 duplicates.
[FINDBUGS] Successfully parsed file <https://builds.apache.org/job/kafka-trunk-jdk8/ws/generator/build/reports/spotbugs/main.xml> with 0 unique warnings and 0 duplicates.
[FINDBUGS] Successfully parsed file <https://builds.apache.org/job/kafka-trunk-jdk8/ws/jmh-benchmarks/build/reports/spotbugs/main.xml> with 0 unique warnings and 0 duplicates.
[FINDBUGS] Successfully parsed file <https://builds.apache.org/job/kafka-trunk-jdk8/ws/log4j-appender/build/reports/spotbugs/main.xml> with 0 unique warnings and 0 duplicates.
[FINDBUGS] Successfully parsed file <https://builds.apache.org/job/kafka-trunk-jdk8/ws/streams/build/reports/spotbugs/main.xml> with 0 unique warnings and 0 duplicates.
[FINDBUGS] Successfully parsed file <https://builds.apache.org/job/kafka-trunk-jdk8/ws/streams/examples/build/reports/spotbugs/main.xml> with 0 unique warnings and 0 duplicates.
[FINDBUGS] Successfully parsed file <https://builds.apache.org/job/kafka-trunk-jdk8/ws/streams/streams-scala/build/reports/spotbugs/main.xml> with 0 unique warnings and 0 duplicates.
[FINDBUGS] Successfully parsed file <https://builds.apache.org/job/kafka-trunk-jdk8/ws/streams/test-utils/build/reports/spotbugs/main.xml> with 0 unique warnings and 0 duplicates.
[FINDBUGS] Successfully parsed file <https://builds.apache.org/job/kafka-trunk-jdk8/ws/tools/build/reports/spotbugs/main.xml> with 0 unique warnings and 0 duplicates.
Setting GRADLE_4_10_3_HOME=/home/jenkins/tools/gradle/4.10.3
No credentials specified
Setting GRADLE_4_10_3_HOME=/home/jenkins/tools/gradle/4.10.3
<Git Blamer> Using GitBlamer to create author and commit information for all warnings.
<Git Blamer> GIT_COMMIT=c5f2bd64d1f21a44bc9832f80f4ae76d3c065b96, workspace=<https://builds.apache.org/job/kafka-trunk-jdk8/ws/>
[FINDBUGS] Computing warning deltas based on reference build #3881
Recording test results
Setting GRADLE_4_10_3_HOME=/home/jenkins/tools/gradle/4.10.3
Setting GRADLE_4_10_3_HOME=/home/jenkins/tools/gradle/4.10.3
Not sending mail to unregistered user manikumar.reddy@gmail.com
Not sending mail to unregistered user bill@confluent.io
Not sending mail to unregistered user noreply@github.com
Not sending mail to unregistered user wangguoz@gmail.com
Jenkins build is back to normal : kafka-trunk-jdk8 #3889
Posted by Apache Jenkins Server <je...@builds.apache.org>.
See <https://builds.apache.org/job/kafka-trunk-jdk8/3889/display/redirect?page=changes>
Build failed in Jenkins: kafka-trunk-jdk8 #3888
Posted by Apache Jenkins Server <je...@builds.apache.org>.
See <https://builds.apache.org/job/kafka-trunk-jdk8/3888/display/redirect?page=changes>
Changes:
[github] KAFKA-8866; Return exceptions as Optional<ApiException> in authorizer
[github] KAFKA-8857; Don't check synonyms while determining if config is readOnly
------------------------------------------
[...truncated 6.00 MB...]
org.apache.kafka.trogdor.common.StringExpanderTest > testNoExpansionNeeded STARTED
org.apache.kafka.trogdor.common.StringExpanderTest > testNoExpansionNeeded PASSED
org.apache.kafka.trogdor.common.WorkerUtilsTest > testCreatesNotExistingTopics STARTED
org.apache.kafka.trogdor.common.WorkerUtilsTest > testCreatesNotExistingTopics PASSED
org.apache.kafka.trogdor.common.WorkerUtilsTest > testCreateZeroTopicsDoesNothing STARTED
org.apache.kafka.trogdor.common.WorkerUtilsTest > testCreateZeroTopicsDoesNothing PASSED
org.apache.kafka.trogdor.common.WorkerUtilsTest > testCreateNonExistingTopicsWithZeroTopicsDoesNothing STARTED
org.apache.kafka.trogdor.common.WorkerUtilsTest > testCreateNonExistingTopicsWithZeroTopicsDoesNothing PASSED
org.apache.kafka.trogdor.common.WorkerUtilsTest > testCreateTopicsFailsIfAtLeastOneTopicExists STARTED
org.apache.kafka.trogdor.common.WorkerUtilsTest > testCreateTopicsFailsIfAtLeastOneTopicExists PASSED
org.apache.kafka.trogdor.common.WorkerUtilsTest > testCreatesOneTopicVerifiesOneTopic STARTED
org.apache.kafka.trogdor.common.WorkerUtilsTest > testCreatesOneTopicVerifiesOneTopic PASSED
org.apache.kafka.trogdor.common.WorkerUtilsTest > testCommonConfigOverwritesDefaultProps STARTED
org.apache.kafka.trogdor.common.WorkerUtilsTest > testCommonConfigOverwritesDefaultProps PASSED
org.apache.kafka.trogdor.common.WorkerUtilsTest > testClientConfigOverwritesBothDefaultAndCommonConfigs STARTED
org.apache.kafka.trogdor.common.WorkerUtilsTest > testClientConfigOverwritesBothDefaultAndCommonConfigs PASSED
org.apache.kafka.trogdor.common.WorkerUtilsTest > testVerifyTopics STARTED
org.apache.kafka.trogdor.common.WorkerUtilsTest > testVerifyTopics PASSED
org.apache.kafka.trogdor.common.WorkerUtilsTest > testExistingTopicsNotCreated STARTED
org.apache.kafka.trogdor.common.WorkerUtilsTest > testExistingTopicsNotCreated PASSED
org.apache.kafka.trogdor.common.WorkerUtilsTest > testGetMatchingTopicPartitionsCorrectlyMatchesExactTopicName STARTED
org.apache.kafka.trogdor.common.WorkerUtilsTest > testGetMatchingTopicPartitionsCorrectlyMatchesExactTopicName PASSED
org.apache.kafka.trogdor.common.WorkerUtilsTest > testCreateRetriesOnTimeout STARTED
org.apache.kafka.trogdor.common.WorkerUtilsTest > testCreateRetriesOnTimeout PASSED
org.apache.kafka.trogdor.common.WorkerUtilsTest > testExistingTopicsMustHaveRequestedNumberOfPartitions STARTED
org.apache.kafka.trogdor.common.WorkerUtilsTest > testExistingTopicsMustHaveRequestedNumberOfPartitions PASSED
org.apache.kafka.trogdor.common.WorkerUtilsTest > testAddConfigsToPropertiesAddsAllConfigs STARTED
org.apache.kafka.trogdor.common.WorkerUtilsTest > testAddConfigsToPropertiesAddsAllConfigs PASSED
org.apache.kafka.trogdor.common.WorkerUtilsTest > testGetMatchingTopicPartitionsCorrectlyMatchesTopics STARTED
org.apache.kafka.trogdor.common.WorkerUtilsTest > testGetMatchingTopicPartitionsCorrectlyMatchesTopics PASSED
org.apache.kafka.trogdor.common.WorkerUtilsTest > testCreateOneTopic STARTED
org.apache.kafka.trogdor.common.WorkerUtilsTest > testCreateOneTopic PASSED
org.apache.kafka.trogdor.common.TopologyTest > testAgentNodeNames STARTED
org.apache.kafka.trogdor.common.TopologyTest > testAgentNodeNames PASSED
org.apache.kafka.trogdor.workload.ExternalCommandWorkerTest > testProcessWithFailedExit STARTED
org.apache.kafka.trogdor.workload.ExternalCommandWorkerTest > testProcessWithFailedExit PASSED
org.apache.kafka.trogdor.workload.ExternalCommandWorkerTest > testProcessNotFound STARTED
org.apache.kafka.trogdor.workload.ExternalCommandWorkerTest > testProcessNotFound PASSED
org.apache.kafka.trogdor.workload.ExternalCommandWorkerTest > testProcessForceKillTimeout STARTED
org.apache.kafka.trogdor.workload.ExternalCommandWorkerTest > testProcessForceKillTimeout PASSED
org.apache.kafka.trogdor.workload.ExternalCommandWorkerTest > testProcessStop STARTED
org.apache.kafka.trogdor.workload.ExternalCommandWorkerTest > testProcessStop PASSED
org.apache.kafka.trogdor.workload.ExternalCommandWorkerTest > testProcessWithNormalExit STARTED
org.apache.kafka.trogdor.workload.ExternalCommandWorkerTest > testProcessWithNormalExit PASSED
org.apache.kafka.trogdor.workload.ConsumeBenchSpecTest > testMaterializeTopicsWithSomePartitions STARTED
org.apache.kafka.trogdor.workload.ConsumeBenchSpecTest > testMaterializeTopicsWithSomePartitions PASSED
org.apache.kafka.trogdor.workload.ConsumeBenchSpecTest > testMaterializeTopicsWithNoPartitions STARTED
org.apache.kafka.trogdor.workload.ConsumeBenchSpecTest > testMaterializeTopicsWithNoPartitions PASSED
org.apache.kafka.trogdor.workload.ConsumeBenchSpecTest > testInvalidTopicNameRaisesExceptionInMaterialize STARTED
org.apache.kafka.trogdor.workload.ConsumeBenchSpecTest > testInvalidTopicNameRaisesExceptionInMaterialize PASSED
org.apache.kafka.trogdor.workload.HistogramTest > testHistogramPercentiles STARTED
org.apache.kafka.trogdor.workload.HistogramTest > testHistogramPercentiles PASSED
org.apache.kafka.trogdor.workload.HistogramTest > testHistogramSamples STARTED
org.apache.kafka.trogdor.workload.HistogramTest > testHistogramSamples PASSED
org.apache.kafka.trogdor.workload.HistogramTest > testHistogramAverage STARTED
org.apache.kafka.trogdor.workload.HistogramTest > testHistogramAverage PASSED
org.apache.kafka.trogdor.workload.PayloadGeneratorTest > testRandomComponentPayloadGeneratorErrors STARTED
org.apache.kafka.trogdor.workload.PayloadGeneratorTest > testRandomComponentPayloadGeneratorErrors PASSED
org.apache.kafka.trogdor.workload.PayloadGeneratorTest > testConstantPayloadGenerator STARTED
org.apache.kafka.trogdor.workload.PayloadGeneratorTest > testConstantPayloadGenerator PASSED
org.apache.kafka.trogdor.workload.PayloadGeneratorTest > testSequentialPayloadGenerator STARTED
org.apache.kafka.trogdor.workload.PayloadGeneratorTest > testSequentialPayloadGenerator PASSED
org.apache.kafka.trogdor.workload.PayloadGeneratorTest > testNullPayloadGenerator STARTED
org.apache.kafka.trogdor.workload.PayloadGeneratorTest > testNullPayloadGenerator PASSED
org.apache.kafka.trogdor.workload.PayloadGeneratorTest > testUniformRandomPayloadGenerator STARTED
org.apache.kafka.trogdor.workload.PayloadGeneratorTest > testUniformRandomPayloadGenerator PASSED
org.apache.kafka.trogdor.workload.PayloadGeneratorTest > testPayloadIterator STARTED
org.apache.kafka.trogdor.workload.PayloadGeneratorTest > testPayloadIterator PASSED
org.apache.kafka.trogdor.workload.PayloadGeneratorTest > testUniformRandomPayloadGeneratorPaddingBytes STARTED
org.apache.kafka.trogdor.workload.PayloadGeneratorTest > testUniformRandomPayloadGeneratorPaddingBytes PASSED
org.apache.kafka.trogdor.workload.PayloadGeneratorTest > testRandomComponentPayloadGenerator STARTED
org.apache.kafka.trogdor.workload.PayloadGeneratorTest > testRandomComponentPayloadGenerator PASSED
org.apache.kafka.trogdor.workload.TopicsSpecTest > testPartitionNumbers STARTED
org.apache.kafka.trogdor.workload.TopicsSpecTest > testPartitionNumbers PASSED
org.apache.kafka.trogdor.workload.TopicsSpecTest > testMaterialize STARTED
org.apache.kafka.trogdor.workload.TopicsSpecTest > testMaterialize PASSED
org.apache.kafka.trogdor.workload.TopicsSpecTest > testPartitionsSpec STARTED
org.apache.kafka.trogdor.workload.TopicsSpecTest > testPartitionsSpec PASSED
org.apache.kafka.trogdor.workload.ThrottleTest > testThrottle STARTED
org.apache.kafka.trogdor.workload.ThrottleTest > testThrottle PASSED
org.apache.kafka.trogdor.workload.TimeIntervalTransactionsGeneratorTest > testCommitsTransactionAfterIntervalPasses STARTED
org.apache.kafka.trogdor.workload.TimeIntervalTransactionsGeneratorTest > testCommitsTransactionAfterIntervalPasses PASSED
org.apache.kafka.trogdor.basic.BasicPlatformTest > testCreateBasicPlatform STARTED
org.apache.kafka.trogdor.basic.BasicPlatformTest > testCreateBasicPlatform PASSED
org.apache.kafka.tools.PushHttpMetricsReporterTest > testConfigureClose STARTED
org.apache.kafka.tools.PushHttpMetricsReporterTest > testConfigureClose PASSED
org.apache.kafka.tools.PushHttpMetricsReporterTest > testConfigureBadUrl STARTED
org.apache.kafka.tools.PushHttpMetricsReporterTest > testConfigureBadUrl PASSED
org.apache.kafka.tools.PushHttpMetricsReporterTest > testConfigureMissingPeriod STARTED
org.apache.kafka.tools.PushHttpMetricsReporterTest > testConfigureMissingPeriod PASSED
org.apache.kafka.tools.PushHttpMetricsReporterTest > testNoMetrics STARTED
org.apache.kafka.tools.PushHttpMetricsReporterTest > testNoMetrics PASSED
org.apache.kafka.tools.PushHttpMetricsReporterTest > testClientError STARTED
org.apache.kafka.tools.PushHttpMetricsReporterTest > testClientError PASSED
org.apache.kafka.tools.PushHttpMetricsReporterTest > testServerError STARTED
org.apache.kafka.tools.PushHttpMetricsReporterTest > testServerError PASSED
org.apache.kafka.tools.PushHttpMetricsReporterTest > testMetricValues STARTED
org.apache.kafka.tools.PushHttpMetricsReporterTest > testMetricValues PASSED
FAILURE: Build failed with an exception.
* What went wrong:
Execution failed for task ':connect:runtime:test'.
> There were failing tests. See the report at: file://<https://builds.apache.org/job/kafka-trunk-jdk8/ws/connect/runtime/build/reports/tests/test/index.html>
* Try:
Run with --stacktrace option to get the stack trace. Run with --info or --debug option to get more log output. Run with --scan to get full insights.
* Get more help at https://help.gradle.org
Deprecated Gradle features were used in this build, making it incompatible with Gradle 6.0.
Use '--warning-mode all' to show the individual deprecation warnings.
See https://docs.gradle.org/5.4.1/userguide/command_line_interface.html#sec:command_line_warnings
BUILD FAILED in 3h 15m 17s
182 actionable tasks: 179 executed, 3 up-to-date
Build step 'Execute shell' marked build as failure
[FINDBUGS] Collecting findbugs analysis files...
Setting GRADLE_4_10_3_HOME=/home/jenkins/tools/gradle/4.10.3
[FINDBUGS] Searching for all files in <https://builds.apache.org/job/kafka-trunk-jdk8/ws/> that match the pattern **/build/reports/*bugs/*.xml
[FINDBUGS] Parsing 17 files in <https://builds.apache.org/job/kafka-trunk-jdk8/ws/>
[FINDBUGS] Successfully parsed file <https://builds.apache.org/job/kafka-trunk-jdk8/ws/clients/build/reports/spotbugs/main.xml> with 0 unique warnings and 0 duplicates.
[FINDBUGS] Successfully parsed file <https://builds.apache.org/job/kafka-trunk-jdk8/ws/connect/api/build/reports/spotbugs/main.xml> with 0 unique warnings and 0 duplicates.
[FINDBUGS] Successfully parsed file <https://builds.apache.org/job/kafka-trunk-jdk8/ws/connect/basic-auth-extension/build/reports/spotbugs/main.xml> with 0 unique warnings and 0 duplicates.
[FINDBUGS] Successfully parsed file <https://builds.apache.org/job/kafka-trunk-jdk8/ws/connect/file/build/reports/spotbugs/main.xml> with 0 unique warnings and 0 duplicates.
[FINDBUGS] Successfully parsed file <https://builds.apache.org/job/kafka-trunk-jdk8/ws/connect/json/build/reports/spotbugs/main.xml> with 0 unique warnings and 0 duplicates.
[FINDBUGS] Successfully parsed file <https://builds.apache.org/job/kafka-trunk-jdk8/ws/connect/runtime/build/reports/spotbugs/main.xml> with 0 unique warnings and 0 duplicates.
[FINDBUGS] Successfully parsed file <https://builds.apache.org/job/kafka-trunk-jdk8/ws/connect/transforms/build/reports/spotbugs/main.xml> with 0 unique warnings and 0 duplicates.
[FINDBUGS] Successfully parsed file <https://builds.apache.org/job/kafka-trunk-jdk8/ws/core/build/reports/spotbugs/main.xml> with 0 unique warnings and 0 duplicates.
[FINDBUGS] Successfully parsed file <https://builds.apache.org/job/kafka-trunk-jdk8/ws/examples/build/reports/spotbugs/main.xml> with 0 unique warnings and 0 duplicates.
[FINDBUGS] Successfully parsed file <https://builds.apache.org/job/kafka-trunk-jdk8/ws/generator/build/reports/spotbugs/main.xml> with 0 unique warnings and 0 duplicates.
[FINDBUGS] Successfully parsed file <https://builds.apache.org/job/kafka-trunk-jdk8/ws/jmh-benchmarks/build/reports/spotbugs/main.xml> with 0 unique warnings and 0 duplicates.
[FINDBUGS] Successfully parsed file <https://builds.apache.org/job/kafka-trunk-jdk8/ws/log4j-appender/build/reports/spotbugs/main.xml> with 0 unique warnings and 0 duplicates.
[FINDBUGS] Successfully parsed file <https://builds.apache.org/job/kafka-trunk-jdk8/ws/streams/build/reports/spotbugs/main.xml> with 0 unique warnings and 0 duplicates.
[FINDBUGS] Successfully parsed file <https://builds.apache.org/job/kafka-trunk-jdk8/ws/streams/examples/build/reports/spotbugs/main.xml> with 0 unique warnings and 0 duplicates.
[FINDBUGS] Successfully parsed file <https://builds.apache.org/job/kafka-trunk-jdk8/ws/streams/streams-scala/build/reports/spotbugs/main.xml> with 0 unique warnings and 0 duplicates.
[FINDBUGS] Successfully parsed file <https://builds.apache.org/job/kafka-trunk-jdk8/ws/streams/test-utils/build/reports/spotbugs/main.xml> with 0 unique warnings and 0 duplicates.
[FINDBUGS] Successfully parsed file <https://builds.apache.org/job/kafka-trunk-jdk8/ws/tools/build/reports/spotbugs/main.xml> with 0 unique warnings and 0 duplicates.
Setting GRADLE_4_10_3_HOME=/home/jenkins/tools/gradle/4.10.3
No credentials specified
Setting GRADLE_4_10_3_HOME=/home/jenkins/tools/gradle/4.10.3
<Git Blamer> Using GitBlamer to create author and commit information for all warnings.
<Git Blamer> GIT_COMMIT=c9318ced19c812c90066af468732d8af8d12f890, workspace=<https://builds.apache.org/job/kafka-trunk-jdk8/ws/>
[FINDBUGS] Computing warning deltas based on reference build #3881
Recording test results
Setting GRADLE_4_10_3_HOME=/home/jenkins/tools/gradle/4.10.3
Setting GRADLE_4_10_3_HOME=/home/jenkins/tools/gradle/4.10.3
Not sending mail to unregistered user manikumar.reddy@gmail.com
Not sending mail to unregistered user bill@confluent.io
Not sending mail to unregistered user noreply@github.com
Not sending mail to unregistered user wangguoz@gmail.com