You are viewing a plain text version of this content. The canonical link for it is here.
Posted to builds@cassandra.apache.org by Apache Jenkins Server <je...@builds.apache.org> on 2022/11/29 17:23:39 UTC
Build complete: Cassandra-4.1 #226 [UNSTABLE] b807f97b37933fac251020dbd949ee8ef245b158
-------------------------------------------------------------------------------
Build Cassandra-4.1 #226 Still Unstable
URL: https://ci-cassandra.apache.org/job/Cassandra-4.1/226/
-------------------------------------------------------------------------------
Changes:
No changes
-------------------------------------------------------------------------------
Failed Tests:
5 tests failed.
FAILED: dtest-upgrade.upgrade_tests.upgrade_through_versions_test.TestProtoV4Upgrade_AllVersions_EndsAt_Trunk_HEAD.test_parallel_upgrade
FAILED: org.apache.cassandra.distributed.test.PaxosRepair2Test.paxosRepairHistoryIsntUpdatedInForcedRepair
FAILED: org.apache.cassandra.distributed.test.CASTest.fastReadsAndFailedWrites
FAILED: org.apache.cassandra.utils.LongBloomFilterTest.testConstrained
FAILED: dtest-novnode.cdc_test.TestCDC.test_insertion_and_commitlog_behavior_after_reaching_cdc_total_space
-------------------------------------------------------------------------------
For complete test report and logs see https://nightlies.apache.org/cassandra/Cassandra-4.1/226/