You are viewing a plain text version of this content. The canonical link for it is here.
Posted to issues@flink.apache.org by "Shammon (Jira)" <ji...@apache.org> on 2023/01/19 03:38:00 UTC
[jira] [Updated] (FLINK-30750) CompactActionITCase.testBatchCompact in table store is unstable
[ https://issues.apache.org/jira/browse/FLINK-30750?page=com.atlassian.jira.plugin.system.issuetabpanels:all-tabpanel ]
Shammon updated FLINK-30750:
----------------------------
Description:
https://github.com/apache/flink-table-store/actions/runs/3954989166/jobs/6772877033
2023-01-17T11:45:17.9511390Z [INFO] Results:
2023-01-17T11:45:17.9511641Z [INFO]
2023-01-17T11:45:17.9511838Z [ERROR] Errors:
2023-01-17T11:45:17.9512585Z [ERROR] CompactActionITCase.testBatchCompact » JobExecution Job execution failed.
2023-01-17T11:45:17.9512964Z [INFO]
2023-01-17T11:45:17.9513223Z [ERROR] Tests run: 224, Failures: 0, Errors: 1, Skipped: 4
was:
https://github.com/apache/flink-table-store/actions/runs/3938700717/jobs/6737695722
2023-01-17T11:45:17.9511390Z [INFO] Results:
2023-01-17T11:45:17.9511641Z [INFO]
2023-01-17T11:45:17.9511838Z [ERROR] Errors:
2023-01-17T11:45:17.9512585Z [ERROR] CompactActionITCase.testBatchCompact » JobExecution Job execution failed.
2023-01-17T11:45:17.9512964Z [INFO]
2023-01-17T11:45:17.9513223Z [ERROR] Tests run: 224, Failures: 0, Errors: 1, Skipped: 4
> CompactActionITCase.testBatchCompact in table store is unstable
> ---------------------------------------------------------------
>
> Key: FLINK-30750
> URL: https://issues.apache.org/jira/browse/FLINK-30750
> Project: Flink
> Issue Type: Bug
> Components: Table Store
> Affects Versions: table-store-0.4.0
> Reporter: Shammon
> Priority: Major
>
> https://github.com/apache/flink-table-store/actions/runs/3954989166/jobs/6772877033
> 2023-01-17T11:45:17.9511390Z [INFO] Results:
> 2023-01-17T11:45:17.9511641Z [INFO]
> 2023-01-17T11:45:17.9511838Z [ERROR] Errors:
> 2023-01-17T11:45:17.9512585Z [ERROR] CompactActionITCase.testBatchCompact » JobExecution Job execution failed.
> 2023-01-17T11:45:17.9512964Z [INFO]
> 2023-01-17T11:45:17.9513223Z [ERROR] Tests run: 224, Failures: 0, Errors: 1, Skipped: 4
--
This message was sent by Atlassian Jira
(v8.20.10#820010)