You are viewing a plain text version of this content. The canonical link for it is here.
Posted to dev@sling.apache.org by Apache Jenkins Server <je...@builds.apache.org> on 2014/10/02 22:44:35 UTC

Build failed in Jenkins: sling-oak-it-1.6 #154

See <https://builds.apache.org/job/sling-oak-it-1.6/154/>

------------------------------------------
[...truncated 506 lines...]
[INFO] Copying 3 resources
[INFO] 
[INFO] --- maven-antrun-plugin:1.7:run (check-memory-task) @ org.apache.sling.launchpad.testing ---
[INFO] Executing tasks

main:
     [echo] **************** WARNING (SLING-443/SLING-1782) ******************************
     [echo] On most platforms, you'll get OutOfMemoryErrors when building unless you set
     [echo] on 32bit platforms: MAVEN_OPTS="-Xmx256M -XX:MaxPermSize=256M", see SLING-443
     [echo] on 64bit platforms: MAVEN_OPTS="-Xmx512M -XX:MaxPermSize=512M", see SLING-1782
     [echo] ******************************************************************************
[INFO] Executed tasks
[INFO] 
[INFO] --- build-helper-maven-plugin:1.8:reserve-network-port (reserve-network-port) @ org.apache.sling.launchpad.testing ---
Downloading: http://repo.maven.apache.org/maven2/org/apache/maven/maven-plugin-api/2.0.1/maven-plugin-api-2.0.1.pom
Downloaded: http://repo.maven.apache.org/maven2/org/apache/maven/maven-plugin-api/2.0.1/maven-plugin-api-2.0.1.pom (643 B at 8.2 KB/sec)
Downloading: http://repo.maven.apache.org/maven2/org/apache/maven/maven/2.0.1/maven-2.0.1.pom
Downloaded: http://repo.maven.apache.org/maven2/org/apache/maven/maven/2.0.1/maven-2.0.1.pom (12 KB at 144.0 KB/sec)
[INFO] Reserved port 48694 for http.port
[INFO] Reserved port 58439 for sling.control.port
[INFO] 
[INFO] --- maven-compiler-plugin:3.1:compile (default-compile) @ org.apache.sling.launchpad.testing ---
[INFO] No sources to compile
[INFO] 
[INFO] --- maven-resources-plugin:2.6:testResources (default-testResources) @ org.apache.sling.launchpad.testing ---
[INFO] Using 'UTF-8' encoding to copy filtered resources.
[INFO] Copying 2 resources
[INFO] Copying 3 resources
[INFO] 
[INFO] --- maven-compiler-plugin:3.1:testCompile (default-testCompile) @ org.apache.sling.launchpad.testing ---
[INFO] No sources to compile
[INFO] 
[INFO] --- maven-surefire-plugin:2.17:test (default-test) @ org.apache.sling.launchpad.testing ---
[JENKINS] Recording test results[INFO] 
[INFO] --- animal-sniffer-maven-plugin:1.11:check (default) @ org.apache.sling.launchpad.testing ---
Downloading: http://repo.maven.apache.org/maven2/org/codehaus/mojo/animal-sniffer/1.11/animal-sniffer-1.11.pom

Downloaded: http://repo.maven.apache.org/maven2/org/codehaus/mojo/animal-sniffer/1.11/animal-sniffer-1.11.pom (3 KB at 31.3 KB/sec)
Downloading: http://repo.maven.apache.org/maven2/org/ow2/asm/asm-all/4.0/asm-all-4.0.pom
Downloaded: http://repo.maven.apache.org/maven2/org/ow2/asm/asm-all/4.0/asm-all-4.0.pom (2 KB at 25.3 KB/sec)
Downloading: http://repo.maven.apache.org/maven2/org/ow2/asm/asm-parent/4.0/asm-parent-4.0.pom
Downloaded: http://repo.maven.apache.org/maven2/org/ow2/asm/asm-parent/4.0/asm-parent-4.0.pom (6 KB at 69.7 KB/sec)
Downloading: http://repo.maven.apache.org/maven2/org/codehaus/mojo/java-boot-classpath-detector/1.11/java-boot-classpath-detector-1.11.pom
Downloaded: http://repo.maven.apache.org/maven2/org/codehaus/mojo/java-boot-classpath-detector/1.11/java-boot-classpath-detector-1.11.pom (3 KB at 31.3 KB/sec)
Downloading: http://repo.maven.apache.org/maven2/org/apache/maven/maven-core/2.0.1/maven-core-2.0.1.pom
Downloaded: http://repo.maven.apache.org/maven2/org/apache/maven/maven-core/2.0.1/maven-core-2.0.1.pom (6 KB at 66.2 KB/sec)
Downloading: http://repo.maven.apache.org/maven2/org/apache/maven/maven-settings/2.0.1/maven-settings-2.0.1.pom
Downloaded: http://repo.maven.apache.org/maven2/org/apache/maven/maven-settings/2.0.1/maven-settings-2.0.1.pom (2 KB at 18.1 KB/sec)
Downloading: http://repo.maven.apache.org/maven2/org/apache/maven/maven-model/2.0.1/maven-model-2.0.1.pom
Downloaded: http://repo.maven.apache.org/maven2/org/apache/maven/maven-model/2.0.1/maven-model-2.0.1.pom (3 KB at 31.8 KB/sec)
Downloading: http://repo.maven.apache.org/maven2/org/codehaus/plexus/plexus-utils/1.0.5/plexus-utils-1.0.5.pom
Downloaded: http://repo.maven.apache.org/maven2/org/codehaus/plexus/plexus-utils/1.0.5/plexus-utils-1.0.5.pom (918 B at 11.5 KB/sec)
Downloading: http://repo.maven.apache.org/maven2/org/apache/maven/maven-plugin-parameter-documenter/2.0.1/maven-plugin-parameter-documenter-2.0.1.pom
Downloaded: http://repo.maven.apache.org/maven2/org/apache/maven/maven-plugin-parameter-documenter/2.0.1/maven-plugin-parameter-documenter-2.0.1.pom (2 KB at 20.1 KB/sec)
Downloading: http://repo.maven.apache.org/maven2/org/apache/maven/reporting/maven-reporting-api/2.0.1/maven-reporting-api-2.0.1.pom
Downloaded: http://repo.maven.apache.org/maven2/org/apache/maven/reporting/maven-reporting-api/2.0.1/maven-reporting-api-2.0.1.pom (902 B at 11.3 KB/sec)
Downloading: http://repo.maven.apache.org/maven2/org/apache/maven/reporting/maven-reporting/2.0.1/maven-reporting-2.0.1.pom
Downloaded: http://repo.maven.apache.org/maven2/org/apache/maven/reporting/maven-reporting/2.0.1/maven-reporting-2.0.1.pom (546 B at 1.7 KB/sec)
Downloading: http://repo.maven.apache.org/maven2/org/apache/maven/doxia/doxia-sink-api/1.0-alpha-6/doxia-sink-api-1.0-alpha-6.pom
Downloaded: http://repo.maven.apache.org/maven2/org/apache/maven/doxia/doxia-sink-api/1.0-alpha-6/doxia-sink-api-1.0-alpha-6.pom (386 B at 4.9 KB/sec)
Downloading: http://repo.maven.apache.org/maven2/org/apache/maven/doxia/doxia/1.0-alpha-6/doxia-1.0-alpha-6.pom
Downloaded: http://repo.maven.apache.org/maven2/org/apache/maven/doxia/doxia/1.0-alpha-6/doxia-1.0-alpha-6.pom (4 KB at 11.7 KB/sec)
Downloading: http://repo.maven.apache.org/maven2/org/apache/maven/maven-profile/2.0.1/maven-profile-2.0.1.pom
Downloaded: http://repo.maven.apache.org/maven2/org/apache/maven/maven-profile/2.0.1/maven-profile-2.0.1.pom (2 KB at 18.5 KB/sec)
Downloading: http://repo.maven.apache.org/maven2/org/apache/maven/maven-artifact/2.0.1/maven-artifact-2.0.1.pom
Downloaded: http://repo.maven.apache.org/maven2/org/apache/maven/maven-artifact/2.0.1/maven-artifact-2.0.1.pom (765 B at 9.5 KB/sec)
Downloading: http://repo.maven.apache.org/maven2/org/apache/maven/maven-repository-metadata/2.0.1/maven-repository-metadata-2.0.1.pom
Downloaded: http://repo.maven.apache.org/maven2/org/apache/maven/maven-repository-metadata/2.0.1/maven-repository-metadata-2.0.1.pom (2 KB at 16.6 KB/sec)
Downloading: http://repo.maven.apache.org/maven2/org/apache/maven/maven-error-diagnostics/2.0.1/maven-error-diagnostics-2.0.1.pom
Downloaded: http://repo.maven.apache.org/maven2/org/apache/maven/maven-error-diagnostics/2.0.1/maven-error-diagnostics-2.0.1.pom (854 B at 10.7 KB/sec)
Downloading: http://repo.maven.apache.org/maven2/org/apache/maven/maven-project/2.0.1/maven-project-2.0.1.pom
Downloaded: http://repo.maven.apache.org/maven2/org/apache/maven/maven-project/2.0.1/maven-project-2.0.1.pom (2 KB at 21.1 KB/sec)
Downloading: http://repo.maven.apache.org/maven2/org/apache/maven/maven-artifact-manager/2.0.1/maven-artifact-manager-2.0.1.pom
Downloaded: http://repo.maven.apache.org/maven2/org/apache/maven/maven-artifact-manager/2.0.1/maven-artifact-manager-2.0.1.pom (2 KB at 17.5 KB/sec)
Downloading: http://repo.maven.apache.org/maven2/org/apache/maven/maven-plugin-registry/2.0.1/maven-plugin-registry-2.0.1.pom
Downloaded: http://repo.maven.apache.org/maven2/org/apache/maven/maven-plugin-registry/2.0.1/maven-plugin-registry-2.0.1.pom (2 KB at 17.3 KB/sec)
Downloading: http://repo.maven.apache.org/maven2/org/apache/maven/maven-plugin-descriptor/2.0.1/maven-plugin-descriptor-2.0.1.pom
Downloaded: http://repo.maven.apache.org/maven2/org/apache/maven/maven-plugin-descriptor/2.0.1/maven-plugin-descriptor-2.0.1.pom (2 KB at 19.4 KB/sec)
Downloading: http://repo.maven.apache.org/maven2/org/apache/maven/maven-monitor/2.0.1/maven-monitor-2.0.1.pom
Downloaded: http://repo.maven.apache.org/maven2/org/apache/maven/maven-monitor/2.0.1/maven-monitor-2.0.1.pom (442 B at 5.5 KB/sec)
Downloading: http://repo.maven.apache.org/maven2/org/apache/maven/maven-toolchain/2.2.1/maven-toolchain-2.2.1.pom
Downloaded: http://repo.maven.apache.org/maven2/org/apache/maven/maven-toolchain/2.2.1/maven-toolchain-2.2.1.pom (4 KB at 42.4 KB/sec)
Downloading: http://repo.maven.apache.org/maven2/org/codehaus/mojo/animal-sniffer/1.11/animal-sniffer-1.11.jar
Downloading: http://repo.maven.apache.org/maven2/org/ow2/asm/asm-all/4.0/asm-all-4.0.jar
Downloading: http://repo.maven.apache.org/maven2/org/codehaus/mojo/java-boot-classpath-detector/1.11/java-boot-classpath-detector-1.11.jar
Downloading: http://repo.maven.apache.org/maven2/org/apache/maven/reporting/maven-reporting-api/2.0.1/maven-reporting-api-2.0.1.jar
Downloading: http://repo.maven.apache.org/maven2/org/apache/maven/doxia/doxia-sink-api/1.0-alpha-6/doxia-sink-api-1.0-alpha-6.jar
Downloaded: http://repo.maven.apache.org/maven2/org/codehaus/mojo/java-boot-classpath-detector/1.11/java-boot-classpath-detector-1.11.jar (5 KB at 64.8 KB/sec)
Downloaded: http://repo.maven.apache.org/maven2/org/apache/maven/reporting/maven-reporting-api/2.0.1/maven-reporting-api-2.0.1.jar (6 KB at 69.0 KB/sec)
Downloaded: http://repo.maven.apache.org/maven2/org/apache/maven/doxia/doxia-sink-api/1.0-alpha-6/doxia-sink-api-1.0-alpha-6.jar (4 KB at 37.3 KB/sec)
Downloaded: http://repo.maven.apache.org/maven2/org/codehaus/mojo/animal-sniffer/1.11/animal-sniffer-1.11.jar (32 KB at 279.5 KB/sec)
Downloaded: http://repo.maven.apache.org/maven2/org/ow2/asm/asm-all/4.0/asm-all-4.0.jar (208 KB at 672.4 KB/sec)
[INFO] Checking unresolved references to org.codehaus.mojo.signature:java15:1.0
Downloading: http://repo.maven.apache.org/maven2/org/codehaus/mojo/signature/java15/1.0/java15-1.0.signature
Downloaded: http://repo.maven.apache.org/maven2/org/codehaus/mojo/signature/java15/1.0/java15-1.0.signature (506 KB at 743.1 KB/sec)
[INFO] 
[INFO] --- maven-launchpad-plugin:2.3.0:prepare-package (prepare-package) @ org.apache.sling.launchpad.testing ---
[INFO] Using bundle list file from /home/jenkins/jenkins-slave/maven-repositories/0/org/apache/sling/org.apache.sling.launchpad/7-SNAPSHOT/org.apache.sling.launchpad-7-SNAPSHOT-bundlelist.xml
[INFO] Merging partial bundle list org.apache.sling:org.apache.sling.launchpad.test-bundles:0.0.1-20121112.105235-451
Downloading: http://repository.apache.org/snapshots/org/apache/sling/org.apache.sling.launchpad.test-bundles/0.0.1-SNAPSHOT/org.apache.sling.launchpad.test-bundles-0.0.1-20121112.105235-451-bundlelistconfig.zip
[INFO] Copying base artifact from /home/jenkins/jenkins-slave/maven-repositories/0/org/apache/sling/org.apache.sling.launchpad.base/4.4.1-2.5.2/org.apache.sling.launchpad.base-4.4.1-2.5.2.jar to <https://builds.apache.org/job/sling-oak-it-1.6/ws/launchpad-testing-oak/target/classes/resources/org.apache.sling.launchpad.base.jar.>
[INFO] Copying bundle from /home/jenkins/jenkins-slave/maven-repositories/0/org/slf4j/slf4j-api/1.7.6/slf4j-api-1.7.6.jar to <https://builds.apache.org/job/sling-oak-it-1.6/ws/launchpad-testing-oak/target/classes/resources/bundles/1/slf4j-api-1.7.6.jar>
Downloading: http://repo.maven.apache.org/maven2/org/apache/sling/org.apache.sling.commons.log/4.0.0/org.apache.sling.commons.log-4.0.0.jar
Downloaded: http://repo.maven.apache.org/maven2/org/apache/sling/org.apache.sling.commons.log/4.0.0/org.apache.sling.commons.log-4.0.0.jar (741 KB at 337.9 KB/sec)
[INFO] Copying bundle from /home/jenkins/jenkins-slave/maven-repositories/0/org/apache/sling/org.apache.sling.commons.log/4.0.0/org.apache.sling.commons.log-4.0.0.jar to <https://builds.apache.org/job/sling-oak-it-1.6/ws/launchpad-testing-oak/target/classes/resources/bundles/1/org.apache.sling.commons.log-4.0.0.jar>
Downloading: http://repo.maven.apache.org/maven2/org/apache/sling/org.apache.sling.commons.logservice/1.0.2/org.apache.sling.commons.logservice-1.0.2.jar
Downloaded: http://repo.maven.apache.org/maven2/org/apache/sling/org.apache.sling.commons.logservice/1.0.2/org.apache.sling.commons.logservice-1.0.2.jar (25 KB at 140.5 KB/sec)
[INFO] Copying bundle from /home/jenkins/jenkins-slave/maven-repositories/0/org/apache/sling/org.apache.sling.commons.logservice/1.0.2/org.apache.sling.commons.logservice-1.0.2.jar to <https://builds.apache.org/job/sling-oak-it-1.6/ws/launchpad-testing-oak/target/classes/resources/bundles/1/org.apache.sling.commons.logservice-1.0.2.jar>
Downloading: http://repo.maven.apache.org/maven2/org/slf4j/jcl-over-slf4j/1.7.6/jcl-over-slf4j-1.7.6.jar
Downloaded: http://repo.maven.apache.org/maven2/org/slf4j/jcl-over-slf4j/1.7.6/jcl-over-slf4j-1.7.6.jar (17 KB at 92.7 KB/sec)
[INFO] Copying bundle from /home/jenkins/jenkins-slave/maven-repositories/0/org/slf4j/jcl-over-slf4j/1.7.6/jcl-over-slf4j-1.7.6.jar to <https://builds.apache.org/job/sling-oak-it-1.6/ws/launchpad-testing-oak/target/classes/resources/bundles/1/jcl-over-slf4j-1.7.6.jar>
Downloading: http://repo.maven.apache.org/maven2/org/slf4j/log4j-over-slf4j/1.7.6/log4j-over-slf4j-1.7.6.jar
Downloaded: http://repo.maven.apache.org/maven2/org/slf4j/log4j-over-slf4j/1.7.6/log4j-over-slf4j-1.7.6.jar (23 KB at 110.1 KB/sec)
[INFO] Copying bundle from /home/jenkins/jenkins-slave/maven-repositories/0/org/slf4j/log4j-over-slf4j/1.7.6/log4j-over-slf4j-1.7.6.jar to <https://builds.apache.org/job/sling-oak-it-1.6/ws/launchpad-testing-oak/target/classes/resources/bundles/1/log4j-over-slf4j-1.7.6.jar>
Downloading: http://repo.maven.apache.org/maven2/org/apache/sling/org.apache.sling.settings/1.3.2/org.apache.sling.settings-1.3.2.jar
Downloaded: http://repo.maven.apache.org/maven2/org/apache/sling/org.apache.sling.settings/1.3.2/org.apache.sling.settings-1.3.2.jar (28 KB at 113.6 KB/sec)
[INFO] Copying bundle from /home/jenkins/jenkins-slave/maven-repositories/0/org/apache/sling/org.apache.sling.settings/1.3.2/org.apache.sling.settings-1.3.2.jar to <https://builds.apache.org/job/sling-oak-it-1.6/ws/launchpad-testing-oak/target/classes/resources/bundles/1/org.apache.sling.settings-1.3.2.jar>
Downloading: http://repo.maven.apache.org/maven2/org/apache/sling/org.apache.sling.fragment.xml/1.0.2/org.apache.sling.fragment.xml-1.0.2.jar
Downloaded: http://repo.maven.apache.org/maven2/org/apache/sling/org.apache.sling.fragment.xml/1.0.2/org.apache.sling.fragment.xml-1.0.2.jar (10 KB at 84.1 KB/sec)
[INFO] Copying bundle from /home/jenkins/jenkins-slave/maven-repositories/0/org/apache/sling/org.apache.sling.fragment.xml/1.0.2/org.apache.sling.fragment.xml-1.0.2.jar to <https://builds.apache.org/job/sling-oak-it-1.6/ws/launchpad-testing-oak/target/classes/resources/bundles/1/org.apache.sling.fragment.xml-1.0.2.jar>
Downloading: http://repo.maven.apache.org/maven2/org/apache/sling/org.apache.sling.fragment.transaction/1.0.0/org.apache.sling.fragment.transaction-1.0.0.jar
Downloaded: http://repo.maven.apache.org/maven2/org/apache/sling/org.apache.sling.fragment.transaction/1.0.0/org.apache.sling.fragment.transaction-1.0.0.jar (8 KB at 30.8 KB/sec)
[INFO] Copying bundle from /home/jenkins/jenkins-slave/maven-repositories/0/org/apache/sling/org.apache.sling.fragment.transaction/1.0.0/org.apache.sling.fragment.transaction-1.0.0.jar to <https://builds.apache.org/job/sling-oak-it-1.6/ws/launchpad-testing-oak/target/classes/resources/bundles/1/org.apache.sling.fragment.transaction-1.0.0.jar>
Downloading: http://repo.maven.apache.org/maven2/org/apache/sling/org.apache.sling.javax.activation/0.1.0/org.apache.sling.javax.activation-0.1.0.jar
Downloaded: http://repo.maven.apache.org/maven2/org/apache/sling/org.apache.sling.javax.activation/0.1.0/org.apache.sling.javax.activation-0.1.0.jar (115 KB at 186.1 KB/sec)
[INFO] Copying bundle from /home/jenkins/jenkins-slave/maven-repositories/0/org/apache/sling/org.apache.sling.javax.activation/0.1.0/org.apache.sling.javax.activation-0.1.0.jar to <https://builds.apache.org/job/sling-oak-it-1.6/ws/launchpad-testing-oak/target/classes/resources/bundles/1/org.apache.sling.javax.activation-0.1.0.jar>
Downloading: http://repo.maven.apache.org/maven2/org/apache/sling/org.apache.sling.fragment.ws/1.0.2/org.apache.sling.fragment.ws-1.0.2.jar
Downloaded: http://repo.maven.apache.org/maven2/org/apache/sling/org.apache.sling.fragment.ws/1.0.2/org.apache.sling.fragment.ws-1.0.2.jar (9 KB at 76.1 KB/sec)
[INFO] Copying bundle from /home/jenkins/jenkins-slave/maven-repositories/0/org/apache/sling/org.apache.sling.fragment.ws/1.0.2/org.apache.sling.fragment.ws-1.0.2.jar to <https://builds.apache.org/job/sling-oak-it-1.6/ws/launchpad-testing-oak/target/classes/resources/bundles/1/org.apache.sling.fragment.ws-1.0.2.jar>
Downloading: http://repo.maven.apache.org/maven2/org/apache/sling/org.apache.sling.launchpad.installer/1.2.0/org.apache.sling.launchpad.installer-1.2.0.jar
Downloaded: http://repo.maven.apache.org/maven2/org/apache/sling/org.apache.sling.launchpad.installer/1.2.0/org.apache.sling.launchpad.installer-1.2.0.jar (17 KB at 153.1 KB/sec)
[INFO] Copying bundle from /home/jenkins/jenkins-slave/maven-repositories/0/org/apache/sling/org.apache.sling.launchpad.installer/1.2.0/org.apache.sling.launchpad.installer-1.2.0.jar to <https://builds.apache.org/job/sling-oak-it-1.6/ws/launchpad-testing-oak/target/classes/resources/bundles/1/org.apache.sling.launchpad.installer-1.2.0.jar>
Downloading: http://repo.maven.apache.org/maven2/org/apache/sling/org.apache.sling.installer.core/3.5.2/org.apache.sling.installer.core-3.5.2.jar
Downloaded: http://repo.maven.apache.org/maven2/org/apache/sling/org.apache.sling.installer.core/3.5.2/org.apache.sling.installer.core-3.5.2.jar (144 KB at 157.2 KB/sec)
[INFO] Copying bundle from /home/jenkins/jenkins-slave/maven-repositories/0/org/apache/sling/org.apache.sling.installer.core/3.5.2/org.apache.sling.installer.core-3.5.2.jar to <https://builds.apache.org/job/sling-oak-it-1.6/ws/launchpad-testing-oak/target/classes/resources/bundles/1/org.apache.sling.installer.core-3.5.2.jar>
Downloading: http://repo.maven.apache.org/maven2/org/apache/sling/org.apache.sling.installer.provider.file/1.0.2/org.apache.sling.installer.provider.file-1.0.2.jar
Downloaded: http://repo.maven.apache.org/maven2/org/apache/sling/org.apache.sling.installer.provider.file/1.0.2/org.apache.sling.installer.provider.file-1.0.2.jar (35 KB at 141.4 KB/sec)
[INFO] Copying bundle from /home/jenkins/jenkins-slave/maven-repositories/0/org/apache/sling/org.apache.sling.installer.provider.file/1.0.2/org.apache.sling.installer.provider.file-1.0.2.jar to <https://builds.apache.org/job/sling-oak-it-1.6/ws/launchpad-testing-oak/target/classes/resources/bundles/1/org.apache.sling.installer.provider.file-1.0.2.jar>
Downloading: http://repo.maven.apache.org/maven2/org/apache/felix/org.apache.felix.configadmin/1.6.0/org.apache.felix.configadmin-1.6.0.jar
Downloaded: http://repo.maven.apache.org/maven2/org/apache/felix/org.apache.felix.configadmin/1.6.0/org.apache.felix.configadmin-1.6.0.jar (112 KB at 157.3 KB/sec)
[INFO] Copying bundle from /home/jenkins/jenkins-slave/maven-repositories/0/org/apache/felix/org.apache.felix.configadmin/1.6.0/org.apache.felix.configadmin-1.6.0.jar to <https://builds.apache.org/job/sling-oak-it-1.6/ws/launchpad-testing-oak/target/classes/resources/bundles/1/org.apache.felix.configadmin-1.6.0.jar>
Downloading: http://repo.maven.apache.org/maven2/org/apache/felix/org.apache.felix.eventadmin/1.3.2/org.apache.felix.eventadmin-1.3.2.jar
Downloaded: http://repo.maven.apache.org/maven2/org/apache/felix/org.apache.felix.eventadmin/1.3.2/org.apache.felix.eventadmin-1.3.2.jar (212 KB at 110.8 KB/sec)
[INFO] Copying bundle from /home/jenkins/jenkins-slave/maven-repositories/0/org/apache/felix/org.apache.felix.eventadmin/1.3.2/org.apache.felix.eventadmin-1.3.2.jar to <https://builds.apache.org/job/sling-oak-it-1.6/ws/launchpad-testing-oak/target/classes/resources/bundles/1/org.apache.felix.eventadmin-1.3.2.jar>
[INFO] Copying bundle from /home/jenkins/jenkins-slave/maven-repositories/0/org/apache/felix/org.apache.felix.http.jetty/2.2.2/org.apache.felix.http.jetty-2.2.2.jar to <https://builds.apache.org/job/sling-oak-it-1.6/ws/launchpad-testing-oak/target/classes/resources/bundles/1/org.apache.felix.http.jetty-2.2.2.jar>
[INFO] Copying bundle from /home/jenkins/jenkins-slave/maven-repositories/0/commons-io/commons-io/1.4/commons-io-1.4.jar to <https://builds.apache.org/job/sling-oak-it-1.6/ws/launchpad-testing-oak/target/classes/resources/bundles/0/commons-io-1.4.jar>
Downloading: http://repo.maven.apache.org/maven2/commons-fileupload/commons-fileupload/1.3.1/commons-fileupload-1.3.1.jar
Downloaded: http://repo.maven.apache.org/maven2/commons-fileupload/commons-fileupload/1.3.1/commons-fileupload-1.3.1.jar (68 KB at 164.4 KB/sec)
[INFO] Copying bundle from /home/jenkins/jenkins-slave/maven-repositories/0/commons-fileupload/commons-fileupload/1.3.1/commons-fileupload-1.3.1.jar to <https://builds.apache.org/job/sling-oak-it-1.6/ws/launchpad-testing-oak/target/classes/resources/bundles/0/commons-fileupload-1.3.1.jar>
[INFO] Copying bundle from /home/jenkins/jenkins-slave/maven-repositories/0/commons-collections/commons-collections/3.2.1/commons-collections-3.2.1.jar to <https://builds.apache.org/job/sling-oak-it-1.6/ws/launchpad-testing-oak/target/classes/resources/bundles/0/commons-collections-3.2.1.jar>
Downloading: http://repo.maven.apache.org/maven2/commons-codec/commons-codec/1.9/commons-codec-1.9.jar
Downloaded: http://repo.maven.apache.org/maven2/commons-codec/commons-codec/1.9/commons-codec-1.9.jar (258 KB at 317.1 KB/sec)
[INFO] Copying bundle from /home/jenkins/jenkins-slave/maven-repositories/0/commons-codec/commons-codec/1.9/commons-codec-1.9.jar to <https://builds.apache.org/job/sling-oak-it-1.6/ws/launchpad-testing-oak/target/classes/resources/bundles/0/commons-codec-1.9.jar>
[INFO] Copying bundle from /home/jenkins/jenkins-slave/maven-repositories/0/commons-lang/commons-lang/2.6/commons-lang-2.6.jar to <https://builds.apache.org/job/sling-oak-it-1.6/ws/launchpad-testing-oak/target/classes/resources/bundles/0/commons-lang-2.6.jar>
[INFO] Copying bundle from /home/jenkins/jenkins-slave/maven-repositories/0/org/apache/commons/commons-math/2.2/commons-math-2.2.jar to <https://builds.apache.org/job/sling-oak-it-1.6/ws/launchpad-testing-oak/target/classes/resources/bundles/0/commons-math-2.2.jar>
Downloading: http://repo.maven.apache.org/maven2/commons-pool/commons-pool/1.6/commons-pool-1.6.jar
Downloaded: http://repo.maven.apache.org/maven2/commons-pool/commons-pool/1.6/commons-pool-1.6.jar (109 KB at 201.7 KB/sec)
[INFO] Copying bundle from /home/jenkins/jenkins-slave/maven-repositories/0/commons-pool/commons-pool/1.6/commons-pool-1.6.jar to <https://builds.apache.org/job/sling-oak-it-1.6/ws/launchpad-testing-oak/target/classes/resources/bundles/0/commons-pool-1.6.jar>
Downloading: http://repo.maven.apache.org/maven2/org/apache/servicemix/bundles/org.apache.servicemix.bundles.concurrent/1.3.4_1/org.apache.servicemix.bundles.concurrent-1.3.4_1.jar
Downloaded: http://repo.maven.apache.org/maven2/org/apache/servicemix/bundles/org.apache.servicemix.bundles.concurrent/1.3.4_1/org.apache.servicemix.bundles.concurrent-1.3.4_1.jar (809 KB at 231.0 KB/sec)
[INFO] Copying bundle from /home/jenkins/jenkins-slave/maven-repositories/0/org/apache/servicemix/bundles/org.apache.servicemix.bundles.concurrent/1.3.4_1/org.apache.servicemix.bundles.concurrent-1.3.4_1.jar to <https://builds.apache.org/job/sling-oak-it-1.6/ws/launchpad-testing-oak/target/classes/resources/bundles/0/org.apache.servicemix.bundles.concurrent-1.3.4_1.jar>
Downloading: http://repo.maven.apache.org/maven2/org/apache/geronimo/bundles/commons-httpclient/3.1_1/commons-httpclient-3.1_1.jar
Downloaded: http://repo.maven.apache.org/maven2/org/apache/geronimo/bundles/commons-httpclient/3.1_1/commons-httpclient-3.1_1.jar (305 KB at 205.7 KB/sec)
[INFO] Copying bundle from /home/jenkins/jenkins-slave/maven-repositories/0/org/apache/geronimo/bundles/commons-httpclient/3.1_1/commons-httpclient-3.1_1.jar to <https://builds.apache.org/job/sling-oak-it-1.6/ws/launchpad-testing-oak/target/classes/resources/bundles/0/commons-httpclient-3.1_1.jar>
Downloading: http://repo.maven.apache.org/maven2/org/apache/sling/org.apache.sling.commons.osgi/2.2.0/org.apache.sling.commons.osgi-2.2.0.jar
Downloaded: http://repo.maven.apache.org/maven2/org/apache/sling/org.apache.sling.commons.osgi/2.2.0/org.apache.sling.commons.osgi-2.2.0.jar (26 KB at 180.0 KB/sec)
[INFO] Copying bundle from /home/jenkins/jenkins-slave/maven-repositories/0/org/apache/sling/org.apache.sling.commons.osgi/2.2.0/org.apache.sling.commons.osgi-2.2.0.jar to <https://builds.apache.org/job/sling-oak-it-1.6/ws/launchpad-testing-oak/target/classes/resources/bundles/0/org.apache.sling.commons.osgi-2.2.0.jar>
Downloading: http://repository.apache.org/snapshots/org/apache/sling/org.apache.sling.commons.mime/2.1.5-SNAPSHOT/maven-metadata.xml
Downloaded: http://repository.apache.org/snapshots/org/apache/sling/org.apache.sling.commons.mime/2.1.5-SNAPSHOT/maven-metadata.xml (1021 B at 0.9 KB/sec)
Downloading: http://repository.apache.org/snapshots/org/apache/sling/org.apache.sling.commons.mime/2.1.5-SNAPSHOT/org.apache.sling.commons.mime-2.1.5-20121112.103101-1145.jar
Downloaded: http://repository.apache.org/snapshots/org/apache/sling/org.apache.sling.commons.mime/2.1.5-SNAPSHOT/org.apache.sling.commons.mime-2.1.5-20121112.103101-1145.jar (36 KB at 126.8 KB/sec)
[INFO] Copying bundle from /home/jenkins/jenkins-slave/maven-repositories/0/org/apache/sling/org.apache.sling.commons.mime/2.1.5-SNAPSHOT/org.apache.sling.commons.mime-2.1.5-SNAPSHOT.jar to <https://builds.apache.org/job/sling-oak-it-1.6/ws/launchpad-testing-oak/target/classes/resources/bundles/0/org.apache.sling.commons.mime-2.1.5-SNAPSHOT.jar>
Downloading: http://repo.maven.apache.org/maven2/org/apache/sling/org.apache.sling.commons.classloader/1.3.2/org.apache.sling.commons.classloader-1.3.2.jar
Downloaded: http://repo.maven.apache.org/maven2/org/apache/sling/org.apache.sling.commons.classloader/1.3.2/org.apache.sling.commons.classloader-1.3.2.jar (23 KB at 162.5 KB/sec)
[INFO] Copying bundle from /home/jenkins/jenkins-slave/maven-repositories/0/org/apache/sling/org.apache.sling.commons.classloader/1.3.2/org.apache.sling.commons.classloader-1.3.2.jar to <https://builds.apache.org/job/sling-oak-it-1.6/ws/launchpad-testing-oak/target/classes/resources/bundles/0/org.apache.sling.commons.classloader-1.3.2.jar>
Downloading: http://repo.maven.apache.org/maven2/org/apache/sling/org.apache.sling.commons.compiler/2.2.0/org.apache.sling.commons.compiler-2.2.0.jar
Downloaded: http://repo.maven.apache.org/maven2/org/apache/sling/org.apache.sling.commons.compiler/2.2.0/org.apache.sling.commons.compiler-2.2.0.jar (2159 KB at 261.7 KB/sec)
[INFO] Copying bundle from /home/jenkins/jenkins-slave/maven-repositories/0/org/apache/sling/org.apache.sling.commons.compiler/2.2.0/org.apache.sling.commons.compiler-2.2.0.jar to <https://builds.apache.org/job/sling-oak-it-1.6/ws/launchpad-testing-oak/target/classes/resources/bundles/0/org.apache.sling.commons.compiler-2.2.0.jar>
Downloading: http://repo.maven.apache.org/maven2/org/apache/sling/org.apache.sling.commons.scheduler/2.4.2/org.apache.sling.commons.scheduler-2.4.2.jar
Downloaded: http://repo.maven.apache.org/maven2/org/apache/sling/org.apache.sling.commons.scheduler/2.4.2/org.apache.sling.commons.scheduler-2.4.2.jar (629 KB at 262.6 KB/sec)
[INFO] Copying bundle from /home/jenkins/jenkins-slave/maven-repositories/0/org/apache/sling/org.apache.sling.commons.scheduler/2.4.2/org.apache.sling.commons.scheduler-2.4.2.jar to <https://builds.apache.org/job/sling-oak-it-1.6/ws/launchpad-testing-oak/target/classes/resources/bundles/0/org.apache.sling.commons.scheduler-2.4.2.jar>
Downloading: http://repo.maven.apache.org/maven2/org/apache/sling/org.apache.sling.commons.threads/3.2.0/org.apache.sling.commons.threads-3.2.0.jar
Downloaded: http://repo.maven.apache.org/maven2/org/apache/sling/org.apache.sling.commons.threads/3.2.0/org.apache.sling.commons.threads-3.2.0.jar (36 KB at 169.0 KB/sec)
[INFO] Copying bundle from /home/jenkins/jenkins-slave/maven-repositories/0/org/apache/sling/org.apache.sling.commons.threads/3.2.0/org.apache.sling.commons.threads-3.2.0.jar to <https://builds.apache.org/job/sling-oak-it-1.6/ws/launchpad-testing-oak/target/classes/resources/bundles/0/org.apache.sling.commons.threads-3.2.0.jar>
Downloading: http://repo.maven.apache.org/maven2/org/apache/sling/org.apache.sling.discovery.api/1.0.0/org.apache.sling.discovery.api-1.0.0.jar
Downloaded: http://repo.maven.apache.org/maven2/org/apache/sling/org.apache.sling.discovery.api/1.0.0/org.apache.sling.discovery.api-1.0.0.jar (13 KB at 90.7 KB/sec)
[INFO] Copying bundle from /home/jenkins/jenkins-slave/maven-repositories/0/org/apache/sling/org.apache.sling.discovery.api/1.0.0/org.apache.sling.discovery.api-1.0.0.jar to <https://builds.apache.org/job/sling-oak-it-1.6/ws/launchpad-testing-oak/target/classes/resources/bundles/0/org.apache.sling.discovery.api-1.0.0.jar>
Downloading: http://repo.maven.apache.org/maven2/org/apache/sling/org.apache.sling.discovery.support/1.0.0/org.apache.sling.discovery.support-1.0.0.jar
Downloaded: http://repo.maven.apache.org/maven2/org/apache/sling/org.apache.sling.discovery.support/1.0.0/org.apache.sling.discovery.support-1.0.0.jar (13 KB at 121.2 KB/sec)
[INFO] Copying bundle from /home/jenkins/jenkins-slave/maven-repositories/0/org/apache/sling/org.apache.sling.discovery.support/1.0.0/org.apache.sling.discovery.support-1.0.0.jar to <https://builds.apache.org/job/sling-oak-it-1.6/ws/launchpad-testing-oak/target/classes/resources/bundles/0/org.apache.sling.discovery.support-1.0.0.jar>
Downloading: http://repo.maven.apache.org/maven2/org/apache/sling/org.apache.sling.discovery.impl/1.0.8/org.apache.sling.discovery.impl-1.0.8.jar
Downloaded: http://repo.maven.apache.org/maven2/org/apache/sling/org.apache.sling.discovery.impl/1.0.8/org.apache.sling.discovery.impl-1.0.8.jar (142 KB at 219.4 KB/sec)
[INFO] Copying bundle from /home/jenkins/jenkins-slave/maven-repositories/0/org/apache/sling/org.apache.sling.discovery.impl/1.0.8/org.apache.sling.discovery.impl-1.0.8.jar to <https://builds.apache.org/job/sling-oak-it-1.6/ws/launchpad-testing-oak/target/classes/resources/bundles/0/org.apache.sling.discovery.impl-1.0.8.jar>
Downloading: http://repo.maven.apache.org/maven2/org/apache/sling/org.apache.sling.event/3.3.10/org.apache.sling.event-3.3.10.jar
Downloaded: http://repo.maven.apache.org/maven2/org/apache/sling/org.apache.sling.event/3.3.10/org.apache.sling.event-3.3.10.jar (314 KB at 272.8 KB/sec)
[INFO] Copying bundle from /home/jenkins/jenkins-slave/maven-repositories/0/org/apache/sling/org.apache.sling.event/3.3.10/org.apache.sling.event-3.3.10.jar to <https://builds.apache.org/job/sling-oak-it-1.6/ws/launchpad-testing-oak/target/classes/resources/bundles/0/org.apache.sling.event-3.3.10.jar>
Downloading: http://repo.maven.apache.org/maven2/org/apache/sling/org.apache.sling.api/2.7.0/org.apache.sling.api-2.7.0.jar
Downloaded: http://repo.maven.apache.org/maven2/org/apache/sling/org.apache.sling.api/2.7.0/org.apache.sling.api-2.7.0.jar (85 KB at 246.6 KB/sec)
[INFO] Copying bundle from /home/jenkins/jenkins-slave/maven-repositories/0/org/apache/sling/org.apache.sling.api/2.7.0/org.apache.sling.api-2.7.0.jar to <https://builds.apache.org/job/sling-oak-it-1.6/ws/launchpad-testing-oak/target/classes/resources/bundles/0/org.apache.sling.api-2.7.0.jar>
Downloading: http://repo.maven.apache.org/maven2/org/apache/sling/org.apache.sling.serviceusermapper/1.0.2/org.apache.sling.serviceusermapper-1.0.2.jar
Downloaded: http://repo.maven.apache.org/maven2/org/apache/sling/org.apache.sling.serviceusermapper/1.0.2/org.apache.sling.serviceusermapper-1.0.2.jar (20 KB at 97.1 KB/sec)
[INFO] Copying bundle from /home/jenkins/jenkins-slave/maven-repositories/0/org/apache/sling/org.apache.sling.serviceusermapper/1.0.2/org.apache.sling.serviceusermapper-1.0.2.jar to <https://builds.apache.org/job/sling-oak-it-1.6/ws/launchpad-testing-oak/target/classes/resources/bundles/0/org.apache.sling.serviceusermapper-1.0.2.jar>
Downloading: http://repository.apache.org/snapshots/org/apache/sling/org.apache.sling.resourceresolver/1.1.1-SNAPSHOT/maven-metadata.xml
Downloaded: http://repository.apache.org/snapshots/org/apache/sling/org.apache.sling.resourceresolver/1.1.1-SNAPSHOT/maven-metadata.xml (1013 B at 1.8 KB/sec)
Downloading: http://repository.apache.org/snapshots/org/apache/sling/org.apache.sling.resourceresolver/1.1.1-SNAPSHOT/org.apache.sling.resourceresolver-1.1.1-20140911.112349-1.jar
Downloaded: http://repository.apache.org/snapshots/org/apache/sling/org.apache.sling.resourceresolver/1.1.1-SNAPSHOT/org.apache.sling.resourceresolver-1.1.1-20140911.112349-1.jar (138 KB at 363.5 KB/sec)
[INFO] Copying bundle from /home/jenkins/jenkins-slave/maven-repositories/0/org/apache/sling/org.apache.sling.resourceresolver/1.1.1-SNAPSHOT/org.apache.sling.resourceresolver-1.1.1-SNAPSHOT.jar to <https://builds.apache.org/job/sling-oak-it-1.6/ws/launchpad-testing-oak/target/classes/resources/bundles/0/org.apache.sling.resourceresolver-1.1.1-SNAPSHOT.jar>
Downloading: http://repository.apache.org/snapshots/org/apache/sling/org.apache.sling.auth.core/1.1.7-SNAPSHOT/maven-metadata.xml
Downloaded: http://repository.apache.org/snapshots/org/apache/sling/org.apache.sling.auth.core/1.1.7-SNAPSHOT/maven-metadata.xml (1006 B at 22.8 KB/sec)
Downloading: http://repository.apache.org/snapshots/org/apache/sling/org.apache.sling.auth.core/1.1.7-SNAPSHOT/org.apache.sling.auth.core-1.1.7-20140211.135224-1.jar
Downloaded: http://repository.apache.org/snapshots/org/apache/sling/org.apache.sling.auth.core/1.1.7-SNAPSHOT/org.apache.sling.auth.core-1.1.7-20140211.135224-1.jar (85 KB at 1437.5 KB/sec)
[INFO] Copying bundle from /home/jenkins/jenkins-slave/maven-repositories/0/org/apache/sling/org.apache.sling.auth.core/1.1.7-SNAPSHOT/org.apache.sling.auth.core-1.1.7-SNAPSHOT.jar to <https://builds.apache.org/job/sling-oak-it-1.6/ws/launchpad-testing-oak/target/classes/resources/bundles/0/org.apache.sling.auth.core-1.1.7-SNAPSHOT.jar>
Downloading: http://repository.apache.org/snapshots/org/apache/sling/org.apache.sling.engine/2.3.5-SNAPSHOT/maven-metadata.xml
Downloading: http://repository.apache.org/snapshots/org/apache/sling/org.apache.sling.engine/2.3.5-SNAPSHOT/org.apache.sling.engine-2.3.5-SNAPSHOT.jar
[JENKINS] Archiving disabled
[INFO] ------------------------------------------------------------------------
[INFO] BUILD FAILURE
[INFO] ------------------------------------------------------------------------
[INFO] Total time: 1:29.086s
[INFO] Finished at: Thu Oct 02 20:44:31 UTC 2014
[INFO] Final Memory: 16M/87M
[INFO] ------------------------------------------------------------------------
[JENKINS] Archiving disabled
Waiting for Jenkins to finish collecting data
[ERROR] Failed to execute goal org.apache.sling:maven-launchpad-plugin:2.3.0:prepare-package (prepare-package) on project org.apache.sling.launchpad.testing: Unable to find artifact. Could not find artifact org.apache.sling:org.apache.sling.engine:jar:2.3.5-SNAPSHOT in Nexus (http://repository.apache.org/snapshots)
[ERROR] 
[ERROR] Try downloading the file manually from the project website.
[ERROR] 
[ERROR] Then, install it using the command:
[ERROR] mvn install:install-file -DgroupId=org.apache.sling -DartifactId=org.apache.sling.engine -Dversion=2.3.5-SNAPSHOT -Dpackaging=jar -Dfile=/path/to/file
[ERROR] 
[ERROR] Alternatively, if you host your own repository you can deploy the file there:
[ERROR] mvn deploy:deploy-file -DgroupId=org.apache.sling -DartifactId=org.apache.sling.engine -Dversion=2.3.5-SNAPSHOT -Dpackaging=jar -Dfile=/path/to/file -Durl=[url] -DrepositoryId=[id]
[ERROR] 
[ERROR] 
[ERROR] org.apache.sling:org.apache.sling.engine:jar:2.3.5-SNAPSHOT
[ERROR] 
[ERROR] from the specified remote repositories:
[ERROR] Nexus (http://repository.apache.org/snapshots, releases=false, snapshots=true),
[ERROR] central (http://repo.maven.apache.org/maven2, releases=true, snapshots=false)
[ERROR] -> [Help 1]
[ERROR] 
[ERROR] To see the full stack trace of the errors, re-run Maven with the -e switch.
[ERROR] Re-run Maven using the -X switch to enable full debug logging.
[ERROR] 
[ERROR] For more information about the errors and possible solutions, please read the following articles:
[ERROR] [Help 1] http://cwiki.apache.org/confluence/display/MAVEN/MojoExecutionException
Sending e-mails to: dev@sling.apache.org
channel stopped

Jenkins build is still unstable: sling-oak-it-1.6 #170

Posted by Apache Jenkins Server <je...@builds.apache.org>.
See <https://builds.apache.org/job/sling-oak-it-1.6/changes>


Jenkins build is still unstable: sling-oak-it-1.6 #169

Posted by Apache Jenkins Server <je...@builds.apache.org>.
See <https://builds.apache.org/job/sling-oak-it-1.6/changes>


Jenkins build is still unstable: sling-oak-it-1.6 #168

Posted by Apache Jenkins Server <je...@builds.apache.org>.
See <https://builds.apache.org/job/sling-oak-it-1.6/168/>


Jenkins build is unstable: sling-oak-it-1.6 #167

Posted by Apache Jenkins Server <je...@builds.apache.org>.
See <https://builds.apache.org/job/sling-oak-it-1.6/167/>


Build failed in Jenkins: sling-oak-it-1.6 #166

Posted by Apache Jenkins Server <je...@builds.apache.org>.
See <https://builds.apache.org/job/sling-oak-it-1.6/166/>

------------------------------------------
Started by upstream project "sling-trunk-1.6" build number 2603
originally caused by:
 Started by an SCM change
Building remotely on ubuntu-6 (docker Ubuntu ubuntu) in workspace <https://builds.apache.org/job/sling-oak-it-1.6/ws/>
Updating http://svn.apache.org/repos/asf/sling/trunk/launchpad/testing at revision '2014-10-08T14:38:18.985 +0000'
At revision 1630122
no change for http://svn.apache.org/repos/asf/sling/trunk/launchpad/testing since the previous build
Parsing POMs
maven3-agent.jar already up to date
maven3-interceptor.jar already up to date
maven3-interceptor-commons.jar already up to date
[launchpad-testing-oak] $ /home/jenkins/tools/java/latest1.6/bin/java -Xmx512M -XX:MaxPermSize=256M -enableassertions -cp /home/jenkins/jenkins-slave/maven3-agent.jar:/home/jenkins/jenkins-slave/tools/hudson.tasks.Maven_MavenInstallation/Maven_3.0.5/boot/plexus-classworlds-2.4.jar org.jvnet.hudson.maven3.agent.Maven3Main /home/jenkins/jenkins-slave/tools/hudson.tasks.Maven_MavenInstallation/Maven_3.0.5 /home/jenkins/jenkins-slave/slave.jar /home/jenkins/jenkins-slave/maven3-interceptor.jar /home/jenkins/jenkins-slave/maven3-interceptor-commons.jar 49093
<===[JENKINS REMOTING CAPACITY]===>   channel started
log4j:WARN No appenders could be found for logger (org.apache.commons.beanutils.converters.BooleanConverter).
log4j:WARN Please initialize the log4j system properly.
Executing Maven:  -B -f <https://builds.apache.org/job/sling-oak-it-1.6/ws/launchpad-testing-oak/pom.xml> -Dmaven.repo.local=/home/jenkins/jenkins-slave/maven-repositories/1 clean install -Dsling.run.modes=oak
[INFO] Scanning for projects...
[INFO]                                                                         
[INFO] ------------------------------------------------------------------------
[INFO] Building Apache Sling Launchpad Testing 7-SNAPSHOT
[INFO] ------------------------------------------------------------------------
Downloading: http://repository.apache.org/snapshots/org/apache/sling/org.apache.sling.launchpad.integration-tests/1.0.1-SNAPSHOT/maven-metadata.xml
Downloaded: http://repository.apache.org/snapshots/org/apache/sling/org.apache.sling.launchpad.integration-tests/1.0.1-SNAPSHOT/maven-metadata.xml (2 KB at 4.8 KB/sec)
Downloading: http://repository.apache.org/snapshots/org/apache/sling/org.apache.sling.commons.testing/2.0.15-SNAPSHOT/maven-metadata.xml
Downloaded: http://repository.apache.org/snapshots/org/apache/sling/org.apache.sling.commons.testing/2.0.15-SNAPSHOT/maven-metadata.xml (1016 B at 12.1 KB/sec)
Downloading: http://repository.apache.org/snapshots/org/apache/sling/org.apache.sling.junit.remote/1.0.9-SNAPSHOT/maven-metadata.xml
Downloaded: http://repository.apache.org/snapshots/org/apache/sling/org.apache.sling.junit.remote/1.0.9-SNAPSHOT/maven-metadata.xml (2 KB at 9.7 KB/sec)
Downloading: http://repository.apache.org/snapshots/org/apache/sling/org.apache.sling.launchpad.test-bundles/0.0.1-SNAPSHOT/maven-metadata.xml
Downloaded: http://repository.apache.org/snapshots/org/apache/sling/org.apache.sling.launchpad.test-bundles/0.0.1-SNAPSHOT/maven-metadata.xml (2 KB at 3.8 KB/sec)
Downloading: http://repository.apache.org/snapshots/org/apache/sling/org.apache.sling.launchpad/7-SNAPSHOT/maven-metadata.xml
[INFO] 
[INFO] --- maven-clean-plugin:2.5:clean (default-clean) @ org.apache.sling.launchpad.testing ---
[INFO] Deleting <https://builds.apache.org/job/sling-oak-it-1.6/ws/launchpad-testing-oak/target>
[INFO] Deleting <https://builds.apache.org/job/sling-oak-it-1.6/ws/launchpad-testing-oak> (includes = [derby.log, cachedir, sling/**, jackrabbit, coverage.ec], excludes = [])
[INFO] 
[INFO] --- maven-enforcer-plugin:1.3.1:enforce (enforce-java) @ org.apache.sling.launchpad.testing ---
[INFO] 
[INFO] --- maven-antrun-plugin:1.7:run (set-bundle-required-execution-environment) @ org.apache.sling.launchpad.testing ---
[INFO] Executing tasks

main:
[INFO] Executed tasks
[INFO] 
[INFO] --- maven-remote-resources-plugin:1.5:process (default) @ org.apache.sling.launchpad.testing ---
[INFO] 
[INFO] --- maven-resources-plugin:2.6:resources (default-resources) @ org.apache.sling.launchpad.testing ---
[INFO] Using 'UTF-8' encoding to copy filtered resources.
[INFO] Copying 1 resource
[INFO] Copying 3 resources
[INFO] 
[INFO] --- maven-antrun-plugin:1.7:run (check-memory-task) @ org.apache.sling.launchpad.testing ---
[INFO] Executing tasks

main:
     [echo] **************** WARNING (SLING-443/SLING-1782) ******************************
     [echo] On most platforms, you'll get OutOfMemoryErrors when building unless you set
     [echo] on 32bit platforms: MAVEN_OPTS="-Xmx256M -XX:MaxPermSize=256M", see SLING-443
     [echo] on 64bit platforms: MAVEN_OPTS="-Xmx512M -XX:MaxPermSize=512M", see SLING-1782
     [echo] ******************************************************************************
[INFO] Executed tasks
[INFO] 
[INFO] --- build-helper-maven-plugin:1.8:reserve-network-port (reserve-network-port) @ org.apache.sling.launchpad.testing ---
[INFO] Reserved port 59701 for http.port
[INFO] Reserved port 43726 for sling.control.port
[INFO] 
[INFO] --- maven-compiler-plugin:3.1:compile (default-compile) @ org.apache.sling.launchpad.testing ---
[INFO] No sources to compile
[INFO] 
[INFO] --- maven-resources-plugin:2.6:testResources (default-testResources) @ org.apache.sling.launchpad.testing ---
[INFO] Using 'UTF-8' encoding to copy filtered resources.
[INFO] Copying 2 resources
[INFO] Copying 3 resources
[INFO] 
[INFO] --- maven-compiler-plugin:3.1:testCompile (default-testCompile) @ org.apache.sling.launchpad.testing ---
[INFO] No sources to compile
[INFO] 
[INFO] --- maven-surefire-plugin:2.17:test (default-test) @ org.apache.sling.launchpad.testing ---
[JENKINS] Recording test results[INFO] 
[INFO] --- animal-sniffer-maven-plugin:1.11:check (default) @ org.apache.sling.launchpad.testing ---

[INFO] Checking unresolved references to org.codehaus.mojo.signature:java15:1.0
[INFO] 
[INFO] --- maven-launchpad-plugin:2.3.0:prepare-package (prepare-package) @ org.apache.sling.launchpad.testing ---
[INFO] Using bundle list file from /home/jenkins/jenkins-slave/maven-repositories/1/org/apache/sling/org.apache.sling.launchpad/7-SNAPSHOT/org.apache.sling.launchpad-7-SNAPSHOT-bundlelist.xml
[INFO] Merging partial bundle list org.apache.sling:org.apache.sling.launchpad.test-bundles:0.0.1-SNAPSHOT
Downloading: http://repository.apache.org/snapshots/org/apache/sling/org.apache.sling.launchpad.test-bundles/0.0.1-SNAPSHOT/org.apache.sling.launchpad.test-bundles-0.0.1-SNAPSHOT-bundlelistconfig.zip
[INFO] Copying base artifact from /home/jenkins/jenkins-slave/maven-repositories/1/org/apache/sling/org.apache.sling.launchpad.base/4.4.1-2.5.2/org.apache.sling.launchpad.base-4.4.1-2.5.2.jar to <https://builds.apache.org/job/sling-oak-it-1.6/ws/launchpad-testing-oak/target/classes/resources/org.apache.sling.launchpad.base.jar.>
[INFO] Copying bundle from /home/jenkins/jenkins-slave/maven-repositories/1/org/slf4j/slf4j-api/1.7.6/slf4j-api-1.7.6.jar to <https://builds.apache.org/job/sling-oak-it-1.6/ws/launchpad-testing-oak/target/classes/resources/bundles/1/slf4j-api-1.7.6.jar>
[INFO] Copying bundle from /home/jenkins/jenkins-slave/maven-repositories/1/org/apache/sling/org.apache.sling.commons.log/4.0.0/org.apache.sling.commons.log-4.0.0.jar to <https://builds.apache.org/job/sling-oak-it-1.6/ws/launchpad-testing-oak/target/classes/resources/bundles/1/org.apache.sling.commons.log-4.0.0.jar>
[INFO] Copying bundle from /home/jenkins/jenkins-slave/maven-repositories/1/org/apache/sling/org.apache.sling.commons.logservice/1.0.2/org.apache.sling.commons.logservice-1.0.2.jar to <https://builds.apache.org/job/sling-oak-it-1.6/ws/launchpad-testing-oak/target/classes/resources/bundles/1/org.apache.sling.commons.logservice-1.0.2.jar>
[INFO] Copying bundle from /home/jenkins/jenkins-slave/maven-repositories/1/org/slf4j/jcl-over-slf4j/1.7.6/jcl-over-slf4j-1.7.6.jar to <https://builds.apache.org/job/sling-oak-it-1.6/ws/launchpad-testing-oak/target/classes/resources/bundles/1/jcl-over-slf4j-1.7.6.jar>
[INFO] Copying bundle from /home/jenkins/jenkins-slave/maven-repositories/1/org/slf4j/log4j-over-slf4j/1.7.6/log4j-over-slf4j-1.7.6.jar to <https://builds.apache.org/job/sling-oak-it-1.6/ws/launchpad-testing-oak/target/classes/resources/bundles/1/log4j-over-slf4j-1.7.6.jar>
[INFO] Copying bundle from /home/jenkins/jenkins-slave/maven-repositories/1/org/apache/sling/org.apache.sling.settings/1.3.2/org.apache.sling.settings-1.3.2.jar to <https://builds.apache.org/job/sling-oak-it-1.6/ws/launchpad-testing-oak/target/classes/resources/bundles/1/org.apache.sling.settings-1.3.2.jar>
[INFO] Copying bundle from /home/jenkins/jenkins-slave/maven-repositories/1/org/apache/sling/org.apache.sling.fragment.xml/1.0.2/org.apache.sling.fragment.xml-1.0.2.jar to <https://builds.apache.org/job/sling-oak-it-1.6/ws/launchpad-testing-oak/target/classes/resources/bundles/1/org.apache.sling.fragment.xml-1.0.2.jar>
[INFO] Copying bundle from /home/jenkins/jenkins-slave/maven-repositories/1/org/apache/sling/org.apache.sling.fragment.transaction/1.0.0/org.apache.sling.fragment.transaction-1.0.0.jar to <https://builds.apache.org/job/sling-oak-it-1.6/ws/launchpad-testing-oak/target/classes/resources/bundles/1/org.apache.sling.fragment.transaction-1.0.0.jar>
[INFO] Copying bundle from /home/jenkins/jenkins-slave/maven-repositories/1/org/apache/sling/org.apache.sling.javax.activation/0.1.0/org.apache.sling.javax.activation-0.1.0.jar to <https://builds.apache.org/job/sling-oak-it-1.6/ws/launchpad-testing-oak/target/classes/resources/bundles/1/org.apache.sling.javax.activation-0.1.0.jar>
[INFO] Copying bundle from /home/jenkins/jenkins-slave/maven-repositories/1/org/apache/sling/org.apache.sling.fragment.ws/1.0.2/org.apache.sling.fragment.ws-1.0.2.jar to <https://builds.apache.org/job/sling-oak-it-1.6/ws/launchpad-testing-oak/target/classes/resources/bundles/1/org.apache.sling.fragment.ws-1.0.2.jar>
[INFO] Copying bundle from /home/jenkins/jenkins-slave/maven-repositories/1/org/apache/sling/org.apache.sling.launchpad.installer/1.2.0/org.apache.sling.launchpad.installer-1.2.0.jar to <https://builds.apache.org/job/sling-oak-it-1.6/ws/launchpad-testing-oak/target/classes/resources/bundles/1/org.apache.sling.launchpad.installer-1.2.0.jar>
[INFO] Copying bundle from /home/jenkins/jenkins-slave/maven-repositories/1/org/apache/sling/org.apache.sling.installer.core/3.5.2/org.apache.sling.installer.core-3.5.2.jar to <https://builds.apache.org/job/sling-oak-it-1.6/ws/launchpad-testing-oak/target/classes/resources/bundles/1/org.apache.sling.installer.core-3.5.2.jar>
[INFO] Copying bundle from /home/jenkins/jenkins-slave/maven-repositories/1/org/apache/sling/org.apache.sling.installer.provider.file/1.0.2/org.apache.sling.installer.provider.file-1.0.2.jar to <https://builds.apache.org/job/sling-oak-it-1.6/ws/launchpad-testing-oak/target/classes/resources/bundles/1/org.apache.sling.installer.provider.file-1.0.2.jar>
[INFO] Copying bundle from /home/jenkins/jenkins-slave/maven-repositories/1/org/apache/felix/org.apache.felix.configadmin/1.6.0/org.apache.felix.configadmin-1.6.0.jar to <https://builds.apache.org/job/sling-oak-it-1.6/ws/launchpad-testing-oak/target/classes/resources/bundles/1/org.apache.felix.configadmin-1.6.0.jar>
[INFO] Copying bundle from /home/jenkins/jenkins-slave/maven-repositories/1/org/apache/felix/org.apache.felix.eventadmin/1.3.2/org.apache.felix.eventadmin-1.3.2.jar to <https://builds.apache.org/job/sling-oak-it-1.6/ws/launchpad-testing-oak/target/classes/resources/bundles/1/org.apache.felix.eventadmin-1.3.2.jar>
[INFO] Copying bundle from /home/jenkins/jenkins-slave/maven-repositories/1/org/apache/felix/org.apache.felix.http.jetty/2.2.2/org.apache.felix.http.jetty-2.2.2.jar to <https://builds.apache.org/job/sling-oak-it-1.6/ws/launchpad-testing-oak/target/classes/resources/bundles/1/org.apache.felix.http.jetty-2.2.2.jar>
[INFO] Copying bundle from /home/jenkins/jenkins-slave/maven-repositories/1/commons-io/commons-io/1.4/commons-io-1.4.jar to <https://builds.apache.org/job/sling-oak-it-1.6/ws/launchpad-testing-oak/target/classes/resources/bundles/0/commons-io-1.4.jar>
[INFO] Copying bundle from /home/jenkins/jenkins-slave/maven-repositories/1/commons-fileupload/commons-fileupload/1.3.1/commons-fileupload-1.3.1.jar to <https://builds.apache.org/job/sling-oak-it-1.6/ws/launchpad-testing-oak/target/classes/resources/bundles/0/commons-fileupload-1.3.1.jar>
[INFO] Copying bundle from /home/jenkins/jenkins-slave/maven-repositories/1/commons-collections/commons-collections/3.2.1/commons-collections-3.2.1.jar to <https://builds.apache.org/job/sling-oak-it-1.6/ws/launchpad-testing-oak/target/classes/resources/bundles/0/commons-collections-3.2.1.jar>
[INFO] Copying bundle from /home/jenkins/jenkins-slave/maven-repositories/1/commons-codec/commons-codec/1.9/commons-codec-1.9.jar to <https://builds.apache.org/job/sling-oak-it-1.6/ws/launchpad-testing-oak/target/classes/resources/bundles/0/commons-codec-1.9.jar>
[INFO] Copying bundle from /home/jenkins/jenkins-slave/maven-repositories/1/commons-lang/commons-lang/2.6/commons-lang-2.6.jar to <https://builds.apache.org/job/sling-oak-it-1.6/ws/launchpad-testing-oak/target/classes/resources/bundles/0/commons-lang-2.6.jar>
[INFO] Copying bundle from /home/jenkins/jenkins-slave/maven-repositories/1/org/apache/commons/commons-math/2.2/commons-math-2.2.jar to <https://builds.apache.org/job/sling-oak-it-1.6/ws/launchpad-testing-oak/target/classes/resources/bundles/0/commons-math-2.2.jar>
[INFO] Copying bundle from /home/jenkins/jenkins-slave/maven-repositories/1/commons-pool/commons-pool/1.6/commons-pool-1.6.jar to <https://builds.apache.org/job/sling-oak-it-1.6/ws/launchpad-testing-oak/target/classes/resources/bundles/0/commons-pool-1.6.jar>
[INFO] Copying bundle from /home/jenkins/jenkins-slave/maven-repositories/1/org/apache/servicemix/bundles/org.apache.servicemix.bundles.concurrent/1.3.4_1/org.apache.servicemix.bundles.concurrent-1.3.4_1.jar to <https://builds.apache.org/job/sling-oak-it-1.6/ws/launchpad-testing-oak/target/classes/resources/bundles/0/org.apache.servicemix.bundles.concurrent-1.3.4_1.jar>
[INFO] Copying bundle from /home/jenkins/jenkins-slave/maven-repositories/1/org/apache/geronimo/bundles/commons-httpclient/3.1_1/commons-httpclient-3.1_1.jar to <https://builds.apache.org/job/sling-oak-it-1.6/ws/launchpad-testing-oak/target/classes/resources/bundles/0/commons-httpclient-3.1_1.jar>
[INFO] Copying bundle from /home/jenkins/jenkins-slave/maven-repositories/1/org/apache/sling/org.apache.sling.commons.osgi/2.2.0/org.apache.sling.commons.osgi-2.2.0.jar to <https://builds.apache.org/job/sling-oak-it-1.6/ws/launchpad-testing-oak/target/classes/resources/bundles/0/org.apache.sling.commons.osgi-2.2.0.jar>
Downloading: http://repository.apache.org/snapshots/org/apache/sling/org.apache.sling.commons.mime/2.1.5-SNAPSHOT/maven-metadata.xml
Downloaded: http://repository.apache.org/snapshots/org/apache/sling/org.apache.sling.commons.mime/2.1.5-SNAPSHOT/maven-metadata.xml (1021 B at 2.3 KB/sec)
[INFO] Copying bundle from /home/jenkins/jenkins-slave/maven-repositories/1/org/apache/sling/org.apache.sling.commons.mime/2.1.5-SNAPSHOT/org.apache.sling.commons.mime-2.1.5-SNAPSHOT.jar to <https://builds.apache.org/job/sling-oak-it-1.6/ws/launchpad-testing-oak/target/classes/resources/bundles/0/org.apache.sling.commons.mime-2.1.5-SNAPSHOT.jar>
[INFO] Copying bundle from /home/jenkins/jenkins-slave/maven-repositories/1/org/apache/sling/org.apache.sling.commons.classloader/1.3.2/org.apache.sling.commons.classloader-1.3.2.jar to <https://builds.apache.org/job/sling-oak-it-1.6/ws/launchpad-testing-oak/target/classes/resources/bundles/0/org.apache.sling.commons.classloader-1.3.2.jar>
[INFO] Copying bundle from /home/jenkins/jenkins-slave/maven-repositories/1/org/apache/sling/org.apache.sling.commons.compiler/2.2.0/org.apache.sling.commons.compiler-2.2.0.jar to <https://builds.apache.org/job/sling-oak-it-1.6/ws/launchpad-testing-oak/target/classes/resources/bundles/0/org.apache.sling.commons.compiler-2.2.0.jar>
[INFO] Copying bundle from /home/jenkins/jenkins-slave/maven-repositories/1/org/apache/sling/org.apache.sling.commons.scheduler/2.4.2/org.apache.sling.commons.scheduler-2.4.2.jar to <https://builds.apache.org/job/sling-oak-it-1.6/ws/launchpad-testing-oak/target/classes/resources/bundles/0/org.apache.sling.commons.scheduler-2.4.2.jar>
[INFO] Copying bundle from /home/jenkins/jenkins-slave/maven-repositories/1/org/apache/sling/org.apache.sling.commons.threads/3.2.0/org.apache.sling.commons.threads-3.2.0.jar to <https://builds.apache.org/job/sling-oak-it-1.6/ws/launchpad-testing-oak/target/classes/resources/bundles/0/org.apache.sling.commons.threads-3.2.0.jar>
[INFO] Copying bundle from /home/jenkins/jenkins-slave/maven-repositories/1/org/apache/sling/org.apache.sling.discovery.api/1.0.0/org.apache.sling.discovery.api-1.0.0.jar to <https://builds.apache.org/job/sling-oak-it-1.6/ws/launchpad-testing-oak/target/classes/resources/bundles/0/org.apache.sling.discovery.api-1.0.0.jar>
[INFO] Copying bundle from /home/jenkins/jenkins-slave/maven-repositories/1/org/apache/sling/org.apache.sling.discovery.support/1.0.0/org.apache.sling.discovery.support-1.0.0.jar to <https://builds.apache.org/job/sling-oak-it-1.6/ws/launchpad-testing-oak/target/classes/resources/bundles/0/org.apache.sling.discovery.support-1.0.0.jar>
[INFO] Copying bundle from /home/jenkins/jenkins-slave/maven-repositories/1/org/apache/sling/org.apache.sling.discovery.impl/1.0.8/org.apache.sling.discovery.impl-1.0.8.jar to <https://builds.apache.org/job/sling-oak-it-1.6/ws/launchpad-testing-oak/target/classes/resources/bundles/0/org.apache.sling.discovery.impl-1.0.8.jar>
[INFO] Copying bundle from /home/jenkins/jenkins-slave/maven-repositories/1/org/apache/sling/org.apache.sling.event/3.3.10/org.apache.sling.event-3.3.10.jar to <https://builds.apache.org/job/sling-oak-it-1.6/ws/launchpad-testing-oak/target/classes/resources/bundles/0/org.apache.sling.event-3.3.10.jar>
[INFO] Copying bundle from /home/jenkins/jenkins-slave/maven-repositories/1/org/apache/sling/org.apache.sling.api/2.7.0/org.apache.sling.api-2.7.0.jar to <https://builds.apache.org/job/sling-oak-it-1.6/ws/launchpad-testing-oak/target/classes/resources/bundles/0/org.apache.sling.api-2.7.0.jar>
[INFO] Copying bundle from /home/jenkins/jenkins-slave/maven-repositories/1/org/apache/sling/org.apache.sling.serviceusermapper/1.0.2/org.apache.sling.serviceusermapper-1.0.2.jar to <https://builds.apache.org/job/sling-oak-it-1.6/ws/launchpad-testing-oak/target/classes/resources/bundles/0/org.apache.sling.serviceusermapper-1.0.2.jar>
Downloading: http://repository.apache.org/snapshots/org/apache/sling/org.apache.sling.resourceresolver/1.1.1-SNAPSHOT/maven-metadata.xml
Downloaded: http://repository.apache.org/snapshots/org/apache/sling/org.apache.sling.resourceresolver/1.1.1-SNAPSHOT/maven-metadata.xml (1013 B at 4.5 KB/sec)
[INFO] Copying bundle from /home/jenkins/jenkins-slave/maven-repositories/1/org/apache/sling/org.apache.sling.resourceresolver/1.1.1-SNAPSHOT/org.apache.sling.resourceresolver-1.1.1-SNAPSHOT.jar to <https://builds.apache.org/job/sling-oak-it-1.6/ws/launchpad-testing-oak/target/classes/resources/bundles/0/org.apache.sling.resourceresolver-1.1.1-SNAPSHOT.jar>
Downloading: http://repository.apache.org/snapshots/org/apache/sling/org.apache.sling.auth.core/1.1.7-SNAPSHOT/maven-metadata.xml
Downloaded: http://repository.apache.org/snapshots/org/apache/sling/org.apache.sling.auth.core/1.1.7-SNAPSHOT/maven-metadata.xml (1006 B at 2.3 KB/sec)
[INFO] Copying bundle from /home/jenkins/jenkins-slave/maven-repositories/1/org/apache/sling/org.apache.sling.auth.core/1.1.7-SNAPSHOT/org.apache.sling.auth.core-1.1.7-SNAPSHOT.jar to <https://builds.apache.org/job/sling-oak-it-1.6/ws/launchpad-testing-oak/target/classes/resources/bundles/0/org.apache.sling.auth.core-1.1.7-SNAPSHOT.jar>
Downloading: http://repository.apache.org/snapshots/org/apache/sling/org.apache.sling.engine/2.3.5-SNAPSHOT/maven-metadata.xml
Downloading: http://repository.apache.org/snapshots/org/apache/sling/org.apache.sling.engine/2.3.5-SNAPSHOT/org.apache.sling.engine-2.3.5-SNAPSHOT.jar
[JENKINS] Archiving disabled
[INFO] ------------------------------------------------------------------------
[INFO] BUILD FAILURE
[INFO] ------------------------------------------------------------------------
[INFO] Total time: 28.597s
[INFO] Finished at: Wed Oct 08 14:39:04 UTC 2014
[INFO] Final Memory: 20M/204M
[INFO] ------------------------------------------------------------------------
[JENKINS] Archiving disabled
Waiting for Jenkins to finish collecting data
[ERROR] Failed to execute goal org.apache.sling:maven-launchpad-plugin:2.3.0:prepare-package (prepare-package) on project org.apache.sling.launchpad.testing: Unable to find artifact. Could not find artifact org.apache.sling:org.apache.sling.engine:jar:2.3.5-SNAPSHOT in Nexus (http://repository.apache.org/snapshots)
[ERROR] 
[ERROR] Try downloading the file manually from the project website.
[ERROR] 
[ERROR] Then, install it using the command:
[ERROR] mvn install:install-file -DgroupId=org.apache.sling -DartifactId=org.apache.sling.engine -Dversion=2.3.5-SNAPSHOT -Dpackaging=jar -Dfile=/path/to/file
[ERROR] 
[ERROR] Alternatively, if you host your own repository you can deploy the file there:
[ERROR] mvn deploy:deploy-file -DgroupId=org.apache.sling -DartifactId=org.apache.sling.engine -Dversion=2.3.5-SNAPSHOT -Dpackaging=jar -Dfile=/path/to/file -Durl=[url] -DrepositoryId=[id]
[ERROR] 
[ERROR] 
[ERROR] org.apache.sling:org.apache.sling.engine:jar:2.3.5-SNAPSHOT
[ERROR] 
[ERROR] from the specified remote repositories:
[ERROR] Nexus (http://repository.apache.org/snapshots, releases=false, snapshots=true),
[ERROR] central (http://repo.maven.apache.org/maven2, releases=true, snapshots=false)
[ERROR] -> [Help 1]
[ERROR] 
[ERROR] To see the full stack trace of the errors, re-run Maven with the -e switch.
[ERROR] Re-run Maven using the -X switch to enable full debug logging.
[ERROR] 
[ERROR] For more information about the errors and possible solutions, please read the following articles:
[ERROR] [Help 1] http://cwiki.apache.org/confluence/display/MAVEN/MojoExecutionException
Sending e-mails to: dev@sling.apache.org
channel stopped

Jenkins build is still unstable: sling-oak-it-1.6 #165

Posted by Apache Jenkins Server <je...@builds.apache.org>.
See <https://builds.apache.org/job/sling-oak-it-1.6/165/>


Jenkins build is still unstable: sling-oak-it-1.6 #164

Posted by Apache Jenkins Server <je...@builds.apache.org>.
See <https://builds.apache.org/job/sling-oak-it-1.6/164/>


Jenkins build is still unstable: sling-oak-it-1.6 #163

Posted by Apache Jenkins Server <je...@builds.apache.org>.
See <https://builds.apache.org/job/sling-oak-it-1.6/163/>


Jenkins build is still unstable: sling-oak-it-1.6 #162

Posted by Apache Jenkins Server <je...@builds.apache.org>.
See <https://builds.apache.org/job/sling-oak-it-1.6/162/>


Jenkins build is still unstable: sling-oak-it-1.6 #161

Posted by Apache Jenkins Server <je...@builds.apache.org>.
See <https://builds.apache.org/job/sling-oak-it-1.6/161/>


Jenkins build is still unstable: sling-oak-it-1.6 #160

Posted by Apache Jenkins Server <je...@builds.apache.org>.
See <https://builds.apache.org/job/sling-oak-it-1.6/160/>


Jenkins build is unstable: sling-oak-it-1.6 #159

Posted by Apache Jenkins Server <je...@builds.apache.org>.
See <https://builds.apache.org/job/sling-oak-it-1.6/159/>


Build failed in Jenkins: sling-oak-it-1.6 #158

Posted by Apache Jenkins Server <je...@builds.apache.org>.
See <https://builds.apache.org/job/sling-oak-it-1.6/158/>

------------------------------------------
Started by upstream project "sling-trunk-1.6" build number 2593
originally caused by:
 Started by an SCM change
Building remotely on ubuntu-6 (Ubuntu ubuntu) in workspace <https://builds.apache.org/job/sling-oak-it-1.6/ws/>
Updating http://svn.apache.org/repos/asf/sling/trunk/launchpad/testing at revision '2014-10-06T16:46:46.653 +0000'
At revision 1629707
no change for http://svn.apache.org/repos/asf/sling/trunk/launchpad/testing since the previous build
Parsing POMs
maven3-agent.jar already up to date
maven3-interceptor.jar already up to date
maven3-interceptor-commons.jar already up to date
[launchpad-testing-oak] $ /home/jenkins/tools/java/latest1.6/bin/java -Xmx512M -XX:MaxPermSize=256M -enableassertions -cp /home/jenkins/jenkins-slave/maven3-agent.jar:/home/jenkins/jenkins-slave/tools/hudson.tasks.Maven_MavenInstallation/Maven_3.0.5/boot/plexus-classworlds-2.4.jar org.jvnet.hudson.maven3.agent.Maven3Main /home/jenkins/jenkins-slave/tools/hudson.tasks.Maven_MavenInstallation/Maven_3.0.5 /home/jenkins/jenkins-slave/slave.jar /home/jenkins/jenkins-slave/maven3-interceptor.jar /home/jenkins/jenkins-slave/maven3-interceptor-commons.jar 46422
<===[JENKINchannel started
S REMOTING CAPACITY]===>   log4j:WARN No appenders could be found for logger (org.apache.commons.beanutils.converters.BooleanConverter).
log4j:WARN Please initialize the log4j system properly.
Executing Maven:  -B -f <https://builds.apache.org/job/sling-oak-it-1.6/ws/launchpad-testing-oak/pom.xml> -Dmaven.repo.local=/home/jenkins/jenkins-slave/maven-repositories/0 clean install -Dsling.run.modes=oak
[INFO] Scanning for projects...
[INFO]                                                                         
[INFO] ------------------------------------------------------------------------
[INFO] Building Apache Sling Launchpad Testing 7-SNAPSHOT
[INFO] ------------------------------------------------------------------------
[INFO] 
[INFO] --- maven-clean-plugin:2.5:clean (default-clean) @ org.apache.sling.launchpad.testing ---
[INFO] Deleting <https://builds.apache.org/job/sling-oak-it-1.6/ws/launchpad-testing-oak/target>
[INFO] Deleting <https://builds.apache.org/job/sling-oak-it-1.6/ws/launchpad-testing-oak> (includes = [derby.log, cachedir, sling/**, jackrabbit, coverage.ec], excludes = [])
[INFO] 
[INFO] --- maven-enforcer-plugin:1.3.1:enforce (enforce-java) @ org.apache.sling.launchpad.testing ---
[INFO] 
[INFO] --- maven-antrun-plugin:1.7:run (set-bundle-required-execution-environment) @ org.apache.sling.launchpad.testing ---
[INFO] Executing tasks

main:
[INFO] Executed tasks
[INFO] 
[INFO] --- maven-remote-resources-plugin:1.5:process (default) @ org.apache.sling.launchpad.testing ---
[INFO] 
[INFO] --- maven-resources-plugin:2.6:resources (default-resources) @ org.apache.sling.launchpad.testing ---
[INFO] Using 'UTF-8' encoding to copy filtered resources.
[INFO] Copying 1 resource
[INFO] Copying 3 resources
[INFO] 
[INFO] --- maven-antrun-plugin:1.7:run (check-memory-task) @ org.apache.sling.launchpad.testing ---
[INFO] Executing tasks

main:
     [echo] **************** WARNING (SLING-443/SLING-1782) ******************************
     [echo] On most platforms, you'll get OutOfMemoryErrors when building unless you set
     [echo] on 32bit platforms: MAVEN_OPTS="-Xmx256M -XX:MaxPermSize=256M", see SLING-443
     [echo] on 64bit platforms: MAVEN_OPTS="-Xmx512M -XX:MaxPermSize=512M", see SLING-1782
     [echo] ******************************************************************************
[INFO] Executed tasks
[INFO] 
[INFO] --- build-helper-maven-plugin:1.8:reserve-network-port (reserve-network-port) @ org.apache.sling.launchpad.testing ---
[INFO] Reserved port 49195 for http.port
[INFO] Reserved port 50701 for sling.control.port
[INFO] 
[INFO] --- maven-compiler-plugin:3.1:compile (default-compile) @ org.apache.sling.launchpad.testing ---
[INFO] No sources to compile
[INFO] 
[INFO] --- maven-resources-plugin:2.6:testResources (default-testResources) @ org.apache.sling.launchpad.testing ---
[INFO] Using 'UTF-8' encoding to copy filtered resources.
[INFO] Copying 2 resources
[INFO] Copying 3 resources
[INFO] 
[INFO] --- maven-compiler-plugin:3.1:testCompile (default-testCompile) @ org.apache.sling.launchpad.testing ---
[INFO] No sources to compile
[INFO] 
[INFO] --- maven-surefire-plugin:2.17:test (default-test) @ org.apache.sling.launchpad.testing ---
[JENKINS] Recording test results[INFO] 
[INFO] --- animal-sniffer-maven-plugin:1.11:check (default) @ org.apache.sling.launchpad.testing ---

[INFO] Checking unresolved references to org.codehaus.mojo.signature:java15:1.0
[INFO] 
[INFO] --- maven-launchpad-plugin:2.3.0:prepare-package (prepare-package) @ org.apache.sling.launchpad.testing ---
[INFO] Using bundle list file from /home/jenkins/jenkins-slave/maven-repositories/0/org/apache/sling/org.apache.sling.launchpad/7-SNAPSHOT/org.apache.sling.launchpad-7-SNAPSHOT-bundlelist.xml
[INFO] Merging partial bundle list org.apache.sling:org.apache.sling.launchpad.test-bundles:0.0.1-SNAPSHOT
Downloading: http://repository.apache.org/snapshots/org/apache/sling/org.apache.sling.launchpad.test-bundles/0.0.1-SNAPSHOT/org.apache.sling.launchpad.test-bundles-0.0.1-SNAPSHOT-bundlelistconfig.zip
[INFO] Copying base artifact from /home/jenkins/jenkins-slave/maven-repositories/0/org/apache/sling/org.apache.sling.launchpad.base/4.4.1-2.5.2/org.apache.sling.launchpad.base-4.4.1-2.5.2.jar to <https://builds.apache.org/job/sling-oak-it-1.6/ws/launchpad-testing-oak/target/classes/resources/org.apache.sling.launchpad.base.jar.>
[INFO] Copying bundle from /home/jenkins/jenkins-slave/maven-repositories/0/org/slf4j/slf4j-api/1.7.6/slf4j-api-1.7.6.jar to <https://builds.apache.org/job/sling-oak-it-1.6/ws/launchpad-testing-oak/target/classes/resources/bundles/1/slf4j-api-1.7.6.jar>
[INFO] Copying bundle from /home/jenkins/jenkins-slave/maven-repositories/0/org/apache/sling/org.apache.sling.commons.log/4.0.0/org.apache.sling.commons.log-4.0.0.jar to <https://builds.apache.org/job/sling-oak-it-1.6/ws/launchpad-testing-oak/target/classes/resources/bundles/1/org.apache.sling.commons.log-4.0.0.jar>
[INFO] Copying bundle from /home/jenkins/jenkins-slave/maven-repositories/0/org/apache/sling/org.apache.sling.commons.logservice/1.0.2/org.apache.sling.commons.logservice-1.0.2.jar to <https://builds.apache.org/job/sling-oak-it-1.6/ws/launchpad-testing-oak/target/classes/resources/bundles/1/org.apache.sling.commons.logservice-1.0.2.jar>
[INFO] Copying bundle from /home/jenkins/jenkins-slave/maven-repositories/0/org/slf4j/jcl-over-slf4j/1.7.6/jcl-over-slf4j-1.7.6.jar to <https://builds.apache.org/job/sling-oak-it-1.6/ws/launchpad-testing-oak/target/classes/resources/bundles/1/jcl-over-slf4j-1.7.6.jar>
[INFO] Copying bundle from /home/jenkins/jenkins-slave/maven-repositories/0/org/slf4j/log4j-over-slf4j/1.7.6/log4j-over-slf4j-1.7.6.jar to <https://builds.apache.org/job/sling-oak-it-1.6/ws/launchpad-testing-oak/target/classes/resources/bundles/1/log4j-over-slf4j-1.7.6.jar>
[INFO] Copying bundle from /home/jenkins/jenkins-slave/maven-repositories/0/org/apache/sling/org.apache.sling.settings/1.3.2/org.apache.sling.settings-1.3.2.jar to <https://builds.apache.org/job/sling-oak-it-1.6/ws/launchpad-testing-oak/target/classes/resources/bundles/1/org.apache.sling.settings-1.3.2.jar>
[INFO] Copying bundle from /home/jenkins/jenkins-slave/maven-repositories/0/org/apache/sling/org.apache.sling.fragment.xml/1.0.2/org.apache.sling.fragment.xml-1.0.2.jar to <https://builds.apache.org/job/sling-oak-it-1.6/ws/launchpad-testing-oak/target/classes/resources/bundles/1/org.apache.sling.fragment.xml-1.0.2.jar>
[INFO] Copying bundle from /home/jenkins/jenkins-slave/maven-repositories/0/org/apache/sling/org.apache.sling.fragment.transaction/1.0.0/org.apache.sling.fragment.transaction-1.0.0.jar to <https://builds.apache.org/job/sling-oak-it-1.6/ws/launchpad-testing-oak/target/classes/resources/bundles/1/org.apache.sling.fragment.transaction-1.0.0.jar>
[INFO] Copying bundle from /home/jenkins/jenkins-slave/maven-repositories/0/org/apache/sling/org.apache.sling.javax.activation/0.1.0/org.apache.sling.javax.activation-0.1.0.jar to <https://builds.apache.org/job/sling-oak-it-1.6/ws/launchpad-testing-oak/target/classes/resources/bundles/1/org.apache.sling.javax.activation-0.1.0.jar>
[INFO] Copying bundle from /home/jenkins/jenkins-slave/maven-repositories/0/org/apache/sling/org.apache.sling.fragment.ws/1.0.2/org.apache.sling.fragment.ws-1.0.2.jar to <https://builds.apache.org/job/sling-oak-it-1.6/ws/launchpad-testing-oak/target/classes/resources/bundles/1/org.apache.sling.fragment.ws-1.0.2.jar>
[INFO] Copying bundle from /home/jenkins/jenkins-slave/maven-repositories/0/org/apache/sling/org.apache.sling.launchpad.installer/1.2.0/org.apache.sling.launchpad.installer-1.2.0.jar to <https://builds.apache.org/job/sling-oak-it-1.6/ws/launchpad-testing-oak/target/classes/resources/bundles/1/org.apache.sling.launchpad.installer-1.2.0.jar>
[INFO] Copying bundle from /home/jenkins/jenkins-slave/maven-repositories/0/org/apache/sling/org.apache.sling.installer.core/3.5.2/org.apache.sling.installer.core-3.5.2.jar to <https://builds.apache.org/job/sling-oak-it-1.6/ws/launchpad-testing-oak/target/classes/resources/bundles/1/org.apache.sling.installer.core-3.5.2.jar>
[INFO] Copying bundle from /home/jenkins/jenkins-slave/maven-repositories/0/org/apache/sling/org.apache.sling.installer.provider.file/1.0.2/org.apache.sling.installer.provider.file-1.0.2.jar to <https://builds.apache.org/job/sling-oak-it-1.6/ws/launchpad-testing-oak/target/classes/resources/bundles/1/org.apache.sling.installer.provider.file-1.0.2.jar>
[INFO] Copying bundle from /home/jenkins/jenkins-slave/maven-repositories/0/org/apache/felix/org.apache.felix.configadmin/1.6.0/org.apache.felix.configadmin-1.6.0.jar to <https://builds.apache.org/job/sling-oak-it-1.6/ws/launchpad-testing-oak/target/classes/resources/bundles/1/org.apache.felix.configadmin-1.6.0.jar>
[INFO] Copying bundle from /home/jenkins/jenkins-slave/maven-repositories/0/org/apache/felix/org.apache.felix.eventadmin/1.3.2/org.apache.felix.eventadmin-1.3.2.jar to <https://builds.apache.org/job/sling-oak-it-1.6/ws/launchpad-testing-oak/target/classes/resources/bundles/1/org.apache.felix.eventadmin-1.3.2.jar>
[INFO] Copying bundle from /home/jenkins/jenkins-slave/maven-repositories/0/org/apache/felix/org.apache.felix.http.jetty/2.2.2/org.apache.felix.http.jetty-2.2.2.jar to <https://builds.apache.org/job/sling-oak-it-1.6/ws/launchpad-testing-oak/target/classes/resources/bundles/1/org.apache.felix.http.jetty-2.2.2.jar>
[INFO] Copying bundle from /home/jenkins/jenkins-slave/maven-repositories/0/commons-io/commons-io/1.4/commons-io-1.4.jar to <https://builds.apache.org/job/sling-oak-it-1.6/ws/launchpad-testing-oak/target/classes/resources/bundles/0/commons-io-1.4.jar>
[INFO] Copying bundle from /home/jenkins/jenkins-slave/maven-repositories/0/commons-fileupload/commons-fileupload/1.3.1/commons-fileupload-1.3.1.jar to <https://builds.apache.org/job/sling-oak-it-1.6/ws/launchpad-testing-oak/target/classes/resources/bundles/0/commons-fileupload-1.3.1.jar>
[INFO] Copying bundle from /home/jenkins/jenkins-slave/maven-repositories/0/commons-collections/commons-collections/3.2.1/commons-collections-3.2.1.jar to <https://builds.apache.org/job/sling-oak-it-1.6/ws/launchpad-testing-oak/target/classes/resources/bundles/0/commons-collections-3.2.1.jar>
[INFO] Copying bundle from /home/jenkins/jenkins-slave/maven-repositories/0/commons-codec/commons-codec/1.9/commons-codec-1.9.jar to <https://builds.apache.org/job/sling-oak-it-1.6/ws/launchpad-testing-oak/target/classes/resources/bundles/0/commons-codec-1.9.jar>
[INFO] Copying bundle from /home/jenkins/jenkins-slave/maven-repositories/0/commons-lang/commons-lang/2.6/commons-lang-2.6.jar to <https://builds.apache.org/job/sling-oak-it-1.6/ws/launchpad-testing-oak/target/classes/resources/bundles/0/commons-lang-2.6.jar>
[INFO] Copying bundle from /home/jenkins/jenkins-slave/maven-repositories/0/org/apache/commons/commons-math/2.2/commons-math-2.2.jar to <https://builds.apache.org/job/sling-oak-it-1.6/ws/launchpad-testing-oak/target/classes/resources/bundles/0/commons-math-2.2.jar>
[INFO] Copying bundle from /home/jenkins/jenkins-slave/maven-repositories/0/commons-pool/commons-pool/1.6/commons-pool-1.6.jar to <https://builds.apache.org/job/sling-oak-it-1.6/ws/launchpad-testing-oak/target/classes/resources/bundles/0/commons-pool-1.6.jar>
[INFO] Copying bundle from /home/jenkins/jenkins-slave/maven-repositories/0/org/apache/servicemix/bundles/org.apache.servicemix.bundles.concurrent/1.3.4_1/org.apache.servicemix.bundles.concurrent-1.3.4_1.jar to <https://builds.apache.org/job/sling-oak-it-1.6/ws/launchpad-testing-oak/target/classes/resources/bundles/0/org.apache.servicemix.bundles.concurrent-1.3.4_1.jar>
[INFO] Copying bundle from /home/jenkins/jenkins-slave/maven-repositories/0/org/apache/geronimo/bundles/commons-httpclient/3.1_1/commons-httpclient-3.1_1.jar to <https://builds.apache.org/job/sling-oak-it-1.6/ws/launchpad-testing-oak/target/classes/resources/bundles/0/commons-httpclient-3.1_1.jar>
[INFO] Copying bundle from /home/jenkins/jenkins-slave/maven-repositories/0/org/apache/sling/org.apache.sling.commons.osgi/2.2.0/org.apache.sling.commons.osgi-2.2.0.jar to <https://builds.apache.org/job/sling-oak-it-1.6/ws/launchpad-testing-oak/target/classes/resources/bundles/0/org.apache.sling.commons.osgi-2.2.0.jar>
[INFO] Copying bundle from /home/jenkins/jenkins-slave/maven-repositories/0/org/apache/sling/org.apache.sling.commons.mime/2.1.5-SNAPSHOT/org.apache.sling.commons.mime-2.1.5-SNAPSHOT.jar to <https://builds.apache.org/job/sling-oak-it-1.6/ws/launchpad-testing-oak/target/classes/resources/bundles/0/org.apache.sling.commons.mime-2.1.5-SNAPSHOT.jar>
[INFO] Copying bundle from /home/jenkins/jenkins-slave/maven-repositories/0/org/apache/sling/org.apache.sling.commons.classloader/1.3.2/org.apache.sling.commons.classloader-1.3.2.jar to <https://builds.apache.org/job/sling-oak-it-1.6/ws/launchpad-testing-oak/target/classes/resources/bundles/0/org.apache.sling.commons.classloader-1.3.2.jar>
[INFO] Copying bundle from /home/jenkins/jenkins-slave/maven-repositories/0/org/apache/sling/org.apache.sling.commons.compiler/2.2.0/org.apache.sling.commons.compiler-2.2.0.jar to <https://builds.apache.org/job/sling-oak-it-1.6/ws/launchpad-testing-oak/target/classes/resources/bundles/0/org.apache.sling.commons.compiler-2.2.0.jar>
[INFO] Copying bundle from /home/jenkins/jenkins-slave/maven-repositories/0/org/apache/sling/org.apache.sling.commons.scheduler/2.4.2/org.apache.sling.commons.scheduler-2.4.2.jar to <https://builds.apache.org/job/sling-oak-it-1.6/ws/launchpad-testing-oak/target/classes/resources/bundles/0/org.apache.sling.commons.scheduler-2.4.2.jar>
[INFO] Copying bundle from /home/jenkins/jenkins-slave/maven-repositories/0/org/apache/sling/org.apache.sling.commons.threads/3.2.0/org.apache.sling.commons.threads-3.2.0.jar to <https://builds.apache.org/job/sling-oak-it-1.6/ws/launchpad-testing-oak/target/classes/resources/bundles/0/org.apache.sling.commons.threads-3.2.0.jar>
[INFO] Copying bundle from /home/jenkins/jenkins-slave/maven-repositories/0/org/apache/sling/org.apache.sling.discovery.api/1.0.0/org.apache.sling.discovery.api-1.0.0.jar to <https://builds.apache.org/job/sling-oak-it-1.6/ws/launchpad-testing-oak/target/classes/resources/bundles/0/org.apache.sling.discovery.api-1.0.0.jar>
[INFO] Copying bundle from /home/jenkins/jenkins-slave/maven-repositories/0/org/apache/sling/org.apache.sling.discovery.support/1.0.0/org.apache.sling.discovery.support-1.0.0.jar to <https://builds.apache.org/job/sling-oak-it-1.6/ws/launchpad-testing-oak/target/classes/resources/bundles/0/org.apache.sling.discovery.support-1.0.0.jar>
[INFO] Copying bundle from /home/jenkins/jenkins-slave/maven-repositories/0/org/apache/sling/org.apache.sling.discovery.impl/1.0.8/org.apache.sling.discovery.impl-1.0.8.jar to <https://builds.apache.org/job/sling-oak-it-1.6/ws/launchpad-testing-oak/target/classes/resources/bundles/0/org.apache.sling.discovery.impl-1.0.8.jar>
[INFO] Copying bundle from /home/jenkins/jenkins-slave/maven-repositories/0/org/apache/sling/org.apache.sling.event/3.3.10/org.apache.sling.event-3.3.10.jar to <https://builds.apache.org/job/sling-oak-it-1.6/ws/launchpad-testing-oak/target/classes/resources/bundles/0/org.apache.sling.event-3.3.10.jar>
[INFO] Copying bundle from /home/jenkins/jenkins-slave/maven-repositories/0/org/apache/sling/org.apache.sling.api/2.7.0/org.apache.sling.api-2.7.0.jar to <https://builds.apache.org/job/sling-oak-it-1.6/ws/launchpad-testing-oak/target/classes/resources/bundles/0/org.apache.sling.api-2.7.0.jar>
[INFO] Copying bundle from /home/jenkins/jenkins-slave/maven-repositories/0/org/apache/sling/org.apache.sling.serviceusermapper/1.0.2/org.apache.sling.serviceusermapper-1.0.2.jar to <https://builds.apache.org/job/sling-oak-it-1.6/ws/launchpad-testing-oak/target/classes/resources/bundles/0/org.apache.sling.serviceusermapper-1.0.2.jar>
[INFO] Copying bundle from /home/jenkins/jenkins-slave/maven-repositories/0/org/apache/sling/org.apache.sling.resourceresolver/1.1.1-SNAPSHOT/org.apache.sling.resourceresolver-1.1.1-SNAPSHOT.jar to <https://builds.apache.org/job/sling-oak-it-1.6/ws/launchpad-testing-oak/target/classes/resources/bundles/0/org.apache.sling.resourceresolver-1.1.1-SNAPSHOT.jar>
[INFO] Copying bundle from /home/jenkins/jenkins-slave/maven-repositories/0/org/apache/sling/org.apache.sling.auth.core/1.1.7-SNAPSHOT/org.apache.sling.auth.core-1.1.7-SNAPSHOT.jar to <https://builds.apache.org/job/sling-oak-it-1.6/ws/launchpad-testing-oak/target/classes/resources/bundles/0/org.apache.sling.auth.core-1.1.7-SNAPSHOT.jar>
Downloading: http://repository.apache.org/snapshots/org/apache/sling/org.apache.sling.engine/2.3.5-SNAPSHOT/org.apache.sling.engine-2.3.5-SNAPSHOT.jar
[JENKINS] Archiving disabled
[INFO] ------------------------------------------------------------------------
[INFO] BUILD FAILURE
[INFO] ------------------------------------------------------------------------
[INFO] Total time: 38.368s
[INFO] Finished at: Mon Oct 06 16:47:50 UTC 2014
[INFO] Final Memory: 19M/206M
[INFO] ------------------------------------------------------------------------
[JENKINS] Archiving disabled
Waiting for Jenkins to finish collecting data
[ERROR] Failed to execute goal org.apache.sling:maven-launchpad-plugin:2.3.0:prepare-package (prepare-package) on project org.apache.sling.launchpad.testing: Unable to find artifact. Could not find artifact org.apache.sling:org.apache.sling.engine:jar:2.3.5-SNAPSHOT in Nexus (http://repository.apache.org/snapshots)
[ERROR] 
[ERROR] Try downloading the file manually from the project website.
[ERROR] 
[ERROR] Then, install it using the command:
[ERROR] mvn install:install-file -DgroupId=org.apache.sling -DartifactId=org.apache.sling.engine -Dversion=2.3.5-SNAPSHOT -Dpackaging=jar -Dfile=/path/to/file
[ERROR] 
[ERROR] Alternatively, if you host your own repository you can deploy the file there:
[ERROR] mvn deploy:deploy-file -DgroupId=org.apache.sling -DartifactId=org.apache.sling.engine -Dversion=2.3.5-SNAPSHOT -Dpackaging=jar -Dfile=/path/to/file -Durl=[url] -DrepositoryId=[id]
[ERROR] 
[ERROR] 
[ERROR] org.apache.sling:org.apache.sling.engine:jar:2.3.5-SNAPSHOT
[ERROR] 
[ERROR] from the specified remote repositories:
[ERROR] Nexus (http://repository.apache.org/snapshots, releases=false, snapshots=true),
[ERROR] central (http://repo.maven.apache.org/maven2, releases=true, snapshots=false)
[ERROR] -> [Help 1]
[ERROR] 
[ERROR] To see the full stack trace of the errors, re-run Maven with the -e switch.
[ERROR] Re-run Maven using the -X switch to enable full debug logging.
[ERROR] 
[ERROR] For more information about the errors and possible solutions, please read the following articles:
[ERROR] [Help 1] http://cwiki.apache.org/confluence/display/MAVEN/MojoExecutionException
Sending e-mails to: dev@sling.apache.org
channel stopped

Build failed in Jenkins: sling-oak-it-1.6 #157

Posted by Apache Jenkins Server <je...@builds.apache.org>.
See <https://builds.apache.org/job/sling-oak-it-1.6/157/>

------------------------------------------
Started by upstream project "sling-trunk-1.6" build number 2591
originally caused by:
 Started by an SCM change
Building remotely on ubuntu-6 (Ubuntu ubuntu) in workspace <https://builds.apache.org/job/sling-oak-it-1.6/ws/>
Updating http://svn.apache.org/repos/asf/sling/trunk/launchpad/testing at revision '2014-10-06T11:45:28.405 +0000'
At revision 1629618
no change for http://svn.apache.org/repos/asf/sling/trunk/launchpad/testing since the previous build
Parsing POMs
maven3-agent.jar already up to date
maven3-interceptor.jar already up to date
maven3-interceptor-commons.jar already up to date
[launchpad-testing-oak] $ /home/jenkins/tools/java/latest1.6/bin/java -Xmx512M -XX:MaxPermSize=256M -enableassertions -cp /home/jenkins/jenkins-slave/maven3-agent.jar:/home/jenkins/jenkins-slave/tools/hudson.tasks.Maven_MavenInstallation/Maven_3.0.5/boot/plexus-classworlds-2.4.jar org.jvnet.hudson.maven3.agent.Maven3Main /home/jenkins/jenkins-slave/tools/hudson.tasks.Maven_MavenInstallation/Maven_3.0.5 /home/jenkins/jenkins-slave/slave.jar /home/jenkins/jenkins-slave/maven3-interceptor.jar /home/jenkins/jenkins-slave/maven3-interceptor-commons.jar 38256
<===[JENKINS REMchannel started
OTING CAPACITY]===>   log4j:WARN No appenders could be found for logger (org.apache.commons.beanutils.converters.BooleanConverter).
log4j:WARN Please initialize the log4j system properly.
Executing Maven:  -B -f <https://builds.apache.org/job/sling-oak-it-1.6/ws/launchpad-testing-oak/pom.xml> -Dmaven.repo.local=/home/jenkins/jenkins-slave/maven-repositories/0 clean install -Dsling.run.modes=oak
[INFO] Scanning for projects...
[INFO]                                                                         
[INFO] ------------------------------------------------------------------------
[INFO] Building Apache Sling Launchpad Testing 7-SNAPSHOT
[INFO] ------------------------------------------------------------------------
Downloading: http://repository.apache.org/snapshots/org/apache/sling/org.apache.sling.launchpad.integration-tests/1.0.1-SNAPSHOT/maven-metadata.xml
Downloaded: http://repository.apache.org/snapshots/org/apache/sling/org.apache.sling.launchpad.integration-tests/1.0.1-SNAPSHOT/maven-metadata.xml (2 KB at 2.1 KB/sec)
Downloading: http://repository.apache.org/snapshots/org/apache/sling/org.apache.sling.commons.testing/2.0.15-SNAPSHOT/maven-metadata.xml
Downloaded: http://repository.apache.org/snapshots/org/apache/sling/org.apache.sling.commons.testing/2.0.15-SNAPSHOT/maven-metadata.xml (1016 B at 21.6 KB/sec)
Downloading: http://repository.apache.org/snapshots/org/apache/sling/org.apache.sling.junit.remote/1.0.9-SNAPSHOT/maven-metadata.xml
Downloaded: http://repository.apache.org/snapshots/org/apache/sling/org.apache.sling.junit.remote/1.0.9-SNAPSHOT/maven-metadata.xml (2 KB at 32.0 KB/sec)
Downloading: http://repository.apache.org/snapshots/org/apache/sling/org.apache.sling.launchpad.test-bundles/0.0.1-SNAPSHOT/maven-metadata.xml
Downloaded: http://repository.apache.org/snapshots/org/apache/sling/org.apache.sling.launchpad.test-bundles/0.0.1-SNAPSHOT/maven-metadata.xml (2 KB at 4.8 KB/sec)
Downloading: http://repository.apache.org/snapshots/org/apache/sling/org.apache.sling.launchpad/7-SNAPSHOT/maven-metadata.xml
[INFO] 
[INFO] --- maven-clean-plugin:2.5:clean (default-clean) @ org.apache.sling.launchpad.testing ---
[INFO] Deleting <https://builds.apache.org/job/sling-oak-it-1.6/ws/launchpad-testing-oak/target>
[INFO] Deleting <https://builds.apache.org/job/sling-oak-it-1.6/ws/launchpad-testing-oak> (includes = [derby.log, cachedir, sling/**, jackrabbit, coverage.ec], excludes = [])
[INFO] 
[INFO] --- maven-enforcer-plugin:1.3.1:enforce (enforce-java) @ org.apache.sling.launchpad.testing ---
[INFO] 
[INFO] --- maven-antrun-plugin:1.7:run (set-bundle-required-execution-environment) @ org.apache.sling.launchpad.testing ---
[INFO] Executing tasks

main:
[INFO] Executed tasks
[INFO] 
[INFO] --- maven-remote-resources-plugin:1.5:process (default) @ org.apache.sling.launchpad.testing ---
[INFO] 
[INFO] --- maven-resources-plugin:2.6:resources (default-resources) @ org.apache.sling.launchpad.testing ---
[INFO] Using 'UTF-8' encoding to copy filtered resources.
[INFO] Copying 1 resource
[INFO] Copying 3 resources
[INFO] 
[INFO] --- maven-antrun-plugin:1.7:run (check-memory-task) @ org.apache.sling.launchpad.testing ---
[INFO] Executing tasks

main:
     [echo] **************** WARNING (SLING-443/SLING-1782) ******************************
     [echo] On most platforms, you'll get OutOfMemoryErrors when building unless you set
     [echo] on 32bit platforms: MAVEN_OPTS="-Xmx256M -XX:MaxPermSize=256M", see SLING-443
     [echo] on 64bit platforms: MAVEN_OPTS="-Xmx512M -XX:MaxPermSize=512M", see SLING-1782
     [echo] ******************************************************************************
[INFO] Executed tasks
[INFO] 
[INFO] --- build-helper-maven-plugin:1.8:reserve-network-port (reserve-network-port) @ org.apache.sling.launchpad.testing ---
[INFO] Reserved port 59845 for http.port
[INFO] Reserved port 44233 for sling.control.port
[INFO] 
[INFO] --- maven-compiler-plugin:3.1:compile (default-compile) @ org.apache.sling.launchpad.testing ---
[INFO] No sources to compile
[INFO] 
[INFO] --- maven-resources-plugin:2.6:testResources (default-testResources) @ org.apache.sling.launchpad.testing ---
[INFO] Using 'UTF-8' encoding to copy filtered resources.
[INFO] Copying 2 resources
[INFO] Copying 3 resources
[INFO] 
[INFO] --- maven-compiler-plugin:3.1:testCompile (default-testCompile) @ org.apache.sling.launchpad.testing ---
[INFO] No sources to compile
[INFO] 
[INFO] --- maven-surefire-plugin:2.17:test (default-test) @ org.apache.sling.launchpad.testing ---
[JENKINS] Recording test results[INFO] 
[INFO] --- animal-sniffer-maven-plugin:1.11:check (default) @ org.apache.sling.launchpad.testing ---

[INFO] Checking unresolved references to org.codehaus.mojo.signature:java15:1.0
[INFO] 
[INFO] --- maven-launchpad-plugin:2.3.0:prepare-package (prepare-package) @ org.apache.sling.launchpad.testing ---
[INFO] Using bundle list file from /home/jenkins/jenkins-slave/maven-repositories/0/org/apache/sling/org.apache.sling.launchpad/7-SNAPSHOT/org.apache.sling.launchpad-7-SNAPSHOT-bundlelist.xml
[INFO] Merging partial bundle list org.apache.sling:org.apache.sling.launchpad.test-bundles:0.0.1-SNAPSHOT
Downloading: http://repository.apache.org/snapshots/org/apache/sling/org.apache.sling.launchpad.test-bundles/0.0.1-SNAPSHOT/org.apache.sling.launchpad.test-bundles-0.0.1-SNAPSHOT-bundlelistconfig.zip
[INFO] Copying base artifact from /home/jenkins/jenkins-slave/maven-repositories/0/org/apache/sling/org.apache.sling.launchpad.base/4.4.1-2.5.2/org.apache.sling.launchpad.base-4.4.1-2.5.2.jar to <https://builds.apache.org/job/sling-oak-it-1.6/ws/launchpad-testing-oak/target/classes/resources/org.apache.sling.launchpad.base.jar.>
[INFO] Copying bundle from /home/jenkins/jenkins-slave/maven-repositories/0/org/slf4j/slf4j-api/1.7.6/slf4j-api-1.7.6.jar to <https://builds.apache.org/job/sling-oak-it-1.6/ws/launchpad-testing-oak/target/classes/resources/bundles/1/slf4j-api-1.7.6.jar>
[INFO] Copying bundle from /home/jenkins/jenkins-slave/maven-repositories/0/org/apache/sling/org.apache.sling.commons.log/4.0.0/org.apache.sling.commons.log-4.0.0.jar to <https://builds.apache.org/job/sling-oak-it-1.6/ws/launchpad-testing-oak/target/classes/resources/bundles/1/org.apache.sling.commons.log-4.0.0.jar>
[INFO] Copying bundle from /home/jenkins/jenkins-slave/maven-repositories/0/org/apache/sling/org.apache.sling.commons.logservice/1.0.2/org.apache.sling.commons.logservice-1.0.2.jar to <https://builds.apache.org/job/sling-oak-it-1.6/ws/launchpad-testing-oak/target/classes/resources/bundles/1/org.apache.sling.commons.logservice-1.0.2.jar>
[INFO] Copying bundle from /home/jenkins/jenkins-slave/maven-repositories/0/org/slf4j/jcl-over-slf4j/1.7.6/jcl-over-slf4j-1.7.6.jar to <https://builds.apache.org/job/sling-oak-it-1.6/ws/launchpad-testing-oak/target/classes/resources/bundles/1/jcl-over-slf4j-1.7.6.jar>
[INFO] Copying bundle from /home/jenkins/jenkins-slave/maven-repositories/0/org/slf4j/log4j-over-slf4j/1.7.6/log4j-over-slf4j-1.7.6.jar to <https://builds.apache.org/job/sling-oak-it-1.6/ws/launchpad-testing-oak/target/classes/resources/bundles/1/log4j-over-slf4j-1.7.6.jar>
[INFO] Copying bundle from /home/jenkins/jenkins-slave/maven-repositories/0/org/apache/sling/org.apache.sling.settings/1.3.2/org.apache.sling.settings-1.3.2.jar to <https://builds.apache.org/job/sling-oak-it-1.6/ws/launchpad-testing-oak/target/classes/resources/bundles/1/org.apache.sling.settings-1.3.2.jar>
[INFO] Copying bundle from /home/jenkins/jenkins-slave/maven-repositories/0/org/apache/sling/org.apache.sling.fragment.xml/1.0.2/org.apache.sling.fragment.xml-1.0.2.jar to <https://builds.apache.org/job/sling-oak-it-1.6/ws/launchpad-testing-oak/target/classes/resources/bundles/1/org.apache.sling.fragment.xml-1.0.2.jar>
[INFO] Copying bundle from /home/jenkins/jenkins-slave/maven-repositories/0/org/apache/sling/org.apache.sling.fragment.transaction/1.0.0/org.apache.sling.fragment.transaction-1.0.0.jar to <https://builds.apache.org/job/sling-oak-it-1.6/ws/launchpad-testing-oak/target/classes/resources/bundles/1/org.apache.sling.fragment.transaction-1.0.0.jar>
[INFO] Copying bundle from /home/jenkins/jenkins-slave/maven-repositories/0/org/apache/sling/org.apache.sling.javax.activation/0.1.0/org.apache.sling.javax.activation-0.1.0.jar to <https://builds.apache.org/job/sling-oak-it-1.6/ws/launchpad-testing-oak/target/classes/resources/bundles/1/org.apache.sling.javax.activation-0.1.0.jar>
[INFO] Copying bundle from /home/jenkins/jenkins-slave/maven-repositories/0/org/apache/sling/org.apache.sling.fragment.ws/1.0.2/org.apache.sling.fragment.ws-1.0.2.jar to <https://builds.apache.org/job/sling-oak-it-1.6/ws/launchpad-testing-oak/target/classes/resources/bundles/1/org.apache.sling.fragment.ws-1.0.2.jar>
[INFO] Copying bundle from /home/jenkins/jenkins-slave/maven-repositories/0/org/apache/sling/org.apache.sling.launchpad.installer/1.2.0/org.apache.sling.launchpad.installer-1.2.0.jar to <https://builds.apache.org/job/sling-oak-it-1.6/ws/launchpad-testing-oak/target/classes/resources/bundles/1/org.apache.sling.launchpad.installer-1.2.0.jar>
[INFO] Copying bundle from /home/jenkins/jenkins-slave/maven-repositories/0/org/apache/sling/org.apache.sling.installer.core/3.5.2/org.apache.sling.installer.core-3.5.2.jar to <https://builds.apache.org/job/sling-oak-it-1.6/ws/launchpad-testing-oak/target/classes/resources/bundles/1/org.apache.sling.installer.core-3.5.2.jar>
[INFO] Copying bundle from /home/jenkins/jenkins-slave/maven-repositories/0/org/apache/sling/org.apache.sling.installer.provider.file/1.0.2/org.apache.sling.installer.provider.file-1.0.2.jar to <https://builds.apache.org/job/sling-oak-it-1.6/ws/launchpad-testing-oak/target/classes/resources/bundles/1/org.apache.sling.installer.provider.file-1.0.2.jar>
[INFO] Copying bundle from /home/jenkins/jenkins-slave/maven-repositories/0/org/apache/felix/org.apache.felix.configadmin/1.6.0/org.apache.felix.configadmin-1.6.0.jar to <https://builds.apache.org/job/sling-oak-it-1.6/ws/launchpad-testing-oak/target/classes/resources/bundles/1/org.apache.felix.configadmin-1.6.0.jar>
[INFO] Copying bundle from /home/jenkins/jenkins-slave/maven-repositories/0/org/apache/felix/org.apache.felix.eventadmin/1.3.2/org.apache.felix.eventadmin-1.3.2.jar to <https://builds.apache.org/job/sling-oak-it-1.6/ws/launchpad-testing-oak/target/classes/resources/bundles/1/org.apache.felix.eventadmin-1.3.2.jar>
[INFO] Copying bundle from /home/jenkins/jenkins-slave/maven-repositories/0/org/apache/felix/org.apache.felix.http.jetty/2.2.2/org.apache.felix.http.jetty-2.2.2.jar to <https://builds.apache.org/job/sling-oak-it-1.6/ws/launchpad-testing-oak/target/classes/resources/bundles/1/org.apache.felix.http.jetty-2.2.2.jar>
[INFO] Copying bundle from /home/jenkins/jenkins-slave/maven-repositories/0/commons-io/commons-io/1.4/commons-io-1.4.jar to <https://builds.apache.org/job/sling-oak-it-1.6/ws/launchpad-testing-oak/target/classes/resources/bundles/0/commons-io-1.4.jar>
[INFO] Copying bundle from /home/jenkins/jenkins-slave/maven-repositories/0/commons-fileupload/commons-fileupload/1.3.1/commons-fileupload-1.3.1.jar to <https://builds.apache.org/job/sling-oak-it-1.6/ws/launchpad-testing-oak/target/classes/resources/bundles/0/commons-fileupload-1.3.1.jar>
[INFO] Copying bundle from /home/jenkins/jenkins-slave/maven-repositories/0/commons-collections/commons-collections/3.2.1/commons-collections-3.2.1.jar to <https://builds.apache.org/job/sling-oak-it-1.6/ws/launchpad-testing-oak/target/classes/resources/bundles/0/commons-collections-3.2.1.jar>
[INFO] Copying bundle from /home/jenkins/jenkins-slave/maven-repositories/0/commons-codec/commons-codec/1.9/commons-codec-1.9.jar to <https://builds.apache.org/job/sling-oak-it-1.6/ws/launchpad-testing-oak/target/classes/resources/bundles/0/commons-codec-1.9.jar>
[INFO] Copying bundle from /home/jenkins/jenkins-slave/maven-repositories/0/commons-lang/commons-lang/2.6/commons-lang-2.6.jar to <https://builds.apache.org/job/sling-oak-it-1.6/ws/launchpad-testing-oak/target/classes/resources/bundles/0/commons-lang-2.6.jar>
[INFO] Copying bundle from /home/jenkins/jenkins-slave/maven-repositories/0/org/apache/commons/commons-math/2.2/commons-math-2.2.jar to <https://builds.apache.org/job/sling-oak-it-1.6/ws/launchpad-testing-oak/target/classes/resources/bundles/0/commons-math-2.2.jar>
[INFO] Copying bundle from /home/jenkins/jenkins-slave/maven-repositories/0/commons-pool/commons-pool/1.6/commons-pool-1.6.jar to <https://builds.apache.org/job/sling-oak-it-1.6/ws/launchpad-testing-oak/target/classes/resources/bundles/0/commons-pool-1.6.jar>
[INFO] Copying bundle from /home/jenkins/jenkins-slave/maven-repositories/0/org/apache/servicemix/bundles/org.apache.servicemix.bundles.concurrent/1.3.4_1/org.apache.servicemix.bundles.concurrent-1.3.4_1.jar to <https://builds.apache.org/job/sling-oak-it-1.6/ws/launchpad-testing-oak/target/classes/resources/bundles/0/org.apache.servicemix.bundles.concurrent-1.3.4_1.jar>
[INFO] Copying bundle from /home/jenkins/jenkins-slave/maven-repositories/0/org/apache/geronimo/bundles/commons-httpclient/3.1_1/commons-httpclient-3.1_1.jar to <https://builds.apache.org/job/sling-oak-it-1.6/ws/launchpad-testing-oak/target/classes/resources/bundles/0/commons-httpclient-3.1_1.jar>
[INFO] Copying bundle from /home/jenkins/jenkins-slave/maven-repositories/0/org/apache/sling/org.apache.sling.commons.osgi/2.2.0/org.apache.sling.commons.osgi-2.2.0.jar to <https://builds.apache.org/job/sling-oak-it-1.6/ws/launchpad-testing-oak/target/classes/resources/bundles/0/org.apache.sling.commons.osgi-2.2.0.jar>
Downloading: http://repository.apache.org/snapshots/org/apache/sling/org.apache.sling.commons.mime/2.1.5-SNAPSHOT/maven-metadata.xml
Downloaded: http://repository.apache.org/snapshots/org/apache/sling/org.apache.sling.commons.mime/2.1.5-SNAPSHOT/maven-metadata.xml (1021 B at 2.3 KB/sec)
[INFO] Copying bundle from /home/jenkins/jenkins-slave/maven-repositories/0/org/apache/sling/org.apache.sling.commons.mime/2.1.5-SNAPSHOT/org.apache.sling.commons.mime-2.1.5-SNAPSHOT.jar to <https://builds.apache.org/job/sling-oak-it-1.6/ws/launchpad-testing-oak/target/classes/resources/bundles/0/org.apache.sling.commons.mime-2.1.5-SNAPSHOT.jar>
[INFO] Copying bundle from /home/jenkins/jenkins-slave/maven-repositories/0/org/apache/sling/org.apache.sling.commons.classloader/1.3.2/org.apache.sling.commons.classloader-1.3.2.jar to <https://builds.apache.org/job/sling-oak-it-1.6/ws/launchpad-testing-oak/target/classes/resources/bundles/0/org.apache.sling.commons.classloader-1.3.2.jar>
[INFO] Copying bundle from /home/jenkins/jenkins-slave/maven-repositories/0/org/apache/sling/org.apache.sling.commons.compiler/2.2.0/org.apache.sling.commons.compiler-2.2.0.jar to <https://builds.apache.org/job/sling-oak-it-1.6/ws/launchpad-testing-oak/target/classes/resources/bundles/0/org.apache.sling.commons.compiler-2.2.0.jar>
[INFO] Copying bundle from /home/jenkins/jenkins-slave/maven-repositories/0/org/apache/sling/org.apache.sling.commons.scheduler/2.4.2/org.apache.sling.commons.scheduler-2.4.2.jar to <https://builds.apache.org/job/sling-oak-it-1.6/ws/launchpad-testing-oak/target/classes/resources/bundles/0/org.apache.sling.commons.scheduler-2.4.2.jar>
[INFO] Copying bundle from /home/jenkins/jenkins-slave/maven-repositories/0/org/apache/sling/org.apache.sling.commons.threads/3.2.0/org.apache.sling.commons.threads-3.2.0.jar to <https://builds.apache.org/job/sling-oak-it-1.6/ws/launchpad-testing-oak/target/classes/resources/bundles/0/org.apache.sling.commons.threads-3.2.0.jar>
[INFO] Copying bundle from /home/jenkins/jenkins-slave/maven-repositories/0/org/apache/sling/org.apache.sling.discovery.api/1.0.0/org.apache.sling.discovery.api-1.0.0.jar to <https://builds.apache.org/job/sling-oak-it-1.6/ws/launchpad-testing-oak/target/classes/resources/bundles/0/org.apache.sling.discovery.api-1.0.0.jar>
[INFO] Copying bundle from /home/jenkins/jenkins-slave/maven-repositories/0/org/apache/sling/org.apache.sling.discovery.support/1.0.0/org.apache.sling.discovery.support-1.0.0.jar to <https://builds.apache.org/job/sling-oak-it-1.6/ws/launchpad-testing-oak/target/classes/resources/bundles/0/org.apache.sling.discovery.support-1.0.0.jar>
[INFO] Copying bundle from /home/jenkins/jenkins-slave/maven-repositories/0/org/apache/sling/org.apache.sling.discovery.impl/1.0.8/org.apache.sling.discovery.impl-1.0.8.jar to <https://builds.apache.org/job/sling-oak-it-1.6/ws/launchpad-testing-oak/target/classes/resources/bundles/0/org.apache.sling.discovery.impl-1.0.8.jar>
[INFO] Copying bundle from /home/jenkins/jenkins-slave/maven-repositories/0/org/apache/sling/org.apache.sling.event/3.3.10/org.apache.sling.event-3.3.10.jar to <https://builds.apache.org/job/sling-oak-it-1.6/ws/launchpad-testing-oak/target/classes/resources/bundles/0/org.apache.sling.event-3.3.10.jar>
[INFO] Copying bundle from /home/jenkins/jenkins-slave/maven-repositories/0/org/apache/sling/org.apache.sling.api/2.7.0/org.apache.sling.api-2.7.0.jar to <https://builds.apache.org/job/sling-oak-it-1.6/ws/launchpad-testing-oak/target/classes/resources/bundles/0/org.apache.sling.api-2.7.0.jar>
[INFO] Copying bundle from /home/jenkins/jenkins-slave/maven-repositories/0/org/apache/sling/org.apache.sling.serviceusermapper/1.0.2/org.apache.sling.serviceusermapper-1.0.2.jar to <https://builds.apache.org/job/sling-oak-it-1.6/ws/launchpad-testing-oak/target/classes/resources/bundles/0/org.apache.sling.serviceusermapper-1.0.2.jar>
Downloading: http://repository.apache.org/snapshots/org/apache/sling/org.apache.sling.resourceresolver/1.1.1-SNAPSHOT/maven-metadata.xml
Downloaded: http://repository.apache.org/snapshots/org/apache/sling/org.apache.sling.resourceresolver/1.1.1-SNAPSHOT/maven-metadata.xml (1013 B at 5.6 KB/sec)
[INFO] Copying bundle from /home/jenkins/jenkins-slave/maven-repositories/0/org/apache/sling/org.apache.sling.resourceresolver/1.1.1-SNAPSHOT/org.apache.sling.resourceresolver-1.1.1-SNAPSHOT.jar to <https://builds.apache.org/job/sling-oak-it-1.6/ws/launchpad-testing-oak/target/classes/resources/bundles/0/org.apache.sling.resourceresolver-1.1.1-SNAPSHOT.jar>
Downloading: http://repository.apache.org/snapshots/org/apache/sling/org.apache.sling.auth.core/1.1.7-SNAPSHOT/maven-metadata.xml
Downloaded: http://repository.apache.org/snapshots/org/apache/sling/org.apache.sling.auth.core/1.1.7-SNAPSHOT/maven-metadata.xml (1006 B at 2.6 KB/sec)
[INFO] Copying bundle from /home/jenkins/jenkins-slave/maven-repositories/0/org/apache/sling/org.apache.sling.auth.core/1.1.7-SNAPSHOT/org.apache.sling.auth.core-1.1.7-SNAPSHOT.jar to <https://builds.apache.org/job/sling-oak-it-1.6/ws/launchpad-testing-oak/target/classes/resources/bundles/0/org.apache.sling.auth.core-1.1.7-SNAPSHOT.jar>
Downloading: http://repository.apache.org/snapshots/org/apache/sling/org.apache.sling.engine/2.3.5-SNAPSHOT/maven-metadata.xml
Downloading: http://repository.apache.org/snapshots/org/apache/sling/org.apache.sling.engine/2.3.5-SNAPSHOT/org.apache.sling.engine-2.3.5-SNAPSHOT.jar
[JENKINS] Archiving disabled
[INFO] ------------------------------------------------------------------------
[INFO] BUILD FAILURE
[INFO] ------------------------------------------------------------------------
[INFO] Total time: 32.413s
[INFO] Finished at: Mon Oct 06 11:46:16 UTC 2014
[INFO] Final Memory: 19M/205M
[INFO] ------------------------------------------------------------------------
[JENKINS] Archiving disabled
Waiting for Jenkins to finish collecting data
[ERROR] Failed to execute goal org.apache.sling:maven-launchpad-plugin:2.3.0:prepare-package (prepare-package) on project org.apache.sling.launchpad.testing: Unable to find artifact. Could not find artifact org.apache.sling:org.apache.sling.engine:jar:2.3.5-SNAPSHOT in Nexus (http://repository.apache.org/snapshots)
[ERROR] 
[ERROR] Try downloading the file manually from the project website.
[ERROR] 
[ERROR] Then, install it using the command:
[ERROR] mvn install:install-file -DgroupId=org.apache.sling -DartifactId=org.apache.sling.engine -Dversion=2.3.5-SNAPSHOT -Dpackaging=jar -Dfile=/path/to/file
[ERROR] 
[ERROR] Alternatively, if you host your own repository you can deploy the file there:
[ERROR] mvn deploy:deploy-file -DgroupId=org.apache.sling -DartifactId=org.apache.sling.engine -Dversion=2.3.5-SNAPSHOT -Dpackaging=jar -Dfile=/path/to/file -Durl=[url] -DrepositoryId=[id]
[ERROR] 
[ERROR] 
[ERROR] org.apache.sling:org.apache.sling.engine:jar:2.3.5-SNAPSHOT
[ERROR] 
[ERROR] from the specified remote repositories:
[ERROR] Nexus (http://repository.apache.org/snapshots, releases=false, snapshots=true),
[ERROR] central (http://repo.maven.apache.org/maven2, releases=true, snapshots=false)
[ERROR] -> [Help 1]
[ERROR] 
[ERROR] To see the full stack trace of the errors, re-run Maven with the -e switch.
[ERROR] Re-run Maven using the -X switch to enable full debug logging.
[ERROR] 
[ERROR] For more information about the errors and possible solutions, please read the following articles:
[ERROR] [Help 1] http://cwiki.apache.org/confluence/display/MAVEN/MojoExecutionException
Sending e-mails to: dev@sling.apache.org
channel stopped

Build failed in Jenkins: sling-oak-it-1.6 #156

Posted by Apache Jenkins Server <je...@builds.apache.org>.
See <https://builds.apache.org/job/sling-oak-it-1.6/156/>

------------------------------------------
Started by upstream project "sling-trunk-1.6" build number 2590
originally caused by:
 Started by an SCM change
Building remotely on ubuntu-6 (Ubuntu ubuntu) in workspace <https://builds.apache.org/job/sling-oak-it-1.6/ws/>
Updating http://svn.apache.org/repos/asf/sling/trunk/launchpad/testing at revision '2014-10-04T10:46:01.099 +0000'
At revision 1629370
no change for http://svn.apache.org/repos/asf/sling/trunk/launchpad/testing since the previous build
Parsing POMs
maven3-agent.jar already up to date
maven3-interceptor.jar already up to date
maven3-interceptor-commons.jar already up to date
[launchpad-testing-oak] $ /home/jenkins/tools/java/latest1.6/bin/java -Xmx512M -XX:MaxPermSize=256M -enableassertions -cp /home/jenkins/jenkins-slave/maven3-agent.jar:/home/jenkins/jenkins-slave/tools/hudson.tasks.Maven_MavenInstallation/Maven_3.0.5/boot/plexus-classworlds-2.4.jar org.jvnet.hudson.maven3.agent.Maven3Main /home/jenkins/jenkins-slave/tools/hudson.tasks.Maven_MavenInstallation/Maven_3.0.5 /home/jenkins/jenkins-slave/slave.jar /home/jenkins/jenkins-slave/maven3-interceptor.jar /home/jenkins/jenkins-slave/maven3-interceptor-commons.jar 55355
<===[JENKINS REMOTchannel started
ING CAPACITY]===>   log4j:WARN No appenders could be found for logger (org.apache.commons.beanutils.converters.BooleanConverter).
log4j:WARN Please initialize the log4j system properly.
Executing Maven:  -B -f <https://builds.apache.org/job/sling-oak-it-1.6/ws/launchpad-testing-oak/pom.xml> -Dmaven.repo.local=/home/jenkins/jenkins-slave/maven-repositories/0 clean install -Dsling.run.modes=oak
[INFO] Scanning for projects...
[INFO]                                                                         
[INFO] ------------------------------------------------------------------------
[INFO] Building Apache Sling Launchpad Testing 7-SNAPSHOT
[INFO] ------------------------------------------------------------------------
Downloading: http://repository.apache.org/snapshots/org/apache/sling/org.apache.sling.launchpad.integration-tests/1.0.1-SNAPSHOT/maven-metadata.xml
Downloaded: http://repository.apache.org/snapshots/org/apache/sling/org.apache.sling.launchpad.integration-tests/1.0.1-SNAPSHOT/maven-metadata.xml (2 KB at 0.4 KB/sec)
Downloading: http://repository.apache.org/snapshots/org/apache/sling/org.apache.sling.commons.testing/2.0.15-SNAPSHOT/maven-metadata.xml
Downloaded: http://repository.apache.org/snapshots/org/apache/sling/org.apache.sling.commons.testing/2.0.15-SNAPSHOT/maven-metadata.xml (1016 B at 2.2 KB/sec)
Downloading: http://repository.apache.org/snapshots/org/apache/sling/org.apache.sling.junit.remote/1.0.9-SNAPSHOT/maven-metadata.xml
Downloaded: http://repository.apache.org/snapshots/org/apache/sling/org.apache.sling.junit.remote/1.0.9-SNAPSHOT/maven-metadata.xml (2 KB at 0.3 KB/sec)
Downloading: http://repository.apache.org/snapshots/org/apache/sling/org.apache.sling.launchpad.test-bundles/0.0.1-SNAPSHOT/maven-metadata.xml
Downloaded: http://repository.apache.org/snapshots/org/apache/sling/org.apache.sling.launchpad.test-bundles/0.0.1-SNAPSHOT/maven-metadata.xml (2 KB at 1.0 KB/sec)
Downloading: http://repository.apache.org/snapshots/org/apache/sling/org.apache.sling.launchpad/7-SNAPSHOT/maven-metadata.xml
[INFO] 
[INFO] --- maven-clean-plugin:2.5:clean (default-clean) @ org.apache.sling.launchpad.testing ---
[INFO] Deleting <https://builds.apache.org/job/sling-oak-it-1.6/ws/launchpad-testing-oak/target>
[INFO] Deleting <https://builds.apache.org/job/sling-oak-it-1.6/ws/launchpad-testing-oak> (includes = [derby.log, cachedir, sling/**, jackrabbit, coverage.ec], excludes = [])
[INFO] 
[INFO] --- maven-enforcer-plugin:1.3.1:enforce (enforce-java) @ org.apache.sling.launchpad.testing ---
[INFO] 
[INFO] --- maven-antrun-plugin:1.7:run (set-bundle-required-execution-environment) @ org.apache.sling.launchpad.testing ---
[INFO] Executing tasks

main:
[INFO] Executed tasks
[INFO] 
[INFO] --- maven-remote-resources-plugin:1.5:process (default) @ org.apache.sling.launchpad.testing ---
[INFO] 
[INFO] --- maven-resources-plugin:2.6:resources (default-resources) @ org.apache.sling.launchpad.testing ---
[INFO] Using 'UTF-8' encoding to copy filtered resources.
[INFO] Copying 1 resource
[INFO] Copying 3 resources
[INFO] 
[INFO] --- maven-antrun-plugin:1.7:run (check-memory-task) @ org.apache.sling.launchpad.testing ---
[INFO] Executing tasks

main:
     [echo] **************** WARNING (SLING-443/SLING-1782) ******************************
     [echo] On most platforms, you'll get OutOfMemoryErrors when building unless you set
     [echo] on 32bit platforms: MAVEN_OPTS="-Xmx256M -XX:MaxPermSize=256M", see SLING-443
     [echo] on 64bit platforms: MAVEN_OPTS="-Xmx512M -XX:MaxPermSize=512M", see SLING-1782
     [echo] ******************************************************************************
[INFO] Executed tasks
[INFO] 
[INFO] --- build-helper-maven-plugin:1.8:reserve-network-port (reserve-network-port) @ org.apache.sling.launchpad.testing ---
[INFO] Reserved port 55705 for http.port
[INFO] Reserved port 53198 for sling.control.port
[INFO] 
[INFO] --- maven-compiler-plugin:3.1:compile (default-compile) @ org.apache.sling.launchpad.testing ---
[INFO] No sources to compile
[INFO] 
[INFO] --- maven-resources-plugin:2.6:testResources (default-testResources) @ org.apache.sling.launchpad.testing ---
[INFO] Using 'UTF-8' encoding to copy filtered resources.
[INFO] Copying 2 resources
[INFO] Copying 3 resources
[INFO] 
[INFO] --- maven-compiler-plugin:3.1:testCompile (default-testCompile) @ org.apache.sling.launchpad.testing ---
[INFO] No sources to compile
[INFO] 
[INFO] --- maven-surefire-plugin:2.17:test (default-test) @ org.apache.sling.launchpad.testing ---
[JENKINS] Recording test results[INFO] 
[INFO] --- animal-sniffer-maven-plugin:1.11:check (default) @ org.apache.sling.launchpad.testing ---

[INFO] Checking unresolved references to org.codehaus.mojo.signature:java15:1.0
[INFO] 
[INFO] --- maven-launchpad-plugin:2.3.0:prepare-package (prepare-package) @ org.apache.sling.launchpad.testing ---
[INFO] Using bundle list file from /home/jenkins/jenkins-slave/maven-repositories/0/org/apache/sling/org.apache.sling.launchpad/7-SNAPSHOT/org.apache.sling.launchpad-7-SNAPSHOT-bundlelist.xml
[INFO] Merging partial bundle list org.apache.sling:org.apache.sling.launchpad.test-bundles:0.0.1-SNAPSHOT
Downloading: http://repository.apache.org/snapshots/org/apache/sling/org.apache.sling.launchpad.test-bundles/0.0.1-SNAPSHOT/org.apache.sling.launchpad.test-bundles-0.0.1-SNAPSHOT-bundlelistconfig.zip
[INFO] Copying base artifact from /home/jenkins/jenkins-slave/maven-repositories/0/org/apache/sling/org.apache.sling.launchpad.base/4.4.1-2.5.2/org.apache.sling.launchpad.base-4.4.1-2.5.2.jar to <https://builds.apache.org/job/sling-oak-it-1.6/ws/launchpad-testing-oak/target/classes/resources/org.apache.sling.launchpad.base.jar.>
[INFO] Copying bundle from /home/jenkins/jenkins-slave/maven-repositories/0/org/slf4j/slf4j-api/1.7.6/slf4j-api-1.7.6.jar to <https://builds.apache.org/job/sling-oak-it-1.6/ws/launchpad-testing-oak/target/classes/resources/bundles/1/slf4j-api-1.7.6.jar>
[INFO] Copying bundle from /home/jenkins/jenkins-slave/maven-repositories/0/org/apache/sling/org.apache.sling.commons.log/4.0.0/org.apache.sling.commons.log-4.0.0.jar to <https://builds.apache.org/job/sling-oak-it-1.6/ws/launchpad-testing-oak/target/classes/resources/bundles/1/org.apache.sling.commons.log-4.0.0.jar>
[INFO] Copying bundle from /home/jenkins/jenkins-slave/maven-repositories/0/org/apache/sling/org.apache.sling.commons.logservice/1.0.2/org.apache.sling.commons.logservice-1.0.2.jar to <https://builds.apache.org/job/sling-oak-it-1.6/ws/launchpad-testing-oak/target/classes/resources/bundles/1/org.apache.sling.commons.logservice-1.0.2.jar>
[INFO] Copying bundle from /home/jenkins/jenkins-slave/maven-repositories/0/org/slf4j/jcl-over-slf4j/1.7.6/jcl-over-slf4j-1.7.6.jar to <https://builds.apache.org/job/sling-oak-it-1.6/ws/launchpad-testing-oak/target/classes/resources/bundles/1/jcl-over-slf4j-1.7.6.jar>
[INFO] Copying bundle from /home/jenkins/jenkins-slave/maven-repositories/0/org/slf4j/log4j-over-slf4j/1.7.6/log4j-over-slf4j-1.7.6.jar to <https://builds.apache.org/job/sling-oak-it-1.6/ws/launchpad-testing-oak/target/classes/resources/bundles/1/log4j-over-slf4j-1.7.6.jar>
[INFO] Copying bundle from /home/jenkins/jenkins-slave/maven-repositories/0/org/apache/sling/org.apache.sling.settings/1.3.2/org.apache.sling.settings-1.3.2.jar to <https://builds.apache.org/job/sling-oak-it-1.6/ws/launchpad-testing-oak/target/classes/resources/bundles/1/org.apache.sling.settings-1.3.2.jar>
[INFO] Copying bundle from /home/jenkins/jenkins-slave/maven-repositories/0/org/apache/sling/org.apache.sling.fragment.xml/1.0.2/org.apache.sling.fragment.xml-1.0.2.jar to <https://builds.apache.org/job/sling-oak-it-1.6/ws/launchpad-testing-oak/target/classes/resources/bundles/1/org.apache.sling.fragment.xml-1.0.2.jar>
[INFO] Copying bundle from /home/jenkins/jenkins-slave/maven-repositories/0/org/apache/sling/org.apache.sling.fragment.transaction/1.0.0/org.apache.sling.fragment.transaction-1.0.0.jar to <https://builds.apache.org/job/sling-oak-it-1.6/ws/launchpad-testing-oak/target/classes/resources/bundles/1/org.apache.sling.fragment.transaction-1.0.0.jar>
[INFO] Copying bundle from /home/jenkins/jenkins-slave/maven-repositories/0/org/apache/sling/org.apache.sling.javax.activation/0.1.0/org.apache.sling.javax.activation-0.1.0.jar to <https://builds.apache.org/job/sling-oak-it-1.6/ws/launchpad-testing-oak/target/classes/resources/bundles/1/org.apache.sling.javax.activation-0.1.0.jar>
[INFO] Copying bundle from /home/jenkins/jenkins-slave/maven-repositories/0/org/apache/sling/org.apache.sling.fragment.ws/1.0.2/org.apache.sling.fragment.ws-1.0.2.jar to <https://builds.apache.org/job/sling-oak-it-1.6/ws/launchpad-testing-oak/target/classes/resources/bundles/1/org.apache.sling.fragment.ws-1.0.2.jar>
[INFO] Copying bundle from /home/jenkins/jenkins-slave/maven-repositories/0/org/apache/sling/org.apache.sling.launchpad.installer/1.2.0/org.apache.sling.launchpad.installer-1.2.0.jar to <https://builds.apache.org/job/sling-oak-it-1.6/ws/launchpad-testing-oak/target/classes/resources/bundles/1/org.apache.sling.launchpad.installer-1.2.0.jar>
[INFO] Copying bundle from /home/jenkins/jenkins-slave/maven-repositories/0/org/apache/sling/org.apache.sling.installer.core/3.5.2/org.apache.sling.installer.core-3.5.2.jar to <https://builds.apache.org/job/sling-oak-it-1.6/ws/launchpad-testing-oak/target/classes/resources/bundles/1/org.apache.sling.installer.core-3.5.2.jar>
[INFO] Copying bundle from /home/jenkins/jenkins-slave/maven-repositories/0/org/apache/sling/org.apache.sling.installer.provider.file/1.0.2/org.apache.sling.installer.provider.file-1.0.2.jar to <https://builds.apache.org/job/sling-oak-it-1.6/ws/launchpad-testing-oak/target/classes/resources/bundles/1/org.apache.sling.installer.provider.file-1.0.2.jar>
[INFO] Copying bundle from /home/jenkins/jenkins-slave/maven-repositories/0/org/apache/felix/org.apache.felix.configadmin/1.6.0/org.apache.felix.configadmin-1.6.0.jar to <https://builds.apache.org/job/sling-oak-it-1.6/ws/launchpad-testing-oak/target/classes/resources/bundles/1/org.apache.felix.configadmin-1.6.0.jar>
[INFO] Copying bundle from /home/jenkins/jenkins-slave/maven-repositories/0/org/apache/felix/org.apache.felix.eventadmin/1.3.2/org.apache.felix.eventadmin-1.3.2.jar to <https://builds.apache.org/job/sling-oak-it-1.6/ws/launchpad-testing-oak/target/classes/resources/bundles/1/org.apache.felix.eventadmin-1.3.2.jar>
[INFO] Copying bundle from /home/jenkins/jenkins-slave/maven-repositories/0/org/apache/felix/org.apache.felix.http.jetty/2.2.2/org.apache.felix.http.jetty-2.2.2.jar to <https://builds.apache.org/job/sling-oak-it-1.6/ws/launchpad-testing-oak/target/classes/resources/bundles/1/org.apache.felix.http.jetty-2.2.2.jar>
[INFO] Copying bundle from /home/jenkins/jenkins-slave/maven-repositories/0/commons-io/commons-io/1.4/commons-io-1.4.jar to <https://builds.apache.org/job/sling-oak-it-1.6/ws/launchpad-testing-oak/target/classes/resources/bundles/0/commons-io-1.4.jar>
[INFO] Copying bundle from /home/jenkins/jenkins-slave/maven-repositories/0/commons-fileupload/commons-fileupload/1.3.1/commons-fileupload-1.3.1.jar to <https://builds.apache.org/job/sling-oak-it-1.6/ws/launchpad-testing-oak/target/classes/resources/bundles/0/commons-fileupload-1.3.1.jar>
[INFO] Copying bundle from /home/jenkins/jenkins-slave/maven-repositories/0/commons-collections/commons-collections/3.2.1/commons-collections-3.2.1.jar to <https://builds.apache.org/job/sling-oak-it-1.6/ws/launchpad-testing-oak/target/classes/resources/bundles/0/commons-collections-3.2.1.jar>
[INFO] Copying bundle from /home/jenkins/jenkins-slave/maven-repositories/0/commons-codec/commons-codec/1.9/commons-codec-1.9.jar to <https://builds.apache.org/job/sling-oak-it-1.6/ws/launchpad-testing-oak/target/classes/resources/bundles/0/commons-codec-1.9.jar>
[INFO] Copying bundle from /home/jenkins/jenkins-slave/maven-repositories/0/commons-lang/commons-lang/2.6/commons-lang-2.6.jar to <https://builds.apache.org/job/sling-oak-it-1.6/ws/launchpad-testing-oak/target/classes/resources/bundles/0/commons-lang-2.6.jar>
[INFO] Copying bundle from /home/jenkins/jenkins-slave/maven-repositories/0/org/apache/commons/commons-math/2.2/commons-math-2.2.jar to <https://builds.apache.org/job/sling-oak-it-1.6/ws/launchpad-testing-oak/target/classes/resources/bundles/0/commons-math-2.2.jar>
[INFO] Copying bundle from /home/jenkins/jenkins-slave/maven-repositories/0/commons-pool/commons-pool/1.6/commons-pool-1.6.jar to <https://builds.apache.org/job/sling-oak-it-1.6/ws/launchpad-testing-oak/target/classes/resources/bundles/0/commons-pool-1.6.jar>
[INFO] Copying bundle from /home/jenkins/jenkins-slave/maven-repositories/0/org/apache/servicemix/bundles/org.apache.servicemix.bundles.concurrent/1.3.4_1/org.apache.servicemix.bundles.concurrent-1.3.4_1.jar to <https://builds.apache.org/job/sling-oak-it-1.6/ws/launchpad-testing-oak/target/classes/resources/bundles/0/org.apache.servicemix.bundles.concurrent-1.3.4_1.jar>
[INFO] Copying bundle from /home/jenkins/jenkins-slave/maven-repositories/0/org/apache/geronimo/bundles/commons-httpclient/3.1_1/commons-httpclient-3.1_1.jar to <https://builds.apache.org/job/sling-oak-it-1.6/ws/launchpad-testing-oak/target/classes/resources/bundles/0/commons-httpclient-3.1_1.jar>
[INFO] Copying bundle from /home/jenkins/jenkins-slave/maven-repositories/0/org/apache/sling/org.apache.sling.commons.osgi/2.2.0/org.apache.sling.commons.osgi-2.2.0.jar to <https://builds.apache.org/job/sling-oak-it-1.6/ws/launchpad-testing-oak/target/classes/resources/bundles/0/org.apache.sling.commons.osgi-2.2.0.jar>
Downloading: http://repository.apache.org/snapshots/org/apache/sling/org.apache.sling.commons.mime/2.1.5-SNAPSHOT/maven-metadata.xml
Downloaded: http://repository.apache.org/snapshots/org/apache/sling/org.apache.sling.commons.mime/2.1.5-SNAPSHOT/maven-metadata.xml (1021 B at 0.3 KB/sec)
[INFO] Copying bundle from /home/jenkins/jenkins-slave/maven-repositories/0/org/apache/sling/org.apache.sling.commons.mime/2.1.5-SNAPSHOT/org.apache.sling.commons.mime-2.1.5-SNAPSHOT.jar to <https://builds.apache.org/job/sling-oak-it-1.6/ws/launchpad-testing-oak/target/classes/resources/bundles/0/org.apache.sling.commons.mime-2.1.5-SNAPSHOT.jar>
[INFO] Copying bundle from /home/jenkins/jenkins-slave/maven-repositories/0/org/apache/sling/org.apache.sling.commons.classloader/1.3.2/org.apache.sling.commons.classloader-1.3.2.jar to <https://builds.apache.org/job/sling-oak-it-1.6/ws/launchpad-testing-oak/target/classes/resources/bundles/0/org.apache.sling.commons.classloader-1.3.2.jar>
[INFO] Copying bundle from /home/jenkins/jenkins-slave/maven-repositories/0/org/apache/sling/org.apache.sling.commons.compiler/2.2.0/org.apache.sling.commons.compiler-2.2.0.jar to <https://builds.apache.org/job/sling-oak-it-1.6/ws/launchpad-testing-oak/target/classes/resources/bundles/0/org.apache.sling.commons.compiler-2.2.0.jar>
[INFO] Copying bundle from /home/jenkins/jenkins-slave/maven-repositories/0/org/apache/sling/org.apache.sling.commons.scheduler/2.4.2/org.apache.sling.commons.scheduler-2.4.2.jar to <https://builds.apache.org/job/sling-oak-it-1.6/ws/launchpad-testing-oak/target/classes/resources/bundles/0/org.apache.sling.commons.scheduler-2.4.2.jar>
[INFO] Copying bundle from /home/jenkins/jenkins-slave/maven-repositories/0/org/apache/sling/org.apache.sling.commons.threads/3.2.0/org.apache.sling.commons.threads-3.2.0.jar to <https://builds.apache.org/job/sling-oak-it-1.6/ws/launchpad-testing-oak/target/classes/resources/bundles/0/org.apache.sling.commons.threads-3.2.0.jar>
[INFO] Copying bundle from /home/jenkins/jenkins-slave/maven-repositories/0/org/apache/sling/org.apache.sling.discovery.api/1.0.0/org.apache.sling.discovery.api-1.0.0.jar to <https://builds.apache.org/job/sling-oak-it-1.6/ws/launchpad-testing-oak/target/classes/resources/bundles/0/org.apache.sling.discovery.api-1.0.0.jar>
[INFO] Copying bundle from /home/jenkins/jenkins-slave/maven-repositories/0/org/apache/sling/org.apache.sling.discovery.support/1.0.0/org.apache.sling.discovery.support-1.0.0.jar to <https://builds.apache.org/job/sling-oak-it-1.6/ws/launchpad-testing-oak/target/classes/resources/bundles/0/org.apache.sling.discovery.support-1.0.0.jar>
[INFO] Copying bundle from /home/jenkins/jenkins-slave/maven-repositories/0/org/apache/sling/org.apache.sling.discovery.impl/1.0.8/org.apache.sling.discovery.impl-1.0.8.jar to <https://builds.apache.org/job/sling-oak-it-1.6/ws/launchpad-testing-oak/target/classes/resources/bundles/0/org.apache.sling.discovery.impl-1.0.8.jar>
[INFO] Copying bundle from /home/jenkins/jenkins-slave/maven-repositories/0/org/apache/sling/org.apache.sling.event/3.3.10/org.apache.sling.event-3.3.10.jar to <https://builds.apache.org/job/sling-oak-it-1.6/ws/launchpad-testing-oak/target/classes/resources/bundles/0/org.apache.sling.event-3.3.10.jar>
[INFO] Copying bundle from /home/jenkins/jenkins-slave/maven-repositories/0/org/apache/sling/org.apache.sling.api/2.7.0/org.apache.sling.api-2.7.0.jar to <https://builds.apache.org/job/sling-oak-it-1.6/ws/launchpad-testing-oak/target/classes/resources/bundles/0/org.apache.sling.api-2.7.0.jar>
[INFO] Copying bundle from /home/jenkins/jenkins-slave/maven-repositories/0/org/apache/sling/org.apache.sling.serviceusermapper/1.0.2/org.apache.sling.serviceusermapper-1.0.2.jar to <https://builds.apache.org/job/sling-oak-it-1.6/ws/launchpad-testing-oak/target/classes/resources/bundles/0/org.apache.sling.serviceusermapper-1.0.2.jar>
Downloading: http://repository.apache.org/snapshots/org/apache/sling/org.apache.sling.resourceresolver/1.1.1-SNAPSHOT/maven-metadata.xml
Downloaded: http://repository.apache.org/snapshots/org/apache/sling/org.apache.sling.resourceresolver/1.1.1-SNAPSHOT/maven-metadata.xml (1013 B at 1.0 KB/sec)
[INFO] Copying bundle from /home/jenkins/jenkins-slave/maven-repositories/0/org/apache/sling/org.apache.sling.resourceresolver/1.1.1-SNAPSHOT/org.apache.sling.resourceresolver-1.1.1-SNAPSHOT.jar to <https://builds.apache.org/job/sling-oak-it-1.6/ws/launchpad-testing-oak/target/classes/resources/bundles/0/org.apache.sling.resourceresolver-1.1.1-SNAPSHOT.jar>
Downloading: http://repository.apache.org/snapshots/org/apache/sling/org.apache.sling.auth.core/1.1.7-SNAPSHOT/maven-metadata.xml
Downloaded: http://repository.apache.org/snapshots/org/apache/sling/org.apache.sling.auth.core/1.1.7-SNAPSHOT/maven-metadata.xml (1006 B at 0.5 KB/sec)
[INFO] Copying bundle from /home/jenkins/jenkins-slave/maven-repositories/0/org/apache/sling/org.apache.sling.auth.core/1.1.7-SNAPSHOT/org.apache.sling.auth.core-1.1.7-SNAPSHOT.jar to <https://builds.apache.org/job/sling-oak-it-1.6/ws/launchpad-testing-oak/target/classes/resources/bundles/0/org.apache.sling.auth.core-1.1.7-SNAPSHOT.jar>
Downloading: http://repository.apache.org/snapshots/org/apache/sling/org.apache.sling.engine/2.3.5-SNAPSHOT/maven-metadata.xml
Downloading: http://repository.apache.org/snapshots/org/apache/sling/org.apache.sling.engine/2.3.5-SNAPSHOT/org.apache.sling.engine-2.3.5-SNAPSHOT.jar
[JENKINS] Archiving disabled
[INFO] ------------------------------------------------------------------------
[INFO] BUILD FAILURE
[INFO] ------------------------------------------------------------------------
[INFO] Total time: 52.938s
[INFO] Finished at: Sat Oct 04 10:47:17 UTC 2014
[INFO] Final Memory: 18M/135M
[INFO] ------------------------------------------------------------------------
[JENKINS] Archiving disabled
Waiting for Jenkins to finish collecting data
[ERROR] Failed to execute goal org.apache.sling:maven-launchpad-plugin:2.3.0:prepare-package (prepare-package) on project org.apache.sling.launchpad.testing: Unable to find artifact. Could not find artifact org.apache.sling:org.apache.sling.engine:jar:2.3.5-SNAPSHOT in Nexus (http://repository.apache.org/snapshots)
[ERROR] 
[ERROR] Try downloading the file manually from the project website.
[ERROR] 
[ERROR] Then, install it using the command:
[ERROR] mvn install:install-file -DgroupId=org.apache.sling -DartifactId=org.apache.sling.engine -Dversion=2.3.5-SNAPSHOT -Dpackaging=jar -Dfile=/path/to/file
[ERROR] 
[ERROR] Alternatively, if you host your own repository you can deploy the file there:
[ERROR] mvn deploy:deploy-file -DgroupId=org.apache.sling -DartifactId=org.apache.sling.engine -Dversion=2.3.5-SNAPSHOT -Dpackaging=jar -Dfile=/path/to/file -Durl=[url] -DrepositoryId=[id]
[ERROR] 
[ERROR] 
[ERROR] org.apache.sling:org.apache.sling.engine:jar:2.3.5-SNAPSHOT
[ERROR] 
[ERROR] from the specified remote repositories:
[ERROR] Nexus (http://repository.apache.org/snapshots, releases=false, snapshots=true),
[ERROR] central (http://repo.maven.apache.org/maven2, releases=true, snapshots=false)
[ERROR] -> [Help 1]
[ERROR] 
[ERROR] To see the full stack trace of the errors, re-run Maven with the -e switch.
[ERROR] Re-run Maven using the -X switch to enable full debug logging.
[ERROR] 
[ERROR] For more information about the errors and possible solutions, please read the following articles:
[ERROR] [Help 1] http://cwiki.apache.org/confluence/display/MAVEN/MojoExecutionException
Sending e-mails to: dev@sling.apache.org
channel stopped

Build failed in Jenkins: sling-oak-it-1.6 #155

Posted by Apache Jenkins Server <je...@builds.apache.org>.
See <https://builds.apache.org/job/sling-oak-it-1.6/155/>

------------------------------------------
Started by upstream project "sling-trunk-1.6" build number 2587
originally caused by:
 Started by an SCM change
Building remotely on ubuntu-6 (Ubuntu ubuntu) in workspace <https://builds.apache.org/job/sling-oak-it-1.6/ws/>
Updating http://svn.apache.org/repos/asf/sling/trunk/launchpad/testing at revision '2014-10-03T10:46:46.334 +0000'
At revision 1629180
no change for http://svn.apache.org/repos/asf/sling/trunk/launchpad/testing since the previous build
Parsing POMs
maven3-agent.jar already up to date
maven3-interceptor.jar already up to date
maven3-interceptor-commons.jar already up to date
[launchpad-testing-oak] $ /home/jenkins/tools/java/latest1.6/bin/java -Xmx512M -XX:MaxPermSize=256M -enableassertions -cp /home/jenkins/jenkins-slave/maven3-agent.jar:/home/jenkins/jenkins-slave/tools/hudson.tasks.Maven_MavenInstallation/Maven_3.0.5/boot/plexus-classworlds-2.4.jar org.jvnet.hudson.maven3.agent.Maven3Main /home/jenkins/jenkins-slave/tools/hudson.tasks.Maven_MavenInstallation/Maven_3.0.5 /home/jenkins/jenkins-slave/slave.jar /home/jenkins/jenkins-slave/maven3-interceptor.jar /home/jenkins/jenkins-slave/maven3-interceptor-commons.jar 52281
<===[JENKINS REMOTING CAPACITY]===>   channel started
log4j:WARN No appenders could be found for logger (org.apache.commons.beanutils.converters.BooleanConverter).
log4j:WARN Please initialize the log4j system properly.
Executing Maven:  -B -f <https://builds.apache.org/job/sling-oak-it-1.6/ws/launchpad-testing-oak/pom.xml> -Dmaven.repo.local=/home/jenkins/jenkins-slave/maven-repositories/0 clean install -Dsling.run.modes=oak
[INFO] Scanning for projects...
[INFO]                                                                         
[INFO] ------------------------------------------------------------------------
[INFO] Building Apache Sling Launchpad Testing 7-SNAPSHOT
[INFO] ------------------------------------------------------------------------
[INFO] 
[INFO] --- maven-clean-plugin:2.5:clean (default-clean) @ org.apache.sling.launchpad.testing ---
[INFO] Deleting <https://builds.apache.org/job/sling-oak-it-1.6/ws/launchpad-testing-oak/target>
[INFO] Deleting <https://builds.apache.org/job/sling-oak-it-1.6/ws/launchpad-testing-oak> (includes = [derby.log, cachedir, sling/**, jackrabbit, coverage.ec], excludes = [])
[INFO] 
[INFO] --- maven-enforcer-plugin:1.3.1:enforce (enforce-java) @ org.apache.sling.launchpad.testing ---
[INFO] 
[INFO] --- maven-antrun-plugin:1.7:run (set-bundle-required-execution-environment) @ org.apache.sling.launchpad.testing ---
[INFO] Executing tasks

main:
[INFO] Executed tasks
[INFO] 
[INFO] --- maven-remote-resources-plugin:1.5:process (default) @ org.apache.sling.launchpad.testing ---
[INFO] 
[INFO] --- maven-resources-plugin:2.6:resources (default-resources) @ org.apache.sling.launchpad.testing ---
[INFO] Using 'UTF-8' encoding to copy filtered resources.
[INFO] Copying 1 resource
[INFO] Copying 3 resources
[INFO] 
[INFO] --- maven-antrun-plugin:1.7:run (check-memory-task) @ org.apache.sling.launchpad.testing ---
[INFO] Executing tasks

main:
     [echo] **************** WARNING (SLING-443/SLING-1782) ******************************
     [echo] On most platforms, you'll get OutOfMemoryErrors when building unless you set
     [echo] on 32bit platforms: MAVEN_OPTS="-Xmx256M -XX:MaxPermSize=256M", see SLING-443
     [echo] on 64bit platforms: MAVEN_OPTS="-Xmx512M -XX:MaxPermSize=512M", see SLING-1782
     [echo] ******************************************************************************
[INFO] Executed tasks
[INFO] 
[INFO] --- build-helper-maven-plugin:1.8:reserve-network-port (reserve-network-port) @ org.apache.sling.launchpad.testing ---
[INFO] Reserved port 48297 for http.port
[INFO] Reserved port 43935 for sling.control.port
[INFO] 
[INFO] --- maven-compiler-plugin:3.1:compile (default-compile) @ org.apache.sling.launchpad.testing ---
[INFO] No sources to compile
[INFO] 
[INFO] --- maven-resources-plugin:2.6:testResources (default-testResources) @ org.apache.sling.launchpad.testing ---
[INFO] Using 'UTF-8' encoding to copy filtered resources.
[INFO] Copying 2 resources
[INFO] Copying 3 resources
[INFO] 
[INFO] --- maven-compiler-plugin:3.1:testCompile (default-testCompile) @ org.apache.sling.launchpad.testing ---
[INFO] No sources to compile
[INFO] 
[INFO] --- maven-surefire-plugin:2.17:test (default-test) @ org.apache.sling.launchpad.testing ---
[JENKINS] Recording test results[INFO] 
[INFO] --- animal-sniffer-maven-plugin:1.11:check (default) @ org.apache.sling.launchpad.testing ---

[INFO] Checking unresolved references to org.codehaus.mojo.signature:java15:1.0
[INFO] 
[INFO] --- maven-launchpad-plugin:2.3.0:prepare-package (prepare-package) @ org.apache.sling.launchpad.testing ---
[INFO] Using bundle list file from /home/jenkins/jenkins-slave/maven-repositories/0/org/apache/sling/org.apache.sling.launchpad/7-SNAPSHOT/org.apache.sling.launchpad-7-SNAPSHOT-bundlelist.xml
[INFO] Merging partial bundle list org.apache.sling:org.apache.sling.launchpad.test-bundles:0.0.1-SNAPSHOT
Downloading: http://repository.apache.org/snapshots/org/apache/sling/org.apache.sling.launchpad.test-bundles/0.0.1-SNAPSHOT/org.apache.sling.launchpad.test-bundles-0.0.1-SNAPSHOT-bundlelistconfig.zip
[INFO] Copying base artifact from /home/jenkins/jenkins-slave/maven-repositories/0/org/apache/sling/org.apache.sling.launchpad.base/4.4.1-2.5.2/org.apache.sling.launchpad.base-4.4.1-2.5.2.jar to <https://builds.apache.org/job/sling-oak-it-1.6/ws/launchpad-testing-oak/target/classes/resources/org.apache.sling.launchpad.base.jar.>
[INFO] Copying bundle from /home/jenkins/jenkins-slave/maven-repositories/0/org/slf4j/slf4j-api/1.7.6/slf4j-api-1.7.6.jar to <https://builds.apache.org/job/sling-oak-it-1.6/ws/launchpad-testing-oak/target/classes/resources/bundles/1/slf4j-api-1.7.6.jar>
[INFO] Copying bundle from /home/jenkins/jenkins-slave/maven-repositories/0/org/apache/sling/org.apache.sling.commons.log/4.0.0/org.apache.sling.commons.log-4.0.0.jar to <https://builds.apache.org/job/sling-oak-it-1.6/ws/launchpad-testing-oak/target/classes/resources/bundles/1/org.apache.sling.commons.log-4.0.0.jar>
[INFO] Copying bundle from /home/jenkins/jenkins-slave/maven-repositories/0/org/apache/sling/org.apache.sling.commons.logservice/1.0.2/org.apache.sling.commons.logservice-1.0.2.jar to <https://builds.apache.org/job/sling-oak-it-1.6/ws/launchpad-testing-oak/target/classes/resources/bundles/1/org.apache.sling.commons.logservice-1.0.2.jar>
[INFO] Copying bundle from /home/jenkins/jenkins-slave/maven-repositories/0/org/slf4j/jcl-over-slf4j/1.7.6/jcl-over-slf4j-1.7.6.jar to <https://builds.apache.org/job/sling-oak-it-1.6/ws/launchpad-testing-oak/target/classes/resources/bundles/1/jcl-over-slf4j-1.7.6.jar>
[INFO] Copying bundle from /home/jenkins/jenkins-slave/maven-repositories/0/org/slf4j/log4j-over-slf4j/1.7.6/log4j-over-slf4j-1.7.6.jar to <https://builds.apache.org/job/sling-oak-it-1.6/ws/launchpad-testing-oak/target/classes/resources/bundles/1/log4j-over-slf4j-1.7.6.jar>
[INFO] Copying bundle from /home/jenkins/jenkins-slave/maven-repositories/0/org/apache/sling/org.apache.sling.settings/1.3.2/org.apache.sling.settings-1.3.2.jar to <https://builds.apache.org/job/sling-oak-it-1.6/ws/launchpad-testing-oak/target/classes/resources/bundles/1/org.apache.sling.settings-1.3.2.jar>
[INFO] Copying bundle from /home/jenkins/jenkins-slave/maven-repositories/0/org/apache/sling/org.apache.sling.fragment.xml/1.0.2/org.apache.sling.fragment.xml-1.0.2.jar to <https://builds.apache.org/job/sling-oak-it-1.6/ws/launchpad-testing-oak/target/classes/resources/bundles/1/org.apache.sling.fragment.xml-1.0.2.jar>
[INFO] Copying bundle from /home/jenkins/jenkins-slave/maven-repositories/0/org/apache/sling/org.apache.sling.fragment.transaction/1.0.0/org.apache.sling.fragment.transaction-1.0.0.jar to <https://builds.apache.org/job/sling-oak-it-1.6/ws/launchpad-testing-oak/target/classes/resources/bundles/1/org.apache.sling.fragment.transaction-1.0.0.jar>
[INFO] Copying bundle from /home/jenkins/jenkins-slave/maven-repositories/0/org/apache/sling/org.apache.sling.javax.activation/0.1.0/org.apache.sling.javax.activation-0.1.0.jar to <https://builds.apache.org/job/sling-oak-it-1.6/ws/launchpad-testing-oak/target/classes/resources/bundles/1/org.apache.sling.javax.activation-0.1.0.jar>
[INFO] Copying bundle from /home/jenkins/jenkins-slave/maven-repositories/0/org/apache/sling/org.apache.sling.fragment.ws/1.0.2/org.apache.sling.fragment.ws-1.0.2.jar to <https://builds.apache.org/job/sling-oak-it-1.6/ws/launchpad-testing-oak/target/classes/resources/bundles/1/org.apache.sling.fragment.ws-1.0.2.jar>
[INFO] Copying bundle from /home/jenkins/jenkins-slave/maven-repositories/0/org/apache/sling/org.apache.sling.launchpad.installer/1.2.0/org.apache.sling.launchpad.installer-1.2.0.jar to <https://builds.apache.org/job/sling-oak-it-1.6/ws/launchpad-testing-oak/target/classes/resources/bundles/1/org.apache.sling.launchpad.installer-1.2.0.jar>
[INFO] Copying bundle from /home/jenkins/jenkins-slave/maven-repositories/0/org/apache/sling/org.apache.sling.installer.core/3.5.2/org.apache.sling.installer.core-3.5.2.jar to <https://builds.apache.org/job/sling-oak-it-1.6/ws/launchpad-testing-oak/target/classes/resources/bundles/1/org.apache.sling.installer.core-3.5.2.jar>
[INFO] Copying bundle from /home/jenkins/jenkins-slave/maven-repositories/0/org/apache/sling/org.apache.sling.installer.provider.file/1.0.2/org.apache.sling.installer.provider.file-1.0.2.jar to <https://builds.apache.org/job/sling-oak-it-1.6/ws/launchpad-testing-oak/target/classes/resources/bundles/1/org.apache.sling.installer.provider.file-1.0.2.jar>
[INFO] Copying bundle from /home/jenkins/jenkins-slave/maven-repositories/0/org/apache/felix/org.apache.felix.configadmin/1.6.0/org.apache.felix.configadmin-1.6.0.jar to <https://builds.apache.org/job/sling-oak-it-1.6/ws/launchpad-testing-oak/target/classes/resources/bundles/1/org.apache.felix.configadmin-1.6.0.jar>
[INFO] Copying bundle from /home/jenkins/jenkins-slave/maven-repositories/0/org/apache/felix/org.apache.felix.eventadmin/1.3.2/org.apache.felix.eventadmin-1.3.2.jar to <https://builds.apache.org/job/sling-oak-it-1.6/ws/launchpad-testing-oak/target/classes/resources/bundles/1/org.apache.felix.eventadmin-1.3.2.jar>
[INFO] Copying bundle from /home/jenkins/jenkins-slave/maven-repositories/0/org/apache/felix/org.apache.felix.http.jetty/2.2.2/org.apache.felix.http.jetty-2.2.2.jar to <https://builds.apache.org/job/sling-oak-it-1.6/ws/launchpad-testing-oak/target/classes/resources/bundles/1/org.apache.felix.http.jetty-2.2.2.jar>
[INFO] Copying bundle from /home/jenkins/jenkins-slave/maven-repositories/0/commons-io/commons-io/1.4/commons-io-1.4.jar to <https://builds.apache.org/job/sling-oak-it-1.6/ws/launchpad-testing-oak/target/classes/resources/bundles/0/commons-io-1.4.jar>
[INFO] Copying bundle from /home/jenkins/jenkins-slave/maven-repositories/0/commons-fileupload/commons-fileupload/1.3.1/commons-fileupload-1.3.1.jar to <https://builds.apache.org/job/sling-oak-it-1.6/ws/launchpad-testing-oak/target/classes/resources/bundles/0/commons-fileupload-1.3.1.jar>
[INFO] Copying bundle from /home/jenkins/jenkins-slave/maven-repositories/0/commons-collections/commons-collections/3.2.1/commons-collections-3.2.1.jar to <https://builds.apache.org/job/sling-oak-it-1.6/ws/launchpad-testing-oak/target/classes/resources/bundles/0/commons-collections-3.2.1.jar>
[INFO] Copying bundle from /home/jenkins/jenkins-slave/maven-repositories/0/commons-codec/commons-codec/1.9/commons-codec-1.9.jar to <https://builds.apache.org/job/sling-oak-it-1.6/ws/launchpad-testing-oak/target/classes/resources/bundles/0/commons-codec-1.9.jar>
[INFO] Copying bundle from /home/jenkins/jenkins-slave/maven-repositories/0/commons-lang/commons-lang/2.6/commons-lang-2.6.jar to <https://builds.apache.org/job/sling-oak-it-1.6/ws/launchpad-testing-oak/target/classes/resources/bundles/0/commons-lang-2.6.jar>
[INFO] Copying bundle from /home/jenkins/jenkins-slave/maven-repositories/0/org/apache/commons/commons-math/2.2/commons-math-2.2.jar to <https://builds.apache.org/job/sling-oak-it-1.6/ws/launchpad-testing-oak/target/classes/resources/bundles/0/commons-math-2.2.jar>
[INFO] Copying bundle from /home/jenkins/jenkins-slave/maven-repositories/0/commons-pool/commons-pool/1.6/commons-pool-1.6.jar to <https://builds.apache.org/job/sling-oak-it-1.6/ws/launchpad-testing-oak/target/classes/resources/bundles/0/commons-pool-1.6.jar>
[INFO] Copying bundle from /home/jenkins/jenkins-slave/maven-repositories/0/org/apache/servicemix/bundles/org.apache.servicemix.bundles.concurrent/1.3.4_1/org.apache.servicemix.bundles.concurrent-1.3.4_1.jar to <https://builds.apache.org/job/sling-oak-it-1.6/ws/launchpad-testing-oak/target/classes/resources/bundles/0/org.apache.servicemix.bundles.concurrent-1.3.4_1.jar>
[INFO] Copying bundle from /home/jenkins/jenkins-slave/maven-repositories/0/org/apache/geronimo/bundles/commons-httpclient/3.1_1/commons-httpclient-3.1_1.jar to <https://builds.apache.org/job/sling-oak-it-1.6/ws/launchpad-testing-oak/target/classes/resources/bundles/0/commons-httpclient-3.1_1.jar>
[INFO] Copying bundle from /home/jenkins/jenkins-slave/maven-repositories/0/org/apache/sling/org.apache.sling.commons.osgi/2.2.0/org.apache.sling.commons.osgi-2.2.0.jar to <https://builds.apache.org/job/sling-oak-it-1.6/ws/launchpad-testing-oak/target/classes/resources/bundles/0/org.apache.sling.commons.osgi-2.2.0.jar>
[INFO] Copying bundle from /home/jenkins/jenkins-slave/maven-repositories/0/org/apache/sling/org.apache.sling.commons.mime/2.1.5-SNAPSHOT/org.apache.sling.commons.mime-2.1.5-SNAPSHOT.jar to <https://builds.apache.org/job/sling-oak-it-1.6/ws/launchpad-testing-oak/target/classes/resources/bundles/0/org.apache.sling.commons.mime-2.1.5-SNAPSHOT.jar>
[INFO] Copying bundle from /home/jenkins/jenkins-slave/maven-repositories/0/org/apache/sling/org.apache.sling.commons.classloader/1.3.2/org.apache.sling.commons.classloader-1.3.2.jar to <https://builds.apache.org/job/sling-oak-it-1.6/ws/launchpad-testing-oak/target/classes/resources/bundles/0/org.apache.sling.commons.classloader-1.3.2.jar>
[INFO] Copying bundle from /home/jenkins/jenkins-slave/maven-repositories/0/org/apache/sling/org.apache.sling.commons.compiler/2.2.0/org.apache.sling.commons.compiler-2.2.0.jar to <https://builds.apache.org/job/sling-oak-it-1.6/ws/launchpad-testing-oak/target/classes/resources/bundles/0/org.apache.sling.commons.compiler-2.2.0.jar>
[INFO] Copying bundle from /home/jenkins/jenkins-slave/maven-repositories/0/org/apache/sling/org.apache.sling.commons.scheduler/2.4.2/org.apache.sling.commons.scheduler-2.4.2.jar to <https://builds.apache.org/job/sling-oak-it-1.6/ws/launchpad-testing-oak/target/classes/resources/bundles/0/org.apache.sling.commons.scheduler-2.4.2.jar>
[INFO] Copying bundle from /home/jenkins/jenkins-slave/maven-repositories/0/org/apache/sling/org.apache.sling.commons.threads/3.2.0/org.apache.sling.commons.threads-3.2.0.jar to <https://builds.apache.org/job/sling-oak-it-1.6/ws/launchpad-testing-oak/target/classes/resources/bundles/0/org.apache.sling.commons.threads-3.2.0.jar>
[INFO] Copying bundle from /home/jenkins/jenkins-slave/maven-repositories/0/org/apache/sling/org.apache.sling.discovery.api/1.0.0/org.apache.sling.discovery.api-1.0.0.jar to <https://builds.apache.org/job/sling-oak-it-1.6/ws/launchpad-testing-oak/target/classes/resources/bundles/0/org.apache.sling.discovery.api-1.0.0.jar>
[INFO] Copying bundle from /home/jenkins/jenkins-slave/maven-repositories/0/org/apache/sling/org.apache.sling.discovery.support/1.0.0/org.apache.sling.discovery.support-1.0.0.jar to <https://builds.apache.org/job/sling-oak-it-1.6/ws/launchpad-testing-oak/target/classes/resources/bundles/0/org.apache.sling.discovery.support-1.0.0.jar>
[INFO] Copying bundle from /home/jenkins/jenkins-slave/maven-repositories/0/org/apache/sling/org.apache.sling.discovery.impl/1.0.8/org.apache.sling.discovery.impl-1.0.8.jar to <https://builds.apache.org/job/sling-oak-it-1.6/ws/launchpad-testing-oak/target/classes/resources/bundles/0/org.apache.sling.discovery.impl-1.0.8.jar>
[INFO] Copying bundle from /home/jenkins/jenkins-slave/maven-repositories/0/org/apache/sling/org.apache.sling.event/3.3.10/org.apache.sling.event-3.3.10.jar to <https://builds.apache.org/job/sling-oak-it-1.6/ws/launchpad-testing-oak/target/classes/resources/bundles/0/org.apache.sling.event-3.3.10.jar>
[INFO] Copying bundle from /home/jenkins/jenkins-slave/maven-repositories/0/org/apache/sling/org.apache.sling.api/2.7.0/org.apache.sling.api-2.7.0.jar to <https://builds.apache.org/job/sling-oak-it-1.6/ws/launchpad-testing-oak/target/classes/resources/bundles/0/org.apache.sling.api-2.7.0.jar>
[INFO] Copying bundle from /home/jenkins/jenkins-slave/maven-repositories/0/org/apache/sling/org.apache.sling.serviceusermapper/1.0.2/org.apache.sling.serviceusermapper-1.0.2.jar to <https://builds.apache.org/job/sling-oak-it-1.6/ws/launchpad-testing-oak/target/classes/resources/bundles/0/org.apache.sling.serviceusermapper-1.0.2.jar>
[INFO] Copying bundle from /home/jenkins/jenkins-slave/maven-repositories/0/org/apache/sling/org.apache.sling.resourceresolver/1.1.1-SNAPSHOT/org.apache.sling.resourceresolver-1.1.1-SNAPSHOT.jar to <https://builds.apache.org/job/sling-oak-it-1.6/ws/launchpad-testing-oak/target/classes/resources/bundles/0/org.apache.sling.resourceresolver-1.1.1-SNAPSHOT.jar>
[INFO] Copying bundle from /home/jenkins/jenkins-slave/maven-repositories/0/org/apache/sling/org.apache.sling.auth.core/1.1.7-SNAPSHOT/org.apache.sling.auth.core-1.1.7-SNAPSHOT.jar to <https://builds.apache.org/job/sling-oak-it-1.6/ws/launchpad-testing-oak/target/classes/resources/bundles/0/org.apache.sling.auth.core-1.1.7-SNAPSHOT.jar>
Downloading: http://repository.apache.org/snapshots/org/apache/sling/org.apache.sling.engine/2.3.5-SNAPSHOT/org.apache.sling.engine-2.3.5-SNAPSHOT.jar
[JENKINS] Archiving disabled
[INFO] ------------------------------------------------------------------------
[INFO] BUILD FAILURE
[INFO] ------------------------------------------------------------------------
[INFO] Total time: 32.249s
[INFO] Finished at: Fri Oct 03 10:47:37 UTC 2014
[INFO] Final Memory: 19M/206M
[INFO] ------------------------------------------------------------------------
[JENKINS] Archiving disabled
Waiting for Jenkins to finish collecting data
[ERROR] Failed to execute goal org.apache.sling:maven-launchpad-plugin:2.3.0:prepare-package (prepare-package) on project org.apache.sling.launchpad.testing: Unable to find artifact. Could not find artifact org.apache.sling:org.apache.sling.engine:jar:2.3.5-SNAPSHOT in Nexus (http://repository.apache.org/snapshots)
[ERROR] 
[ERROR] Try downloading the file manually from the project website.
[ERROR] 
[ERROR] Then, install it using the command:
[ERROR] mvn install:install-file -DgroupId=org.apache.sling -DartifactId=org.apache.sling.engine -Dversion=2.3.5-SNAPSHOT -Dpackaging=jar -Dfile=/path/to/file
[ERROR] 
[ERROR] Alternatively, if you host your own repository you can deploy the file there:
[ERROR] mvn deploy:deploy-file -DgroupId=org.apache.sling -DartifactId=org.apache.sling.engine -Dversion=2.3.5-SNAPSHOT -Dpackaging=jar -Dfile=/path/to/file -Durl=[url] -DrepositoryId=[id]
[ERROR] 
[ERROR] 
[ERROR] org.apache.sling:org.apache.sling.engine:jar:2.3.5-SNAPSHOT
[ERROR] 
[ERROR] from the specified remote repositories:
[ERROR] Nexus (http://repository.apache.org/snapshots, releases=false, snapshots=true),
[ERROR] central (http://repo.maven.apache.org/maven2, releases=true, snapshots=false)
[ERROR] -> [Help 1]
[ERROR] 
[ERROR] To see the full stack trace of the errors, re-run Maven with the -e switch.
[ERROR] Re-run Maven using the -X switch to enable full debug logging.
[ERROR] 
[ERROR] For more information about the errors and possible solutions, please read the following articles:
[ERROR] [Help 1] http://cwiki.apache.org/confluence/display/MAVEN/MojoExecutionException
Sending e-mails to: dev@sling.apache.org
channel stopped