You are viewing a plain text version of this content. The canonical link for it is here.
Posted to builds@cassandra.apache.org by Apache Jenkins Server <je...@builds.apache.org> on 2023/04/26 16:57:24 UTC
Build complete: Cassandra-3.11 #441 [UNSTABLE] 81e78192cb229b0ddbf587c94701ca4d9670a51b
-------------------------------------------------------------------------------
Build Cassandra-3.11 #441 Still Unstable
URL: https://ci-cassandra.apache.org/job/Cassandra-3.11/441/
-------------------------------------------------------------------------------
Changes:
[Stefan Miklosovic] Do not remove truncated_at entry in system.local while dropping an index
-------------------------------------------------------------------------------
Failed Tests:
18 tests failed.
FAILED: dtest.bootstrap_test.TestBootstrap.test_simultaneous_bootstrap
FAILED: org.apache.cassandra.distributed.upgrade.DropCompactStorageWithClusteringAndValueColumnTest.testDropCompactWithClusteringAndValueColumn
FAILED: org.apache.cassandra.cql3.ViewComplexTest.testMVWithDifferentColumnsWithoutFlush
FAILED: org.apache.cassandra.cql3.ViewComplexTest.testCommutativeRowDeletionFlush
FAILED: org.apache.cassandra.cql3.ViewComplexTest.terminated successfully
FAILED: org.apache.cassandra.cql3.ViewComplexTest.testUpdateColumnInViewPKWithTTLWithFlush
FAILED: org.apache.cassandra.cql3.ViewFilteringTest.testCompoundPartitionKeyRestrictions
FAILED: org.apache.cassandra.cql3.ViewFilteringTest.testClusteringKeySliceRestrictions
FAILED: org.apache.cassandra.cql3.ViewFilteringTest.terminated successfully
FAILED: org.apache.cassandra.cql3.ViewFilteringTest.testPartitionKeyFilteringWithSlice
FAILED: org.apache.cassandra.db.partition.PartitionImplementationTest.testMarkersWithStatic
FAILED: org.apache.cassandra.cql3.ViewTest.testClusteringOrder
FAILED: org.apache.cassandra.utils.SlidingTimeRateTest.testConcurrentUpdateAndGet
FAILED: org.apache.cassandra.distributed.test.ReprepareOldBehaviourTest.testReprepareMixedVersionWithoutReset
FAILED: dtest-offheap.repair_tests.repair_test.TestRepair.test_dead_sync_initiator
FAILED: dtest-novnode.repair_tests.repair_test.TestRepair.test_dead_sync_initiator
FAILED: dtest.repair_tests.repair_test.TestRepair.test_dead_sync_initiator
FAILED: dtest-upgrade.upgrade_internal_auth_test.TestAuthUpgrade.test_upgrade_legacy_table
-------------------------------------------------------------------------------
For complete test report and logs see https://nightlies.apache.org/cassandra/Cassandra-3.11/441/