You are viewing a plain text version of this content. The canonical link for it is here.
Posted to yarn-dev@hadoop.apache.org by Apache Jenkins Server <je...@builds.apache.org> on 2016/05/10 18:05:19 UTC
Hadoop-Yarn-trunk - Build # 2124 - Still Failing
See https://builds.apache.org/job/Hadoop-Yarn-trunk/2124/
###################################################################################
########################## LAST 60 LINES OF THE CONSOLE ###########################
[...truncated 10446 lines...]
TestCapacityScheduler.testMoveAppSuccess:1636 » NoClassDefFound org/apache/had...
TestCapacityScheduler.testResourceUpdateDecommissioningNode:3351 » NoClassDefFound
TestCapacityScheduler.testMoveAppForMoveToQueueWithFreeCap:1512 » NoClassDefFound
TestCapacityScheduler.testAllocateReorder:729 » NoClassDefFound org/apache/had...
TestCapacityScheduler.testMoveAppQueueMetricsCheck:1876 » NoClassDefFound org/...
TestCapacityScheduler.testQueueHierarchyPendingResourceUpdate:2727 » NoClassDefFound
TestCapacityScheduler.testHeadRoomCalculationWithDRC:3000 » NoClassDefFound or...
TestCapacityScheduler.testApplicationHeadRoom:2918 » NoClassDefFound org/apach...
Tests run: 1399, Failures: 7, Errors: 14, Skipped: 3
[INFO] ------------------------------------------------------------------------
[INFO] Reactor Summary:
[INFO]
[INFO] Apache Hadoop YARN ................................ SUCCESS [ 3.804 s]
[INFO] Apache Hadoop YARN API ............................ SUCCESS [04:40 min]
[INFO] Apache Hadoop YARN Common ......................... SUCCESS [03:26 min]
[INFO] Apache Hadoop YARN Server ......................... SUCCESS [ 0.097 s]
[INFO] Apache Hadoop YARN Server Common .................. SUCCESS [ 57.380 s]
[INFO] Apache Hadoop YARN NodeManager .................... SUCCESS [12:24 min]
[INFO] Apache Hadoop YARN Web Proxy ...................... SUCCESS [ 25.205 s]
[INFO] Apache Hadoop YARN ApplicationHistoryService ...... SUCCESS [03:29 min]
[INFO] Apache Hadoop YARN ResourceManager ................ FAILURE [36:55 min]
[INFO] Apache Hadoop YARN Server Tests ................... SKIPPED
[INFO] Apache Hadoop YARN Client ......................... SKIPPED
[INFO] Apache Hadoop YARN SharedCacheManager ............. SKIPPED
[INFO] Apache Hadoop YARN Timeline Plugin Storage ........ SKIPPED
[INFO] Apache Hadoop YARN Applications ................... SKIPPED
[INFO] Apache Hadoop YARN DistributedShell ............... SKIPPED
[INFO] Apache Hadoop YARN Unmanaged Am Launcher .......... SKIPPED
[INFO] Apache Hadoop YARN Site ........................... SKIPPED
[INFO] Apache Hadoop YARN Registry ....................... SKIPPED
[INFO] Apache Hadoop YARN Project ........................ SKIPPED
[INFO] ------------------------------------------------------------------------
[INFO] BUILD FAILURE
[INFO] ------------------------------------------------------------------------
[INFO] Total time: 01:02 h
[INFO] Finished at: 2016-05-10T18:05:19+00:00
[INFO] Final Memory: 60M/483M
[INFO] ------------------------------------------------------------------------
[ERROR] Failed to execute goal org.apache.maven.plugins:maven-surefire-plugin:2.17:test (default-test) on project hadoop-yarn-server-resourcemanager: There are test failures.
[ERROR]
[ERROR] Please refer to /home/jenkins/jenkins-slave/workspace/Hadoop-Yarn-trunk/hadoop-yarn-project/hadoop-yarn/hadoop-yarn-server/hadoop-yarn-server-resourcemanager/target/surefire-reports for the individual test results.
[ERROR] -> [Help 1]
[ERROR]
[ERROR] To see the full stack trace of the errors, re-run Maven with the -e switch.
[ERROR] Re-run Maven using the -X switch to enable full debug logging.
[ERROR]
[ERROR] For more information about the errors and possible solutions, please read the following articles:
[ERROR] [Help 1] http://cwiki.apache.org/confluence/display/MAVEN/MojoFailureException
[ERROR]
[ERROR] After correcting the problems, you can resume the build with the command
[ERROR] mvn <goals> -rf :hadoop-yarn-server-resourcemanager
Build step 'Execute shell' marked build as failure
Archiving artifacts
Recording test results
Sending e-mails to: yarn-dev@hadoop.apache.org
Email was triggered for: Failure - Any
Sending email for trigger: Failure - Any
###################################################################################
############################## FAILED TESTS (if any) ##############################
21 tests failed.
FAILED: org.apache.hadoop.yarn.server.resourcemanager.scheduler.capacity.TestCapacityScheduler.testRecoverRequestAfterPreemption
Error Message:
test timed out after 30000 milliseconds
Stack Trace:
java.lang.Exception: test timed out after 30000 milliseconds
at java.lang.Thread.sleep(Native Method)
at org.apache.hadoop.yarn.server.resourcemanager.MockRM.waitForState(MockRM.java:261)
at org.apache.hadoop.yarn.server.resourcemanager.MockRM.waitForState(MockRM.java:225)
at org.apache.hadoop.yarn.server.resourcemanager.MockRM.waitForState(MockRM.java:207)
at org.apache.hadoop.yarn.server.resourcemanager.MockRM.sendAMLaunched(MockRM.java:746)
at org.apache.hadoop.yarn.server.resourcemanager.MockRM.launchAM(MockRM.java:945)
at org.apache.hadoop.yarn.server.resourcemanager.MockRM.launchAndRegisterAM(MockRM.java:961)
at org.apache.hadoop.yarn.server.resourcemanager.scheduler.capacity.TestCapacityScheduler.testRecoverRequestAfterPreemption(TestCapacityScheduler.java:1253)
FAILED: org.apache.hadoop.yarn.server.resourcemanager.scheduler.capacity.TestCapacityScheduler.testAppReservationWithDominantResourceCalculator
Error Message:
test timed out after 30000 milliseconds
Stack Trace:
java.lang.Exception: test timed out after 30000 milliseconds
at java.lang.Thread.sleep(Native Method)
at org.apache.hadoop.yarn.server.resourcemanager.MockRM.waitForState(MockRM.java:261)
at org.apache.hadoop.yarn.server.resourcemanager.MockRM.waitForState(MockRM.java:225)
at org.apache.hadoop.yarn.server.resourcemanager.MockRM.waitForState(MockRM.java:207)
at org.apache.hadoop.yarn.server.resourcemanager.MockRM.sendAMLaunched(MockRM.java:746)
at org.apache.hadoop.yarn.server.resourcemanager.scheduler.capacity.TestCapacityScheduler.testAppReservationWithDominantResourceCalculator(TestCapacityScheduler.java:2212)
FAILED: org.apache.hadoop.yarn.server.resourcemanager.scheduler.capacity.TestCapacityScheduler.testBlackListNodes
Error Message:
org/apache/hadoop/security/token/Token
Stack Trace:
java.lang.NoClassDefFoundError: org/apache/hadoop/security/token/Token
at java.net.URLClassLoader$1.run(URLClassLoader.java:366)
at java.net.URLClassLoader$1.run(URLClassLoader.java:355)
at java.security.AccessController.doPrivileged(Native Method)
at java.net.URLClassLoader.findClass(URLClassLoader.java:354)
at java.lang.ClassLoader.loadClass(ClassLoader.java:425)
at sun.misc.Launcher$AppClassLoader.loadClass(Launcher.java:308)
at java.lang.ClassLoader.loadClass(ClassLoader.java:358)
at java.lang.Class.getDeclaredMethods0(Native Method)
at java.lang.Class.privateGetDeclaredMethods(Class.java:2531)
at java.lang.Class.getDeclaredMethods(Class.java:1855)
at org.mockito.cglib.core.ReflectUtils.addAllMethods(ReflectUtils.java:349)
at org.mockito.cglib.proxy.Enhancer.getMethods(Enhancer.java:422)
at org.mockito.cglib.proxy.Enhancer.generateClass(Enhancer.java:457)
at org.mockito.cglib.core.DefaultGeneratorStrategy.generate(DefaultGeneratorStrategy.java:25)
at org.mockito.cglib.core.AbstractClassGenerator.create(AbstractClassGenerator.java:217)
at org.mockito.cglib.proxy.Enhancer.createHelper(Enhancer.java:378)
at org.mockito.cglib.proxy.Enhancer.createClass(Enhancer.java:318)
at org.mockito.internal.creation.jmock.ClassImposterizer.createProxyClass(ClassImposterizer.java:93)
at org.mockito.internal.creation.jmock.ClassImposterizer.imposterise(ClassImposterizer.java:50)
at org.mockito.internal.util.MockUtil.createMock(MockUtil.java:54)
at org.mockito.internal.MockitoCore.mock(MockitoCore.java:45)
at org.mockito.Mockito.mock(Mockito.java:921)
at org.mockito.Mockito.mock(Mockito.java:816)
at org.apache.hadoop.yarn.server.resourcemanager.scheduler.capacity.TestCapacityScheduler.testBlackListNodes(TestCapacityScheduler.java:664)
FAILED: org.apache.hadoop.yarn.server.resourcemanager.scheduler.capacity.TestCapacityScheduler.testMoveAppViolateQueueState
Error Message:
Unexpected exception, expected<org.apache.hadoop.yarn.exceptions.YarnException> but was<java.lang.NoClassDefFoundError>
Stack Trace:
java.lang.Exception: Unexpected exception, expected<org.apache.hadoop.yarn.exceptions.YarnException> but was<java.lang.NoClassDefFoundError>
at java.net.URLClassLoader$1.run(URLClassLoader.java:366)
at java.net.URLClassLoader$1.run(URLClassLoader.java:355)
at java.security.AccessController.doPrivileged(Native Method)
at java.net.URLClassLoader.findClass(URLClassLoader.java:354)
at java.lang.ClassLoader.loadClass(ClassLoader.java:425)
at sun.misc.Launcher$AppClassLoader.loadClass(Launcher.java:308)
at java.lang.ClassLoader.loadClass(ClassLoader.java:358)
at org.apache.hadoop.security.token.TokenIdentifier.getBytes(TokenIdentifier.java:61)
at org.apache.hadoop.yarn.server.security.BaseContainerTokenSecretManager.createPassword(BaseContainerTokenSecretManager.java:96)
at org.apache.hadoop.yarn.server.resourcemanager.security.RMContainerTokenSecretManager.createContainerToken(RMContainerTokenSecretManager.java:218)
at org.apache.hadoop.yarn.server.resourcemanager.scheduler.SchedulerApplicationAttempt.updateContainerAndNMToken(SchedulerApplicationAttempt.java:508)
at org.apache.hadoop.yarn.server.resourcemanager.scheduler.SchedulerApplicationAttempt.pullNewlyAllocatedContainers(SchedulerApplicationAttempt.java:545)
at org.apache.hadoop.yarn.server.resourcemanager.scheduler.common.fica.FiCaSchedulerApp.getAllocation(FiCaSchedulerApp.java:346)
at org.apache.hadoop.yarn.server.resourcemanager.scheduler.capacity.CapacityScheduler.allocate(CapacityScheduler.java:1009)
at org.apache.hadoop.yarn.server.resourcemanager.Application.getResources(Application.java:324)
at org.apache.hadoop.yarn.server.resourcemanager.Application.schedule(Application.java:368)
at org.apache.hadoop.yarn.server.resourcemanager.scheduler.capacity.TestCapacityScheduler.testMoveAppViolateQueueState(TestCapacityScheduler.java:1729)
FAILED: org.apache.hadoop.yarn.server.resourcemanager.scheduler.capacity.TestCapacityScheduler.testAllocateDoesNotBlockOnSchedulerLock
Error Message:
org/apache/hadoop/ipc/RPC$Server
Stack Trace:
java.lang.NoClassDefFoundError: org/apache/hadoop/ipc/RPC$Server
at java.net.URLClassLoader$1.run(URLClassLoader.java:366)
at java.net.URLClassLoader$1.run(URLClassLoader.java:355)
at java.security.AccessController.doPrivileged(Native Method)
at java.net.URLClassLoader.findClass(URLClassLoader.java:354)
at java.lang.ClassLoader.loadClass(ClassLoader.java:425)
at sun.misc.Launcher$AppClassLoader.loadClass(Launcher.java:308)
at java.lang.ClassLoader.loadClass(ClassLoader.java:358)
at java.lang.Class.forName0(Native Method)
at java.lang.Class.forName(Class.java:190)
at org.apache.hadoop.yarn.factory.providers.RpcFactoryProvider.getFactoryClassInstance(RpcFactoryProvider.java:61)
at org.apache.hadoop.yarn.factory.providers.RpcFactoryProvider.getServerFactory(RpcFactoryProvider.java:49)
at org.apache.hadoop.yarn.ipc.HadoopYarnProtoRPC.getServer(HadoopYarnProtoRPC.java:65)
at org.apache.hadoop.yarn.ipc.YarnRPC.getServer(YarnRPC.java:54)
at org.apache.hadoop.yarn.server.resourcemanager.ApplicationMasterService.getServer(ApplicationMasterService.java:180)
at org.apache.hadoop.yarn.server.resourcemanager.ApplicationMasterService.serviceStart(ApplicationMasterService.java:152)
at org.apache.hadoop.service.AbstractService.start(AbstractService.java:193)
at org.apache.hadoop.service.CompositeService.serviceStart(CompositeService.java:120)
at org.apache.hadoop.yarn.server.resourcemanager.ResourceManager$RMActiveServices.serviceStart(ResourceManager.java:686)
at org.apache.hadoop.service.AbstractService.start(AbstractService.java:193)
at org.apache.hadoop.yarn.server.resourcemanager.ResourceManager.startActiveServices(ResourceManager.java:1010)
at org.apache.hadoop.yarn.server.resourcemanager.ResourceManager$1.run(ResourceManager.java:1050)
at org.apache.hadoop.yarn.server.resourcemanager.ResourceManager$1.run(ResourceManager.java:1046)
at java.security.AccessController.doPrivileged(Native Method)
at javax.security.auth.Subject.doAs(Subject.java:415)
at org.apache.hadoop.security.UserGroupInformation.doAs(UserGroupInformation.java:1755)
at org.apache.hadoop.yarn.server.resourcemanager.ResourceManager.transitionToActive(ResourceManager.java:1046)
at org.apache.hadoop.yarn.server.resourcemanager.ResourceManager.serviceStart(ResourceManager.java:1086)
at org.apache.hadoop.service.AbstractService.start(AbstractService.java:193)
at org.apache.hadoop.yarn.server.resourcemanager.scheduler.capacity.TestCapacityScheduler.testAllocateDoesNotBlockOnSchedulerLock(TestCapacityScheduler.java:1033)
FAILED: org.apache.hadoop.yarn.server.resourcemanager.scheduler.capacity.TestCapacityScheduler.testCapacityScheduler
Error Message:
org/apache/hadoop/io/DataOutputBuffer$Buffer
Stack Trace:
java.lang.NoClassDefFoundError: org/apache/hadoop/io/DataOutputBuffer$Buffer
at java.net.URLClassLoader$1.run(URLClassLoader.java:366)
at java.net.URLClassLoader$1.run(URLClassLoader.java:355)
at java.security.AccessController.doPrivileged(Native Method)
at java.net.URLClassLoader.findClass(URLClassLoader.java:354)
at java.lang.ClassLoader.loadClass(ClassLoader.java:425)
at sun.misc.Launcher$AppClassLoader.loadClass(Launcher.java:308)
at java.lang.ClassLoader.loadClass(ClassLoader.java:358)
at org.apache.hadoop.security.token.TokenIdentifier.getBytes(TokenIdentifier.java:61)
at org.apache.hadoop.yarn.server.security.BaseContainerTokenSecretManager.createPassword(BaseContainerTokenSecretManager.java:96)
at org.apache.hadoop.yarn.server.resourcemanager.security.RMContainerTokenSecretManager.createContainerToken(RMContainerTokenSecretManager.java:218)
at org.apache.hadoop.yarn.server.resourcemanager.scheduler.SchedulerApplicationAttempt.updateContainerAndNMToken(SchedulerApplicationAttempt.java:508)
at org.apache.hadoop.yarn.server.resourcemanager.scheduler.SchedulerApplicationAttempt.pullNewlyAllocatedContainers(SchedulerApplicationAttempt.java:545)
at org.apache.hadoop.yarn.server.resourcemanager.scheduler.common.fica.FiCaSchedulerApp.getAllocation(FiCaSchedulerApp.java:346)
at org.apache.hadoop.yarn.server.resourcemanager.scheduler.capacity.CapacityScheduler.allocate(CapacityScheduler.java:1009)
at org.apache.hadoop.yarn.server.resourcemanager.Application.getResources(Application.java:324)
at org.apache.hadoop.yarn.server.resourcemanager.Application.schedule(Application.java:368)
at org.apache.hadoop.yarn.server.resourcemanager.scheduler.capacity.TestCapacityScheduler.testCapacityScheduler(TestCapacityScheduler.java:328)
FAILED: org.apache.hadoop.yarn.server.resourcemanager.scheduler.capacity.TestCapacityScheduler.testMoveAppSuccess
Error Message:
org/apache/hadoop/io/DataOutputBuffer$Buffer
Stack Trace:
java.lang.NoClassDefFoundError: org/apache/hadoop/io/DataOutputBuffer$Buffer
at java.net.URLClassLoader$1.run(URLClassLoader.java:366)
at java.net.URLClassLoader$1.run(URLClassLoader.java:355)
at java.security.AccessController.doPrivileged(Native Method)
at java.net.URLClassLoader.findClass(URLClassLoader.java:354)
at java.lang.ClassLoader.loadClass(ClassLoader.java:425)
at sun.misc.Launcher$AppClassLoader.loadClass(Launcher.java:308)
at java.lang.ClassLoader.loadClass(ClassLoader.java:358)
at org.apache.hadoop.security.token.TokenIdentifier.getBytes(TokenIdentifier.java:61)
at org.apache.hadoop.yarn.server.security.BaseContainerTokenSecretManager.createPassword(BaseContainerTokenSecretManager.java:96)
at org.apache.hadoop.yarn.server.resourcemanager.security.RMContainerTokenSecretManager.createContainerToken(RMContainerTokenSecretManager.java:218)
at org.apache.hadoop.yarn.server.resourcemanager.scheduler.SchedulerApplicationAttempt.updateContainerAndNMToken(SchedulerApplicationAttempt.java:508)
at org.apache.hadoop.yarn.server.resourcemanager.scheduler.SchedulerApplicationAttempt.pullNewlyAllocatedContainers(SchedulerApplicationAttempt.java:545)
at org.apache.hadoop.yarn.server.resourcemanager.scheduler.common.fica.FiCaSchedulerApp.getAllocation(FiCaSchedulerApp.java:346)
at org.apache.hadoop.yarn.server.resourcemanager.scheduler.capacity.CapacityScheduler.allocate(CapacityScheduler.java:1009)
at org.apache.hadoop.yarn.server.resourcemanager.Application.getResources(Application.java:324)
at org.apache.hadoop.yarn.server.resourcemanager.Application.schedule(Application.java:368)
at org.apache.hadoop.yarn.server.resourcemanager.scheduler.capacity.TestCapacityScheduler.testMoveAppSuccess(TestCapacityScheduler.java:1636)
FAILED: org.apache.hadoop.yarn.server.resourcemanager.scheduler.capacity.TestCapacityScheduler.testPreemptionInfo
Error Message:
Attempt state is not correct (timeout). expected:<ALLOCATED> but was:<SCHEDULED>
Stack Trace:
java.lang.AssertionError: Attempt state is not correct (timeout). expected:<ALLOCATED> but was:<SCHEDULED>
at org.junit.Assert.fail(Assert.java:88)
at org.junit.Assert.failNotEquals(Assert.java:743)
at org.junit.Assert.assertEquals(Assert.java:118)
at org.apache.hadoop.yarn.server.resourcemanager.MockRM.waitForState(MockRM.java:266)
at org.apache.hadoop.yarn.server.resourcemanager.MockRM.waitForState(MockRM.java:225)
at org.apache.hadoop.yarn.server.resourcemanager.MockRM.waitForState(MockRM.java:207)
at org.apache.hadoop.yarn.server.resourcemanager.MockRM.sendAMLaunched(MockRM.java:746)
at org.apache.hadoop.yarn.server.resourcemanager.MockRM.launchAM(MockRM.java:945)
at org.apache.hadoop.yarn.server.resourcemanager.scheduler.capacity.TestCapacityScheduler.testPreemptionInfo(TestCapacityScheduler.java:1187)
FAILED: org.apache.hadoop.yarn.server.resourcemanager.scheduler.capacity.TestCapacityScheduler.testResourceUpdateDecommissioningNode
Error Message:
org/apache/hadoop/io/DataOutputBuffer$Buffer
Stack Trace:
java.lang.NoClassDefFoundError: org/apache/hadoop/io/DataOutputBuffer$Buffer
at java.net.URLClassLoader$1.run(URLClassLoader.java:366)
at java.net.URLClassLoader$1.run(URLClassLoader.java:355)
at java.security.AccessController.doPrivileged(Native Method)
at java.net.URLClassLoader.findClass(URLClassLoader.java:354)
at java.lang.ClassLoader.loadClass(ClassLoader.java:425)
at sun.misc.Launcher$AppClassLoader.loadClass(Launcher.java:308)
at java.lang.ClassLoader.loadClass(ClassLoader.java:358)
at org.apache.hadoop.security.token.TokenIdentifier.getBytes(TokenIdentifier.java:61)
at org.apache.hadoop.yarn.server.security.BaseContainerTokenSecretManager.createPassword(BaseContainerTokenSecretManager.java:96)
at org.apache.hadoop.yarn.server.resourcemanager.security.RMContainerTokenSecretManager.createContainerToken(RMContainerTokenSecretManager.java:218)
at org.apache.hadoop.yarn.server.resourcemanager.scheduler.SchedulerApplicationAttempt.updateContainerAndNMToken(SchedulerApplicationAttempt.java:508)
at org.apache.hadoop.yarn.server.resourcemanager.scheduler.SchedulerApplicationAttempt.pullNewlyAllocatedContainers(SchedulerApplicationAttempt.java:545)
at org.apache.hadoop.yarn.server.resourcemanager.scheduler.common.fica.FiCaSchedulerApp.getAllocation(FiCaSchedulerApp.java:346)
at org.apache.hadoop.yarn.server.resourcemanager.scheduler.capacity.CapacityScheduler.allocate(CapacityScheduler.java:1009)
at org.apache.hadoop.yarn.server.resourcemanager.Application.getResources(Application.java:324)
at org.apache.hadoop.yarn.server.resourcemanager.Application.schedule(Application.java:368)
at org.apache.hadoop.yarn.server.resourcemanager.scheduler.capacity.TestCapacityScheduler.testResourceUpdateDecommissioningNode(TestCapacityScheduler.java:3351)
FAILED: org.apache.hadoop.yarn.server.resourcemanager.scheduler.capacity.TestCapacityScheduler.testParentQueueMaxCapsAreRespected
Error Message:
Attempt state is not correct (timeout). expected:<ALLOCATED> but was:<SCHEDULED>
Stack Trace:
java.lang.AssertionError: Attempt state is not correct (timeout). expected:<ALLOCATED> but was:<SCHEDULED>
at org.junit.Assert.fail(Assert.java:88)
at org.junit.Assert.failNotEquals(Assert.java:743)
at org.junit.Assert.assertEquals(Assert.java:118)
at org.apache.hadoop.yarn.server.resourcemanager.MockRM.waitForState(MockRM.java:266)
at org.apache.hadoop.yarn.server.resourcemanager.MockRM.waitForState(MockRM.java:225)
at org.apache.hadoop.yarn.server.resourcemanager.MockRM.waitForState(MockRM.java:207)
at org.apache.hadoop.yarn.server.resourcemanager.MockRM.sendAMLaunched(MockRM.java:746)
at org.apache.hadoop.yarn.server.resourcemanager.MockRM.launchAM(MockRM.java:945)
at org.apache.hadoop.yarn.server.resourcemanager.MockRM.launchAndRegisterAM(MockRM.java:961)
at org.apache.hadoop.yarn.server.resourcemanager.scheduler.capacity.TestCapacityScheduler.testParentQueueMaxCapsAreRespected(TestCapacityScheduler.java:2693)
FAILED: org.apache.hadoop.yarn.server.resourcemanager.scheduler.capacity.TestCapacityScheduler.testPendingResourceUpdatedAccordingToIncreaseRequestChanges
Error Message:
Attempt state is not correct (timeout). expected:<ALLOCATED> but was:<SCHEDULED>
Stack Trace:
java.lang.AssertionError: Attempt state is not correct (timeout). expected:<ALLOCATED> but was:<SCHEDULED>
at org.junit.Assert.fail(Assert.java:88)
at org.junit.Assert.failNotEquals(Assert.java:743)
at org.junit.Assert.assertEquals(Assert.java:118)
at org.apache.hadoop.yarn.server.resourcemanager.MockRM.waitForState(MockRM.java:266)
at org.apache.hadoop.yarn.server.resourcemanager.MockRM.waitForState(MockRM.java:225)
at org.apache.hadoop.yarn.server.resourcemanager.MockRM.waitForState(MockRM.java:207)
at org.apache.hadoop.yarn.server.resourcemanager.MockRM.sendAMLaunched(MockRM.java:746)
at org.apache.hadoop.yarn.server.resourcemanager.MockRM.launchAM(MockRM.java:945)
at org.apache.hadoop.yarn.server.resourcemanager.MockRM.launchAndRegisterAM(MockRM.java:961)
at org.apache.hadoop.yarn.server.resourcemanager.scheduler.capacity.TestCapacityScheduler.testPendingResourceUpdatedAccordingToIncreaseRequestChanges(TestCapacityScheduler.java:3150)
FAILED: org.apache.hadoop.yarn.server.resourcemanager.scheduler.capacity.TestCapacityScheduler.testResourceOverCommit
Error Message:
Attempt state is not correct (timeout). expected:<ALLOCATED> but was:<SCHEDULED>
Stack Trace:
java.lang.AssertionError: Attempt state is not correct (timeout). expected:<ALLOCATED> but was:<SCHEDULED>
at org.junit.Assert.fail(Assert.java:88)
at org.junit.Assert.failNotEquals(Assert.java:743)
at org.junit.Assert.assertEquals(Assert.java:118)
at org.apache.hadoop.yarn.server.resourcemanager.MockRM.waitForState(MockRM.java:266)
at org.apache.hadoop.yarn.server.resourcemanager.MockRM.waitForState(MockRM.java:225)
at org.apache.hadoop.yarn.server.resourcemanager.MockRM.waitForState(MockRM.java:207)
at org.apache.hadoop.yarn.server.resourcemanager.MockRM.sendAMLaunched(MockRM.java:746)
at org.apache.hadoop.yarn.server.resourcemanager.scheduler.capacity.TestCapacityScheduler.testResourceOverCommit(TestCapacityScheduler.java:828)
FAILED: org.apache.hadoop.yarn.server.resourcemanager.scheduler.capacity.TestCapacityScheduler.testKillAllAppsInQueue
Error Message:
App State is not correct (timeout). expected:<KILLED> but was:<KILLING>
Stack Trace:
java.lang.AssertionError: App State is not correct (timeout). expected:<KILLED> but was:<KILLING>
at org.junit.Assert.fail(Assert.java:88)
at org.junit.Assert.failNotEquals(Assert.java:743)
at org.junit.Assert.assertEquals(Assert.java:118)
at org.apache.hadoop.yarn.server.resourcemanager.MockRM.waitForState(MockRM.java:193)
at org.apache.hadoop.yarn.server.resourcemanager.scheduler.capacity.TestCapacityScheduler.testKillAllAppsInQueue(TestCapacityScheduler.java:2128)
FAILED: org.apache.hadoop.yarn.server.resourcemanager.scheduler.capacity.TestCapacityScheduler.testMoveAppForMoveToQueueWithFreeCap
Error Message:
org/apache/hadoop/io/DataOutputBuffer$Buffer
Stack Trace:
java.lang.NoClassDefFoundError: org/apache/hadoop/io/DataOutputBuffer$Buffer
at java.net.URLClassLoader$1.run(URLClassLoader.java:366)
at java.net.URLClassLoader$1.run(URLClassLoader.java:355)
at java.security.AccessController.doPrivileged(Native Method)
at java.net.URLClassLoader.findClass(URLClassLoader.java:354)
at java.lang.ClassLoader.loadClass(ClassLoader.java:425)
at sun.misc.Launcher$AppClassLoader.loadClass(Launcher.java:308)
at java.lang.ClassLoader.loadClass(ClassLoader.java:358)
at org.apache.hadoop.security.token.TokenIdentifier.getBytes(TokenIdentifier.java:61)
at org.apache.hadoop.yarn.server.security.BaseContainerTokenSecretManager.createPassword(BaseContainerTokenSecretManager.java:96)
at org.apache.hadoop.yarn.server.resourcemanager.security.RMContainerTokenSecretManager.createContainerToken(RMContainerTokenSecretManager.java:218)
at org.apache.hadoop.yarn.server.resourcemanager.scheduler.SchedulerApplicationAttempt.updateContainerAndNMToken(SchedulerApplicationAttempt.java:508)
at org.apache.hadoop.yarn.server.resourcemanager.scheduler.SchedulerApplicationAttempt.pullNewlyAllocatedContainers(SchedulerApplicationAttempt.java:545)
at org.apache.hadoop.yarn.server.resourcemanager.scheduler.common.fica.FiCaSchedulerApp.getAllocation(FiCaSchedulerApp.java:346)
at org.apache.hadoop.yarn.server.resourcemanager.scheduler.capacity.CapacityScheduler.allocate(CapacityScheduler.java:1009)
at org.apache.hadoop.yarn.server.resourcemanager.Application.getResources(Application.java:324)
at org.apache.hadoop.yarn.server.resourcemanager.Application.schedule(Application.java:368)
at org.apache.hadoop.yarn.server.resourcemanager.scheduler.capacity.TestCapacityScheduler.testMoveAppForMoveToQueueWithFreeCap(TestCapacityScheduler.java:1512)
FAILED: org.apache.hadoop.yarn.server.resourcemanager.scheduler.capacity.TestCapacityScheduler.testAllocateReorder
Error Message:
org/apache/hadoop/security/token/Token
Stack Trace:
java.lang.NoClassDefFoundError: org/apache/hadoop/security/token/Token
at java.net.URLClassLoader$1.run(URLClassLoader.java:366)
at java.net.URLClassLoader$1.run(URLClassLoader.java:355)
at java.security.AccessController.doPrivileged(Native Method)
at java.net.URLClassLoader.findClass(URLClassLoader.java:354)
at java.lang.ClassLoader.loadClass(ClassLoader.java:425)
at sun.misc.Launcher$AppClassLoader.loadClass(Launcher.java:308)
at java.lang.ClassLoader.loadClass(ClassLoader.java:358)
at java.lang.Class.getDeclaredMethods0(Native Method)
at java.lang.Class.privateGetDeclaredMethods(Class.java:2531)
at java.lang.Class.getDeclaredMethods(Class.java:1855)
at org.mockito.cglib.core.ReflectUtils.addAllMethods(ReflectUtils.java:349)
at org.mockito.cglib.proxy.Enhancer.getMethods(Enhancer.java:422)
at org.mockito.cglib.proxy.Enhancer.generateClass(Enhancer.java:457)
at org.mockito.cglib.core.DefaultGeneratorStrategy.generate(DefaultGeneratorStrategy.java:25)
at org.mockito.cglib.core.AbstractClassGenerator.create(AbstractClassGenerator.java:217)
at org.mockito.cglib.proxy.Enhancer.createHelper(Enhancer.java:378)
at org.mockito.cglib.proxy.Enhancer.createClass(Enhancer.java:318)
at org.mockito.internal.creation.jmock.ClassImposterizer.createProxyClass(ClassImposterizer.java:93)
at org.mockito.internal.creation.jmock.ClassImposterizer.imposterise(ClassImposterizer.java:50)
at org.mockito.internal.util.MockUtil.createMock(MockUtil.java:54)
at org.mockito.internal.MockitoCore.mock(MockitoCore.java:45)
at org.mockito.Mockito.mock(Mockito.java:921)
at org.mockito.Mockito.mock(Mockito.java:816)
at org.apache.hadoop.yarn.server.resourcemanager.scheduler.capacity.TestCapacityScheduler.testAllocateReorder(TestCapacityScheduler.java:729)
FAILED: org.apache.hadoop.yarn.server.resourcemanager.scheduler.capacity.TestCapacityScheduler.testMoveAppQueueMetricsCheck
Error Message:
org/apache/hadoop/io/DataOutputBuffer$Buffer
Stack Trace:
java.lang.NoClassDefFoundError: org/apache/hadoop/io/DataOutputBuffer$Buffer
at java.net.URLClassLoader$1.run(URLClassLoader.java:366)
at java.net.URLClassLoader$1.run(URLClassLoader.java:355)
at java.security.AccessController.doPrivileged(Native Method)
at java.net.URLClassLoader.findClass(URLClassLoader.java:354)
at java.lang.ClassLoader.loadClass(ClassLoader.java:425)
at sun.misc.Launcher$AppClassLoader.loadClass(Launcher.java:308)
at java.lang.ClassLoader.loadClass(ClassLoader.java:358)
at org.apache.hadoop.security.token.TokenIdentifier.getBytes(TokenIdentifier.java:61)
at org.apache.hadoop.yarn.server.security.BaseContainerTokenSecretManager.createPassword(BaseContainerTokenSecretManager.java:96)
at org.apache.hadoop.yarn.server.resourcemanager.security.RMContainerTokenSecretManager.createContainerToken(RMContainerTokenSecretManager.java:218)
at org.apache.hadoop.yarn.server.resourcemanager.scheduler.SchedulerApplicationAttempt.updateContainerAndNMToken(SchedulerApplicationAttempt.java:508)
at org.apache.hadoop.yarn.server.resourcemanager.scheduler.SchedulerApplicationAttempt.pullNewlyAllocatedContainers(SchedulerApplicationAttempt.java:545)
at org.apache.hadoop.yarn.server.resourcemanager.scheduler.common.fica.FiCaSchedulerApp.getAllocation(FiCaSchedulerApp.java:346)
at org.apache.hadoop.yarn.server.resourcemanager.scheduler.capacity.CapacityScheduler.allocate(CapacityScheduler.java:1009)
at org.apache.hadoop.yarn.server.resourcemanager.Application.getResources(Application.java:324)
at org.apache.hadoop.yarn.server.resourcemanager.Application.schedule(Application.java:368)
at org.apache.hadoop.yarn.server.resourcemanager.scheduler.capacity.TestCapacityScheduler.testMoveAppQueueMetricsCheck(TestCapacityScheduler.java:1876)
FAILED: org.apache.hadoop.yarn.server.resourcemanager.scheduler.capacity.TestCapacityScheduler.testHierarchyQueuesCurrentLimits
Error Message:
Attempt state is not correct (timeout). expected:<ALLOCATED> but was:<SCHEDULED>
Stack Trace:
java.lang.AssertionError: Attempt state is not correct (timeout). expected:<ALLOCATED> but was:<SCHEDULED>
at org.junit.Assert.fail(Assert.java:88)
at org.junit.Assert.failNotEquals(Assert.java:743)
at org.junit.Assert.assertEquals(Assert.java:118)
at org.apache.hadoop.yarn.server.resourcemanager.MockRM.waitForState(MockRM.java:266)
at org.apache.hadoop.yarn.server.resourcemanager.MockRM.waitForState(MockRM.java:225)
at org.apache.hadoop.yarn.server.resourcemanager.MockRM.waitForState(MockRM.java:207)
at org.apache.hadoop.yarn.server.resourcemanager.MockRM.sendAMLaunched(MockRM.java:746)
at org.apache.hadoop.yarn.server.resourcemanager.MockRM.launchAM(MockRM.java:945)
at org.apache.hadoop.yarn.server.resourcemanager.MockRM.launchAndRegisterAM(MockRM.java:961)
at org.apache.hadoop.yarn.server.resourcemanager.scheduler.capacity.TestCapacityScheduler.testHierarchyQueuesCurrentLimits(TestCapacityScheduler.java:2610)
FAILED: org.apache.hadoop.yarn.server.resourcemanager.scheduler.capacity.TestCapacityScheduler.testQueueHierarchyPendingResourceUpdate
Error Message:
org/apache/hadoop/security/proto/SecurityProtos
Stack Trace:
java.lang.NoClassDefFoundError: org/apache/hadoop/security/proto/SecurityProtos
at java.net.URLClassLoader$1.run(URLClassLoader.java:366)
at java.net.URLClassLoader$1.run(URLClassLoader.java:355)
at java.security.AccessController.doPrivileged(Native Method)
at java.net.URLClassLoader.findClass(URLClassLoader.java:354)
at java.lang.ClassLoader.loadClass(ClassLoader.java:425)
at sun.misc.Launcher$AppClassLoader.loadClass(Launcher.java:308)
at java.lang.ClassLoader.loadClass(ClassLoader.java:358)
at org.apache.hadoop.yarn.proto.YarnProtos.<clinit>(YarnProtos.java:56957)
at org.apache.hadoop.yarn.proto.YarnProtos$NodeLabelProto.internalGetFieldAccessorTable(YarnProtos.java:25907)
at com.google.protobuf.GeneratedMessage.getDescriptorForType(GeneratedMessage.java:98)
at org.apache.hadoop.yarn.proto.YarnProtos$NodeLabelProto.hashCode(YarnProtos.java:26071)
at org.apache.hadoop.yarn.api.records.impl.pb.NodeLabelPBImpl.hashCode(NodeLabelPBImpl.java:72)
at java.util.HashMap.hash(HashMap.java:366)
at java.util.HashMap.put(HashMap.java:496)
at java.util.HashSet.add(HashSet.java:217)
at org.apache.hadoop.yarn.nodelabels.CommonNodeLabelsManager.addToCluserNodeLabelsWithDefaultExclusivity(CommonNodeLabelsManager.java:335)
at org.apache.hadoop.yarn.server.resourcemanager.scheduler.capacity.TestCapacityScheduler.testQueueHierarchyPendingResourceUpdate(TestCapacityScheduler.java:2727)
FAILED: org.apache.hadoop.yarn.server.resourcemanager.scheduler.capacity.TestCapacityScheduler.testHeadRoomCalculationWithDRC
Error Message:
org/apache/hadoop/security/token/Token
Stack Trace:
java.lang.NoClassDefFoundError: org/apache/hadoop/security/token/Token
at java.net.URLClassLoader$1.run(URLClassLoader.java:366)
at java.net.URLClassLoader$1.run(URLClassLoader.java:355)
at java.security.AccessController.doPrivileged(Native Method)
at java.net.URLClassLoader.findClass(URLClassLoader.java:354)
at java.lang.ClassLoader.loadClass(ClassLoader.java:425)
at sun.misc.Launcher$AppClassLoader.loadClass(Launcher.java:308)
at java.lang.ClassLoader.loadClass(ClassLoader.java:358)
at java.lang.Class.getDeclaredMethods0(Native Method)
at java.lang.Class.privateGetDeclaredMethods(Class.java:2531)
at java.lang.Class.getDeclaredMethods(Class.java:1855)
at org.mockito.cglib.core.ReflectUtils.addAllMethods(ReflectUtils.java:349)
at org.mockito.cglib.proxy.Enhancer.getMethods(Enhancer.java:422)
at org.mockito.cglib.proxy.Enhancer.generateClass(Enhancer.java:457)
at org.mockito.cglib.core.DefaultGeneratorStrategy.generate(DefaultGeneratorStrategy.java:25)
at org.mockito.cglib.core.AbstractClassGenerator.create(AbstractClassGenerator.java:217)
at org.mockito.cglib.proxy.Enhancer.createHelper(Enhancer.java:378)
at org.mockito.cglib.proxy.Enhancer.createClass(Enhancer.java:318)
at org.mockito.internal.creation.jmock.ClassImposterizer.createProxyClass(ClassImposterizer.java:93)
at org.mockito.internal.creation.jmock.ClassImposterizer.imposterise(ClassImposterizer.java:50)
at org.mockito.internal.util.MockUtil.createMock(MockUtil.java:54)
at org.mockito.internal.MockitoCore.mock(MockitoCore.java:45)
at org.mockito.Mockito.mock(Mockito.java:921)
at org.mockito.Mockito.mock(Mockito.java:816)
at org.apache.hadoop.yarn.server.resourcemanager.scheduler.capacity.TestCapacityScheduler.testHeadRoomCalculationWithDRC(TestCapacityScheduler.java:3000)
FAILED: org.apache.hadoop.yarn.server.resourcemanager.scheduler.capacity.TestCapacityScheduler.testApplicationHeadRoom
Error Message:
org/apache/hadoop/security/token/Token
Stack Trace:
java.lang.NoClassDefFoundError: org/apache/hadoop/security/token/Token
at java.net.URLClassLoader$1.run(URLClassLoader.java:366)
at java.net.URLClassLoader$1.run(URLClassLoader.java:355)
at java.security.AccessController.doPrivileged(Native Method)
at java.net.URLClassLoader.findClass(URLClassLoader.java:354)
at java.lang.ClassLoader.loadClass(ClassLoader.java:425)
at sun.misc.Launcher$AppClassLoader.loadClass(Launcher.java:308)
at java.lang.ClassLoader.loadClass(ClassLoader.java:358)
at java.lang.Class.getDeclaredMethods0(Native Method)
at java.lang.Class.privateGetDeclaredMethods(Class.java:2531)
at java.lang.Class.getDeclaredMethods(Class.java:1855)
at org.mockito.cglib.core.ReflectUtils.addAllMethods(ReflectUtils.java:349)
at org.mockito.cglib.proxy.Enhancer.getMethods(Enhancer.java:422)
at org.mockito.cglib.proxy.Enhancer.generateClass(Enhancer.java:457)
at org.mockito.cglib.core.DefaultGeneratorStrategy.generate(DefaultGeneratorStrategy.java:25)
at org.mockito.cglib.core.AbstractClassGenerator.create(AbstractClassGenerator.java:217)
at org.mockito.cglib.proxy.Enhancer.createHelper(Enhancer.java:378)
at org.mockito.cglib.proxy.Enhancer.createClass(Enhancer.java:318)
at org.mockito.internal.creation.jmock.ClassImposterizer.createProxyClass(ClassImposterizer.java:93)
at org.mockito.internal.creation.jmock.ClassImposterizer.imposterise(ClassImposterizer.java:50)
at org.mockito.internal.util.MockUtil.createMock(MockUtil.java:54)
at org.mockito.internal.MockitoCore.mock(MockitoCore.java:45)
at org.mockito.Mockito.mock(Mockito.java:921)
at org.mockito.Mockito.mock(Mockito.java:816)
at org.apache.hadoop.yarn.server.resourcemanager.scheduler.capacity.TestCapacityScheduler.testApplicationHeadRoom(TestCapacityScheduler.java:2918)
FAILED: org.apache.hadoop.yarn.server.resourcemanager.TestContainerResourceUsage.testUsageAfterAMRestartWithMultipleContainers
Error Message:
Unexcpected MemorySeconds value expected:<-1498011024470> but was:<2114>
Stack Trace:
java.lang.AssertionError: Unexcpected MemorySeconds value expected:<-1498011024470> but was:<2114>
at org.junit.Assert.fail(Assert.java:88)
at org.junit.Assert.failNotEquals(Assert.java:743)
at org.junit.Assert.assertEquals(Assert.java:118)
at org.junit.Assert.assertEquals(Assert.java:555)
at org.apache.hadoop.yarn.server.resourcemanager.TestContainerResourceUsage.amRestartTests(TestContainerResourceUsage.java:395)
at org.apache.hadoop.yarn.server.resourcemanager.TestContainerResourceUsage.testUsageAfterAMRestartWithMultipleContainers(TestContainerResourceUsage.java:252)