You are viewing a plain text version of this content. The canonical link for it is here.
Posted to commits@olingo.apache.org by Apache Jenkins Server <je...@builds.apache.org> on 2014/01/08 02:21:43 UTC

Build failed in Jenkins: olingo-odata2-quality #109

See <https://builds.apache.org/job/olingo-odata2-quality/109/changes>

Changes:

[mibo] [OLINGO-93] Duplicated ListProcessor for RefScenario

[mibo] [OLINGO-83] Separate 'webref' to 'ref' and 'web' module

------------------------------------------
Started by timer
Building remotely on ubuntu3 in workspace <https://builds.apache.org/job/olingo-odata2-quality/ws/>
Fetching changes from the remote Git repository
Fetching upstream changes from https://git-wip-us.apache.org/repos/asf/incubator-olingo-odata2.git
Checking out Revision a42ace7ba3b0dda5977b745d0a99ea8f13392bc2 (origin/master)
[olingo-odata2-quality] $ /home/hudson/tools/maven/apache-maven-3.0.4/bin/mvn clean install -Pbuild.quality
[INFO] Scanning for projects...
[INFO] ------------------------------------------------------------------------
[INFO] Reactor Build Order:
[INFO] 
[INFO] olingo-odata2-parent-incubating
[INFO] olingo-odata2-lib-incubating
[INFO] olingo-odata2-api-incubating
[INFO] olingo-odata2-api-annotation-incubating
[INFO] olingo-odata2-testutil-incubating
[INFO] olingo-odata2-core-incubating
[INFO] olingo-odata2-ref-incubating
[INFO] olingo-odata2-fit-incubating
[INFO] olingo-odata2-ref-web-incubating
[INFO] olingo-odata2-jpa-processor-incubating
[INFO] olingo-odata2-jpa-processor-api-incubating
[INFO] olingo-odata2-jpa-processor-core-incubating
[INFO] olingo-odata2-jpa-processor-ref-incubating
[INFO] olingo-odata2-jpa-processor-ref-web-incubating
[INFO] olingo-odata2-annotation-processor-incubating
[INFO] olingo-odata2-annotation-processor-api-incubating
[INFO] olingo-odata2-annotation-processor-core-incubating
[INFO] olingo-odata2-annotation-processor-ref-incubating
[INFO] olingo-odata2-annotation-processor-ref-web-incubating
[INFO] olingo-odata2-dist-incubating
[INFO] olingo-odata2-dist-lib-incubating
[INFO] olingo-odata2-dist-jpa-incubating
[INFO] olingo-odata2-dist-ref-incubating
[INFO] olingo-odata2-dist-javadoc-incubating
[INFO] olingo-odata2-sample-incubating
[INFO] olingo-odata2-sample-cars-service-archetype-incubating
[INFO]                                                                         
[INFO] ------------------------------------------------------------------------
[INFO] Building olingo-odata2-parent-incubating 1.1.0-SNAPSHOT
[INFO] ------------------------------------------------------------------------
[INFO] 
[INFO] --- maven-clean-plugin:2.5:clean (default-clean) @ olingo-odata2-parent-incubating ---
[INFO] Deleting /x1/jenkins/jenkins-slave/workspace/olingo-odata2-quality/target
[INFO] 
[INFO] --- buildnumber-maven-plugin:1.2:create (default) @ olingo-odata2-parent-incubating ---
[INFO] Checking for local modifications: skipped.
[INFO] Updating project files from SCM: skipped.
[INFO] Executing: /bin/sh -c cd /x1/jenkins/jenkins-slave/workspace/olingo-odata2-quality && svn --non-interactive info
[INFO] Working directory: /x1/jenkins/jenkins-slave/workspace/olingo-odata2-quality
[INFO] Storing buildNumber: ? at timestamp: 2014-01-08T01:21:34+0000
[INFO] Executing: /bin/sh -c cd /x1/jenkins/jenkins-slave/workspace/olingo-odata2-quality && svn --non-interactive info
[INFO] Working directory: /x1/jenkins/jenkins-slave/workspace/olingo-odata2-quality
[INFO] Storing buildScmBranch: UNKNOWN_BRANCH
[INFO] 
[INFO] --- maven-remote-resources-plugin:1.4:process (default) @ olingo-odata2-parent-incubating ---
[INFO] 
[INFO] --- apache-rat-plugin:0.9:rat (rat-check) @ olingo-odata2-parent-incubating ---
[INFO] 56 implicit excludes (use -debug for more details).
[INFO] Exclude: **/MANIFEST.MF
[INFO] Exclude: .gitignore
[INFO] Exclude: .git/**
[INFO] Exclude: bin/**
[INFO] Exclude: **/*.project
[INFO] Exclude: **/*.classpath
[INFO] Exclude: **/*.json
[INFO] Exclude: **/*.batch
[INFO] Exclude: **/NOTICE
[INFO] Exclude: **/DEPENDENCIES
[INFO] Exclude: **/archetype-resources/**
[INFO] Exclude: **/archetype-metadata.xml
[INFO] Exclude: **/archetype.properties
[INFO] Exclude: **/*.txt
[INFO] 570 resources included (use -debug for more details)
[INFO] 
[INFO] --- apache-rat-plugin:0.9:check (rat-check) @ olingo-odata2-parent-incubating ---
[INFO] 56 implicit excludes (use -debug for more details).
[INFO] Exclude: **/MANIFEST.MF
[INFO] Exclude: .gitignore
[INFO] Exclude: .git/**
[INFO] Exclude: bin/**
[INFO] Exclude: **/*.project
[INFO] Exclude: **/*.classpath
[INFO] Exclude: **/*.json
[INFO] Exclude: **/*.batch
[INFO] Exclude: **/NOTICE
[INFO] Exclude: **/DEPENDENCIES
[INFO] Exclude: **/archetype-resources/**
[INFO] Exclude: **/archetype-metadata.xml
[INFO] Exclude: **/archetype.properties
[INFO] Exclude: **/*.txt
[INFO] 570 resources included (use -debug for more details)
[INFO] Rat check: Summary of files. Unapproved: 80 unknown: 80 generated: 0 approved: 33 licence.
[INFO] ------------------------------------------------------------------------
[INFO] Reactor Summary:
[INFO] 
[INFO] olingo-odata2-parent-incubating ................... FAILURE [8.830s]
[INFO] olingo-odata2-lib-incubating ...................... SKIPPED
[INFO] olingo-odata2-api-incubating ...................... SKIPPED
[INFO] olingo-odata2-api-annotation-incubating ........... SKIPPED
[INFO] olingo-odata2-testutil-incubating ................. SKIPPED
[INFO] olingo-odata2-core-incubating ..................... SKIPPED
[INFO] olingo-odata2-ref-incubating ...................... SKIPPED
[INFO] olingo-odata2-fit-incubating ...................... SKIPPED
[INFO] olingo-odata2-ref-web-incubating .................. SKIPPED
[INFO] olingo-odata2-jpa-processor-incubating ............ SKIPPED
[INFO] olingo-odata2-jpa-processor-api-incubating ........ SKIPPED
[INFO] olingo-odata2-jpa-processor-core-incubating ....... SKIPPED
[INFO] olingo-odata2-jpa-processor-ref-incubating ........ SKIPPED
[INFO] olingo-odata2-jpa-processor-ref-web-incubating .... SKIPPED
[INFO] olingo-odata2-annotation-processor-incubating ..... SKIPPED
[INFO] olingo-odata2-annotation-processor-api-incubating . SKIPPED
[INFO] olingo-odata2-annotation-processor-core-incubating  SKIPPED
[INFO] olingo-odata2-annotation-processor-ref-incubating . SKIPPED
[INFO] olingo-odata2-annotation-processor-ref-web-incubating  SKIPPED
[INFO] olingo-odata2-dist-incubating ..................... SKIPPED
[INFO] olingo-odata2-dist-lib-incubating ................. SKIPPED
[INFO] olingo-odata2-dist-jpa-incubating ................. SKIPPED
[INFO] olingo-odata2-dist-ref-incubating ................. SKIPPED
[INFO] olingo-odata2-dist-javadoc-incubating ............. SKIPPED
[INFO] olingo-odata2-sample-incubating ................... SKIPPED
[INFO] olingo-odata2-sample-cars-service-archetype-incubating  SKIPPED
[INFO] ------------------------------------------------------------------------
[INFO] BUILD FAILURE
[INFO] ------------------------------------------------------------------------
[INFO] Total time: 9.824s
[INFO] Finished at: Wed Jan 08 01:21:43 UTC 2014
[INFO] Final Memory: 19M/255M
[INFO] ------------------------------------------------------------------------
[ERROR] Failed to execute goal org.apache.rat:apache-rat-plugin:0.9:check (rat-check) on project olingo-odata2-parent-incubating: Too many files with unapproved license: 80 See RAT report in: /x1/jenkins/jenkins-slave/workspace/olingo-odata2-quality/target/rat.txt -> [Help 1]
[ERROR] 
[ERROR] To see the full stack trace of the errors, re-run Maven with the -e switch.
[ERROR] Re-run Maven using the -X switch to enable full debug logging.
[ERROR] 
[ERROR] For more information about the errors and possible solutions, please read the following articles:
[ERROR] [Help 1] http://cwiki.apache.org/confluence/display/MAVEN/MojoFailureException
Build step 'Invoke top-level Maven targets' marked build as failure

Jenkins build is back to normal : olingo-odata2-quality #113

Posted by Apache Jenkins Server <je...@builds.apache.org>.
See <https://builds.apache.org/job/olingo-odata2-quality/113/>


Build failed in Jenkins: olingo-odata2-quality #112

Posted by Apache Jenkins Server <je...@builds.apache.org>.
See <https://builds.apache.org/job/olingo-odata2-quality/112/changes>

Changes:

[mibo] [OLINGO-111] Added 'jar' support for class loading

[mibo] [OLINGO-111] Added additional tests for ClassHelper

[mibo] [OLINGO-83] Added more javadoc

------------------------------------------
[...truncated 1468 lines...]
[INFO] Using 'UTF-8' encoding to copy filtered resources.
[INFO] skip non existing resourceDirectory <https://builds.apache.org/job/olingo-odata2-quality/ws/odata2-jpa-processor/jpa-ref/src/test/resources>
[INFO] Copying 4 resources
[INFO] 
[INFO] --- maven-compiler-plugin:2.3.2:testCompile (default-testCompile) @ olingo-odata2-jpa-processor-ref-incubating ---
[INFO] No sources to compile
[INFO] 
[INFO] --- maven-surefire-plugin:2.12.4:test (default-test) @ olingo-odata2-jpa-processor-ref-incubating ---
[INFO] 
[INFO] --- apache-rat-plugin:0.9:rat (rat-check) @ olingo-odata2-jpa-processor-ref-incubating ---
[INFO] 51 implicit excludes (use -debug for more details).
[INFO] Exclude: **/MANIFEST.MF
[INFO] Exclude: .gitignore
[INFO] Exclude: .git/**
[INFO] Exclude: bin/**
[INFO] Exclude: **/*.project
[INFO] Exclude: **/*.classpath
[INFO] Exclude: **/*.json
[INFO] Exclude: **/*.batch
[INFO] Exclude: **/NOTICE
[INFO] Exclude: **/DEPENDENCIES
[INFO] Exclude: **/archetype-resources/**
[INFO] Exclude: **/archetype-metadata.xml
[INFO] Exclude: **/archetype.properties
[INFO] Exclude: **/*.txt
[INFO] 10 resources included (use -debug for more details)
[INFO] 
[INFO] --- apache-rat-plugin:0.9:check (rat-check) @ olingo-odata2-jpa-processor-ref-incubating ---
[INFO] 51 implicit excludes (use -debug for more details).
[INFO] Exclude: **/MANIFEST.MF
[INFO] Exclude: .gitignore
[INFO] Exclude: .git/**
[INFO] Exclude: bin/**
[INFO] Exclude: **/*.project
[INFO] Exclude: **/*.classpath
[INFO] Exclude: **/*.json
[INFO] Exclude: **/*.batch
[INFO] Exclude: **/NOTICE
[INFO] Exclude: **/DEPENDENCIES
[INFO] Exclude: **/archetype-resources/**
[INFO] Exclude: **/archetype-metadata.xml
[INFO] Exclude: **/archetype.properties
[INFO] Exclude: **/*.txt
[INFO] 10 resources included (use -debug for more details)
[INFO] Rat check: Summary of files. Unapproved: 0 unknown: 0 generated: 0 approved: 10 licence.
[INFO] 
[INFO] --- maven-jar-plugin:2.3.2:jar (default-jar) @ olingo-odata2-jpa-processor-ref-incubating ---
[INFO] Building jar: <https://builds.apache.org/job/olingo-odata2-quality/ws/odata2-jpa-processor/jpa-ref/target/olingo-odata2-jpa-processor-ref-incubating-1.1.0-SNAPSHOT.jar>
[INFO] 
[INFO] --- maven-site-plugin:3.2:attach-descriptor (attach-descriptor) @ olingo-odata2-jpa-processor-ref-incubating ---
[INFO] 
[INFO] --- maven-source-plugin:2.2.1:jar-no-fork (attach-sources) @ olingo-odata2-jpa-processor-ref-incubating ---
[INFO] Building jar: <https://builds.apache.org/job/olingo-odata2-quality/ws/odata2-jpa-processor/jpa-ref/target/olingo-odata2-jpa-processor-ref-incubating-1.1.0-SNAPSHOT-sources.jar>
[INFO] 
[INFO] --- maven-checkstyle-plugin:2.10:check (checkstyle) @ olingo-odata2-jpa-processor-ref-incubating ---
[INFO] Starting audit...
Audit done.

[INFO] 
[INFO] --- maven-install-plugin:2.3.1:install (default-install) @ olingo-odata2-jpa-processor-ref-incubating ---
[INFO] Installing <https://builds.apache.org/job/olingo-odata2-quality/ws/odata2-jpa-processor/jpa-ref/target/olingo-odata2-jpa-processor-ref-incubating-1.1.0-SNAPSHOT.jar> to /home/jenkins/.m2/repository/org/apache/olingo/olingo-odata2-jpa-processor-ref-incubating/1.1.0-SNAPSHOT/olingo-odata2-jpa-processor-ref-incubating-1.1.0-SNAPSHOT.jar
[INFO] Installing <https://builds.apache.org/job/olingo-odata2-quality/ws/odata2-jpa-processor/jpa-ref/pom.xml> to /home/jenkins/.m2/repository/org/apache/olingo/olingo-odata2-jpa-processor-ref-incubating/1.1.0-SNAPSHOT/olingo-odata2-jpa-processor-ref-incubating-1.1.0-SNAPSHOT.pom
[INFO] Installing <https://builds.apache.org/job/olingo-odata2-quality/ws/odata2-jpa-processor/jpa-ref/target/olingo-odata2-jpa-processor-ref-incubating-1.1.0-SNAPSHOT-sources.jar> to /home/jenkins/.m2/repository/org/apache/olingo/olingo-odata2-jpa-processor-ref-incubating/1.1.0-SNAPSHOT/olingo-odata2-jpa-processor-ref-incubating-1.1.0-SNAPSHOT-sources.jar
[INFO]                                                                         
[INFO] ------------------------------------------------------------------------
[INFO] Building olingo-odata2-jpa-processor-ref-web-incubating 1.1.0-SNAPSHOT
[INFO] ------------------------------------------------------------------------
[INFO] 
[INFO] --- maven-clean-plugin:2.5:clean (default-clean) @ olingo-odata2-jpa-processor-ref-web-incubating ---
[INFO] Deleting <https://builds.apache.org/job/olingo-odata2-quality/ws/odata2-jpa-processor/jpa-web/target>
[INFO] 
[INFO] --- buildnumber-maven-plugin:1.2:create (default) @ olingo-odata2-jpa-processor-ref-web-incubating ---
[INFO] 
[INFO] --- maven-remote-resources-plugin:1.4:process (default) @ olingo-odata2-jpa-processor-ref-web-incubating ---
[INFO] 
[INFO] --- maven-resources-plugin:2.6:resources (default-resources) @ olingo-odata2-jpa-processor-ref-web-incubating ---
[INFO] Using 'UTF-8' encoding to copy filtered resources.
[INFO] skip non existing resourceDirectory <https://builds.apache.org/job/olingo-odata2-quality/ws/odata2-jpa-processor/jpa-web/src/main/version>
[INFO] Copying 8 resources
[INFO] Copying 4 resources
[INFO] 
[INFO] --- maven-compiler-plugin:2.3.2:compile (default-compile) @ olingo-odata2-jpa-processor-ref-web-incubating ---
[INFO] Compiling 6 source files to <https://builds.apache.org/job/olingo-odata2-quality/ws/odata2-jpa-processor/jpa-web/target/classes>
[INFO] 
[INFO] --- maven-resources-plugin:2.6:testResources (default-testResources) @ olingo-odata2-jpa-processor-ref-web-incubating ---
[INFO] Using 'UTF-8' encoding to copy filtered resources.
[INFO] skip non existing resourceDirectory <https://builds.apache.org/job/olingo-odata2-quality/ws/odata2-jpa-processor/jpa-web/src/test/resources>
[INFO] Copying 4 resources
[INFO] 
[INFO] --- maven-compiler-plugin:2.3.2:testCompile (default-testCompile) @ olingo-odata2-jpa-processor-ref-web-incubating ---
[INFO] No sources to compile
[INFO] 
[INFO] --- maven-surefire-plugin:2.12.4:test (default-test) @ olingo-odata2-jpa-processor-ref-web-incubating ---
[INFO] 
[INFO] --- apache-rat-plugin:0.9:rat (rat-check) @ olingo-odata2-jpa-processor-ref-web-incubating ---
[INFO] 51 implicit excludes (use -debug for more details).
[INFO] Exclude: **/MANIFEST.MF
[INFO] Exclude: .gitignore
[INFO] Exclude: .git/**
[INFO] Exclude: bin/**
[INFO] Exclude: **/*.project
[INFO] Exclude: **/*.classpath
[INFO] Exclude: **/*.json
[INFO] Exclude: **/*.batch
[INFO] Exclude: **/NOTICE
[INFO] Exclude: **/DEPENDENCIES
[INFO] Exclude: **/archetype-resources/**
[INFO] Exclude: **/archetype-metadata.xml
[INFO] Exclude: **/archetype.properties
[INFO] Exclude: **/*.txt
[INFO] 19 resources included (use -debug for more details)
[INFO] 
[INFO] --- apache-rat-plugin:0.9:check (rat-check) @ olingo-odata2-jpa-processor-ref-web-incubating ---
[INFO] 51 implicit excludes (use -debug for more details).
[INFO] Exclude: **/MANIFEST.MF
[INFO] Exclude: .gitignore
[INFO] Exclude: .git/**
[INFO] Exclude: bin/**
[INFO] Exclude: **/*.project
[INFO] Exclude: **/*.classpath
[INFO] Exclude: **/*.json
[INFO] Exclude: **/*.batch
[INFO] Exclude: **/NOTICE
[INFO] Exclude: **/DEPENDENCIES
[INFO] Exclude: **/archetype-resources/**
[INFO] Exclude: **/archetype-metadata.xml
[INFO] Exclude: **/archetype.properties
[INFO] Exclude: **/*.txt
[INFO] 19 resources included (use -debug for more details)
[INFO] Rat check: Summary of files. Unapproved: 0 unknown: 0 generated: 0 approved: 18 licence.
[INFO] 
[INFO] --- maven-war-plugin:2.4:war (default-war) @ olingo-odata2-jpa-processor-ref-web-incubating ---
[INFO] Packaging webapp
[INFO] Assembling webapp [olingo-odata2-jpa-processor-ref-web-incubating] in [<https://builds.apache.org/job/olingo-odata2-quality/ws/odata2-jpa-processor/jpa-web/target/olingo-odata2-jpa-processor-ref-web-incubating-1.1.0-SNAPSHOT]>
[INFO] Processing war project
[INFO] Copying webapp webResources [<https://builds.apache.org/job/olingo-odata2-quality/ws/odata2-jpa-processor/jpa-web/target/maven-shared-archive-resources]> to [<https://builds.apache.org/job/olingo-odata2-quality/ws/odata2-jpa-processor/jpa-web/target/olingo-odata2-jpa-processor-ref-web-incubating-1.1.0-SNAPSHOT]>
[INFO] Copying webapp resources [<https://builds.apache.org/job/olingo-odata2-quality/ws/odata2-jpa-processor/jpa-web/src/main/webapp]>
[INFO] Webapp assembled in [109 msecs]
[INFO] Building war: <https://builds.apache.org/job/olingo-odata2-quality/ws/odata2-jpa-processor/jpa-web/target/olingo-odata2-jpa-processor-ref-web-incubating-1.1.0-SNAPSHOT.war>
[INFO] 
[INFO] --- maven-site-plugin:3.2:attach-descriptor (attach-descriptor) @ olingo-odata2-jpa-processor-ref-web-incubating ---
[INFO] 
[INFO] --- maven-source-plugin:2.2.1:jar-no-fork (attach-sources) @ olingo-odata2-jpa-processor-ref-web-incubating ---
[INFO] Building jar: <https://builds.apache.org/job/olingo-odata2-quality/ws/odata2-jpa-processor/jpa-web/target/olingo-odata2-jpa-processor-ref-web-incubating-1.1.0-SNAPSHOT-sources.jar>
[INFO] 
[INFO] --- maven-checkstyle-plugin:2.10:check (checkstyle) @ olingo-odata2-jpa-processor-ref-web-incubating ---
[INFO] Starting audit...
Audit done.

[INFO] 
[INFO] --- maven-install-plugin:2.3.1:install (default-install) @ olingo-odata2-jpa-processor-ref-web-incubating ---
[INFO] Installing <https://builds.apache.org/job/olingo-odata2-quality/ws/odata2-jpa-processor/jpa-web/target/olingo-odata2-jpa-processor-ref-web-incubating-1.1.0-SNAPSHOT.war> to /home/jenkins/.m2/repository/org/apache/olingo/olingo-odata2-jpa-processor-ref-web-incubating/1.1.0-SNAPSHOT/olingo-odata2-jpa-processor-ref-web-incubating-1.1.0-SNAPSHOT.war
[INFO] Installing <https://builds.apache.org/job/olingo-odata2-quality/ws/odata2-jpa-processor/jpa-web/pom.xml> to /home/jenkins/.m2/repository/org/apache/olingo/olingo-odata2-jpa-processor-ref-web-incubating/1.1.0-SNAPSHOT/olingo-odata2-jpa-processor-ref-web-incubating-1.1.0-SNAPSHOT.pom
[INFO] Installing <https://builds.apache.org/job/olingo-odata2-quality/ws/odata2-jpa-processor/jpa-web/target/olingo-odata2-jpa-processor-ref-web-incubating-1.1.0-SNAPSHOT-sources.jar> to /home/jenkins/.m2/repository/org/apache/olingo/olingo-odata2-jpa-processor-ref-web-incubating/1.1.0-SNAPSHOT/olingo-odata2-jpa-processor-ref-web-incubating-1.1.0-SNAPSHOT-sources.jar
[INFO]                                                                         
[INFO] ------------------------------------------------------------------------
[INFO] Building olingo-odata2-annotation-processor-incubating 1.1.0-SNAPSHOT
[INFO] ------------------------------------------------------------------------
[INFO] 
[INFO] --- maven-clean-plugin:2.5:clean (default-clean) @ olingo-odata2-annotation-processor-incubating ---
[INFO] Deleting <https://builds.apache.org/job/olingo-odata2-quality/ws/odata2-annotation-processor/target>
[INFO] 
[INFO] --- buildnumber-maven-plugin:1.2:create (default) @ olingo-odata2-annotation-processor-incubating ---
[INFO] 
[INFO] --- maven-remote-resources-plugin:1.4:process (default) @ olingo-odata2-annotation-processor-incubating ---
[INFO] 
[INFO] --- apache-rat-plugin:0.9:rat (rat-check) @ olingo-odata2-annotation-processor-incubating ---
[INFO] 55 implicit excludes (use -debug for more details).
[INFO] Exclude: **/MANIFEST.MF
[INFO] Exclude: .gitignore
[INFO] Exclude: .git/**
[INFO] Exclude: bin/**
[INFO] Exclude: **/*.project
[INFO] Exclude: **/*.classpath
[INFO] Exclude: **/*.json
[INFO] Exclude: **/*.batch
[INFO] Exclude: **/NOTICE
[INFO] Exclude: **/DEPENDENCIES
[INFO] Exclude: **/archetype-resources/**
[INFO] Exclude: **/archetype-metadata.xml
[INFO] Exclude: **/archetype.properties
[INFO] Exclude: **/*.txt
[INFO] 101 resources included (use -debug for more details)
[INFO] 
[INFO] --- apache-rat-plugin:0.9:check (rat-check) @ olingo-odata2-annotation-processor-incubating ---
[INFO] 55 implicit excludes (use -debug for more details).
[INFO] Exclude: **/MANIFEST.MF
[INFO] Exclude: .gitignore
[INFO] Exclude: .git/**
[INFO] Exclude: bin/**
[INFO] Exclude: **/*.project
[INFO] Exclude: **/*.classpath
[INFO] Exclude: **/*.json
[INFO] Exclude: **/*.batch
[INFO] Exclude: **/NOTICE
[INFO] Exclude: **/DEPENDENCIES
[INFO] Exclude: **/archetype-resources/**
[INFO] Exclude: **/archetype-metadata.xml
[INFO] Exclude: **/archetype.properties
[INFO] Exclude: **/*.txt
[INFO] 101 resources included (use -debug for more details)
[INFO] Rat check: Summary of files. Unapproved: 10 unknown: 10 generated: 0 approved: 7 licence.
[INFO] ------------------------------------------------------------------------
[INFO] Reactor Summary:
[INFO] 
[INFO] olingo-odata2-parent-incubating ................... SUCCESS [7.464s]
[INFO] olingo-odata2-lib-incubating ...................... SUCCESS [0.495s]
[INFO] olingo-odata2-api-incubating ...................... SUCCESS [6.942s]
[INFO] olingo-odata2-api-annotation-incubating ........... SUCCESS [1.510s]
[INFO] olingo-odata2-testutil-incubating ................. SUCCESS [3.539s]
[INFO] olingo-odata2-core-incubating ..................... SUCCESS [29.276s]
[INFO] olingo-odata2-ref-incubating ...................... SUCCESS [3.783s]
[INFO] olingo-odata2-fit-incubating ...................... SUCCESS [37.021s]
[INFO] olingo-odata2-ref-web-incubating .................. SUCCESS [1.977s]
[INFO] olingo-odata2-jpa-processor-incubating ............ SUCCESS [0.321s]
[INFO] olingo-odata2-jpa-processor-api-incubating ........ SUCCESS [1.578s]
[INFO] olingo-odata2-jpa-processor-core-incubating ....... SUCCESS [7.862s]
[INFO] olingo-odata2-jpa-processor-ref-incubating ........ SUCCESS [1.215s]
[INFO] olingo-odata2-jpa-processor-ref-web-incubating .... SUCCESS [3.131s]
[INFO] olingo-odata2-annotation-processor-incubating ..... FAILURE [0.871s]
[INFO] olingo-odata2-annotation-processor-api-incubating . SKIPPED
[INFO] olingo-odata2-annotation-processor-core-incubating  SKIPPED
[INFO] olingo-odata2-annotation-processor-ref-incubating . SKIPPED
[INFO] olingo-odata2-annotation-processor-ref-web-incubating  SKIPPED
[INFO] olingo-odata2-dist-incubating ..................... SKIPPED
[INFO] olingo-odata2-dist-lib-incubating ................. SKIPPED
[INFO] olingo-odata2-dist-jpa-incubating ................. SKIPPED
[INFO] olingo-odata2-dist-ref-incubating ................. SKIPPED
[INFO] olingo-odata2-dist-javadoc-incubating ............. SKIPPED
[INFO] olingo-odata2-sample-incubating ................... SKIPPED
[INFO] olingo-odata2-sample-cars-service-archetype-incubating  SKIPPED
[INFO] ------------------------------------------------------------------------
[INFO] BUILD FAILURE
[INFO] ------------------------------------------------------------------------
[INFO] Total time: 1:48.654s
[INFO] Finished at: Wed Jan 08 13:52:23 UTC 2014
[INFO] Final Memory: 78M/339M
[INFO] ------------------------------------------------------------------------
[ERROR] Failed to execute goal org.apache.rat:apache-rat-plugin:0.9:check (rat-check) on project olingo-odata2-annotation-processor-incubating: Too many files with unapproved license: 10 See RAT report in: <https://builds.apache.org/job/olingo-odata2-quality/ws/odata2-annotation-processor/target/rat.txt> -> [Help 1]
[ERROR] 
[ERROR] To see the full stack trace of the errors, re-run Maven with the -e switch.
[ERROR] Re-run Maven using the -X switch to enable full debug logging.
[ERROR] 
[ERROR] For more information about the errors and possible solutions, please read the following articles:
[ERROR] [Help 1] http://cwiki.apache.org/confluence/display/MAVEN/MojoFailureException
[ERROR] 
[ERROR] After correcting the problems, you can resume the build with the command
[ERROR]   mvn <goals> -rf :olingo-odata2-annotation-processor-incubating
Build step 'Invoke top-level Maven targets' marked build as failure

Build failed in Jenkins: olingo-odata2-quality #111

Posted by Apache Jenkins Server <je...@builds.apache.org>.
See <https://builds.apache.org/job/olingo-odata2-quality/111/>

------------------------------------------
Started by user mibo
Building remotely on ubuntu2 in workspace <https://builds.apache.org/job/olingo-odata2-quality/ws/>
Fetching changes from the remote Git repository
Fetching upstream changes from https://git-wip-us.apache.org/repos/asf/incubator-olingo-odata2.git
Checking out Revision a42ace7ba3b0dda5977b745d0a99ea8f13392bc2 (origin/master)
[olingo-odata2-quality] $ /home/hudson/tools/maven/apache-maven-3.0.4/bin/mvn clean install -Pbuild.quality
[INFO] Scanning for projects...
[INFO] ------------------------------------------------------------------------
[INFO] Reactor Build Order:
[INFO] 
[INFO] olingo-odata2-parent-incubating
[INFO] olingo-odata2-lib-incubating
[INFO] olingo-odata2-api-incubating
[INFO] olingo-odata2-api-annotation-incubating
[INFO] olingo-odata2-testutil-incubating
[INFO] olingo-odata2-core-incubating
[INFO] olingo-odata2-ref-incubating
[INFO] olingo-odata2-fit-incubating
[INFO] olingo-odata2-ref-web-incubating
[INFO] olingo-odata2-jpa-processor-incubating
[INFO] olingo-odata2-jpa-processor-api-incubating
[INFO] olingo-odata2-jpa-processor-core-incubating
[INFO] olingo-odata2-jpa-processor-ref-incubating
[INFO] olingo-odata2-jpa-processor-ref-web-incubating
[INFO] olingo-odata2-annotation-processor-incubating
[INFO] olingo-odata2-annotation-processor-api-incubating
[INFO] olingo-odata2-annotation-processor-core-incubating
[INFO] olingo-odata2-annotation-processor-ref-incubating
[INFO] olingo-odata2-annotation-processor-ref-web-incubating
[INFO] olingo-odata2-dist-incubating
[INFO] olingo-odata2-dist-lib-incubating
[INFO] olingo-odata2-dist-jpa-incubating
[INFO] olingo-odata2-dist-ref-incubating
[INFO] olingo-odata2-dist-javadoc-incubating
[INFO] olingo-odata2-sample-incubating
[INFO] olingo-odata2-sample-cars-service-archetype-incubating
[INFO]                                                                         
[INFO] ------------------------------------------------------------------------
[INFO] Building olingo-odata2-parent-incubating 1.1.0-SNAPSHOT
[INFO] ------------------------------------------------------------------------
[INFO] 
[INFO] --- maven-clean-plugin:2.5:clean (default-clean) @ olingo-odata2-parent-incubating ---
[INFO] Deleting /home/hudson/jenkins-slave/workspace/olingo-odata2-quality/target
[INFO] 
[INFO] --- buildnumber-maven-plugin:1.2:create (default) @ olingo-odata2-parent-incubating ---
[INFO] Checking for local modifications: skipped.
[INFO] Updating project files from SCM: skipped.
[INFO] Executing: /bin/sh -c cd /home/hudson/jenkins-slave/workspace/olingo-odata2-quality && svn --non-interactive info
[INFO] Working directory: /home/hudson/jenkins-slave/workspace/olingo-odata2-quality
[INFO] Storing buildNumber: ? at timestamp: 2014-01-08T07:19:16+0000
[INFO] Executing: /bin/sh -c cd /home/hudson/jenkins-slave/workspace/olingo-odata2-quality && svn --non-interactive info
[INFO] Working directory: /home/hudson/jenkins-slave/workspace/olingo-odata2-quality
[INFO] Storing buildScmBranch: UNKNOWN_BRANCH
[INFO] 
[INFO] --- maven-remote-resources-plugin:1.4:process (default) @ olingo-odata2-parent-incubating ---
[INFO] 
[INFO] --- apache-rat-plugin:0.9:rat (rat-check) @ olingo-odata2-parent-incubating ---
[INFO] 56 implicit excludes (use -debug for more details).
[INFO] Exclude: **/MANIFEST.MF
[INFO] Exclude: .gitignore
[INFO] Exclude: .git/**
[INFO] Exclude: bin/**
[INFO] Exclude: **/*.project
[INFO] Exclude: **/*.classpath
[INFO] Exclude: **/*.json
[INFO] Exclude: **/*.batch
[INFO] Exclude: **/NOTICE
[INFO] Exclude: **/DEPENDENCIES
[INFO] Exclude: **/archetype-resources/**
[INFO] Exclude: **/archetype-metadata.xml
[INFO] Exclude: **/archetype.properties
[INFO] Exclude: **/*.txt
[INFO] 1672 resources included (use -debug for more details)
[INFO] 
[INFO] --- apache-rat-plugin:0.9:check (rat-check) @ olingo-odata2-parent-incubating ---
[INFO] 56 implicit excludes (use -debug for more details).
[INFO] Exclude: **/MANIFEST.MF
[INFO] Exclude: .gitignore
[INFO] Exclude: .git/**
[INFO] Exclude: bin/**
[INFO] Exclude: **/*.project
[INFO] Exclude: **/*.classpath
[INFO] Exclude: **/*.json
[INFO] Exclude: **/*.batch
[INFO] Exclude: **/NOTICE
[INFO] Exclude: **/DEPENDENCIES
[INFO] Exclude: **/archetype-resources/**
[INFO] Exclude: **/archetype-metadata.xml
[INFO] Exclude: **/archetype.properties
[INFO] Exclude: **/*.txt
[INFO] 1672 resources included (use -debug for more details)
[INFO] Rat check: Summary of files. Unapproved: 293 unknown: 293 generated: 0 approved: 53 licence.
[INFO] ------------------------------------------------------------------------
[INFO] Reactor Summary:
[INFO] 
[INFO] olingo-odata2-parent-incubating ................... FAILURE [2:57.786s]
[INFO] olingo-odata2-lib-incubating ...................... SKIPPED
[INFO] olingo-odata2-api-incubating ...................... SKIPPED
[INFO] olingo-odata2-api-annotation-incubating ........... SKIPPED
[INFO] olingo-odata2-testutil-incubating ................. SKIPPED
[INFO] olingo-odata2-core-incubating ..................... SKIPPED
[INFO] olingo-odata2-ref-incubating ...................... SKIPPED
[INFO] olingo-odata2-fit-incubating ...................... SKIPPED
[INFO] olingo-odata2-ref-web-incubating .................. SKIPPED
[INFO] olingo-odata2-jpa-processor-incubating ............ SKIPPED
[INFO] olingo-odata2-jpa-processor-api-incubating ........ SKIPPED
[INFO] olingo-odata2-jpa-processor-core-incubating ....... SKIPPED
[INFO] olingo-odata2-jpa-processor-ref-incubating ........ SKIPPED
[INFO] olingo-odata2-jpa-processor-ref-web-incubating .... SKIPPED
[INFO] olingo-odata2-annotation-processor-incubating ..... SKIPPED
[INFO] olingo-odata2-annotation-processor-api-incubating . SKIPPED
[INFO] olingo-odata2-annotation-processor-core-incubating  SKIPPED
[INFO] olingo-odata2-annotation-processor-ref-incubating . SKIPPED
[INFO] olingo-odata2-annotation-processor-ref-web-incubating  SKIPPED
[INFO] olingo-odata2-dist-incubating ..................... SKIPPED
[INFO] olingo-odata2-dist-lib-incubating ................. SKIPPED
[INFO] olingo-odata2-dist-jpa-incubating ................. SKIPPED
[INFO] olingo-odata2-dist-ref-incubating ................. SKIPPED
[INFO] olingo-odata2-dist-javadoc-incubating ............. SKIPPED
[INFO] olingo-odata2-sample-incubating ................... SKIPPED
[INFO] olingo-odata2-sample-cars-service-archetype-incubating  SKIPPED
[INFO] ------------------------------------------------------------------------
[INFO] BUILD FAILURE
[INFO] ------------------------------------------------------------------------
[INFO] Total time: 2:59.719s
[INFO] Finished at: Wed Jan 08 07:22:12 UTC 2014
[INFO] Final Memory: 18M/69M
[INFO] ------------------------------------------------------------------------
[ERROR] Failed to execute goal org.apache.rat:apache-rat-plugin:0.9:check (rat-check) on project olingo-odata2-parent-incubating: Too many files with unapproved license: 293 See RAT report in: /home/hudson/jenkins-slave/workspace/olingo-odata2-quality/target/rat.txt -> [Help 1]
[ERROR] 
[ERROR] To see the full stack trace of the errors, re-run Maven with the -e switch.
[ERROR] Re-run Maven using the -X switch to enable full debug logging.
[ERROR] 
[ERROR] For more information about the errors and possible solutions, please read the following articles:
[ERROR] [Help 1] http://cwiki.apache.org/confluence/display/MAVEN/MojoFailureException
Build step 'Invoke top-level Maven targets' marked build as failure

Build failed in Jenkins: olingo-odata2-quality #110

Posted by Apache Jenkins Server <je...@builds.apache.org>.
See <https://builds.apache.org/job/olingo-odata2-quality/110/>

------------------------------------------
Started by user mibo
Building remotely on ubuntu6 in workspace <https://builds.apache.org/job/olingo-odata2-quality/ws/>
Fetching changes from the remote Git repository
Fetching upstream changes from https://git-wip-us.apache.org/repos/asf/incubator-olingo-odata2.git
Checking out Revision a42ace7ba3b0dda5977b745d0a99ea8f13392bc2 (origin/master)
[olingo-odata2-quality] $ /home/hudson/tools/maven/apache-maven-3.0.4/bin/mvn clean install -Pbuild.quality
[INFO] Scanning for projects...
[INFO] ------------------------------------------------------------------------
[INFO] Reactor Build Order:
[INFO] 
[INFO] olingo-odata2-parent-incubating
[INFO] olingo-odata2-lib-incubating
[INFO] olingo-odata2-api-incubating
[INFO] olingo-odata2-api-annotation-incubating
[INFO] olingo-odata2-testutil-incubating
[INFO] olingo-odata2-core-incubating
[INFO] olingo-odata2-ref-incubating
[INFO] olingo-odata2-fit-incubating
[INFO] olingo-odata2-ref-web-incubating
[INFO] olingo-odata2-jpa-processor-incubating
[INFO] olingo-odata2-jpa-processor-api-incubating
[INFO] olingo-odata2-jpa-processor-core-incubating
[INFO] olingo-odata2-jpa-processor-ref-incubating
[INFO] olingo-odata2-jpa-processor-ref-web-incubating
[INFO] olingo-odata2-annotation-processor-incubating
[INFO] olingo-odata2-annotation-processor-api-incubating
[INFO] olingo-odata2-annotation-processor-core-incubating
[INFO] olingo-odata2-annotation-processor-ref-incubating
[INFO] olingo-odata2-annotation-processor-ref-web-incubating
[INFO] olingo-odata2-dist-incubating
[INFO] olingo-odata2-dist-lib-incubating
[INFO] olingo-odata2-dist-jpa-incubating
[INFO] olingo-odata2-dist-ref-incubating
[INFO] olingo-odata2-dist-javadoc-incubating
[INFO] olingo-odata2-sample-incubating
[INFO] olingo-odata2-sample-cars-service-archetype-incubating
[INFO]                                                                         
[INFO] ------------------------------------------------------------------------
[INFO] Building olingo-odata2-parent-incubating 1.1.0-SNAPSHOT
[INFO] ------------------------------------------------------------------------
[INFO] 
[INFO] --- maven-clean-plugin:2.5:clean (default-clean) @ olingo-odata2-parent-incubating ---
[INFO] Deleting <https://builds.apache.org/job/olingo-odata2-quality/ws/target>
[INFO] 
[INFO] --- buildnumber-maven-plugin:1.2:create (default) @ olingo-odata2-parent-incubating ---
[INFO] Checking for local modifications: skipped.
[INFO] Updating project files from SCM: skipped.
[INFO] Executing: /bin/sh -c cd <https://builds.apache.org/job/olingo-odata2-quality/ws/> && svn --non-interactive info
[INFO] Working directory: <https://builds.apache.org/job/olingo-odata2-quality/ws/>
[INFO] Storing buildNumber: ? at timestamp: 2014-01-08T06:37:38+0000
[INFO] Executing: /bin/sh -c cd <https://builds.apache.org/job/olingo-odata2-quality/ws/> && svn --non-interactive info
[INFO] Working directory: <https://builds.apache.org/job/olingo-odata2-quality/ws/>
[INFO] Storing buildScmBranch: UNKNOWN_BRANCH
[INFO] 
[INFO] --- maven-remote-resources-plugin:1.4:process (default) @ olingo-odata2-parent-incubating ---
[INFO] 
[INFO] --- apache-rat-plugin:0.9:rat (rat-check) @ olingo-odata2-parent-incubating ---
[INFO] 56 implicit excludes (use -debug for more details).
[INFO] Exclude: **/MANIFEST.MF
[INFO] Exclude: .gitignore
[INFO] Exclude: .git/**
[INFO] Exclude: bin/**
[INFO] Exclude: **/*.project
[INFO] Exclude: **/*.classpath
[INFO] Exclude: **/*.json
[INFO] Exclude: **/*.batch
[INFO] Exclude: **/NOTICE
[INFO] Exclude: **/DEPENDENCIES
[INFO] Exclude: **/archetype-resources/**
[INFO] Exclude: **/archetype-metadata.xml
[INFO] Exclude: **/archetype.properties
[INFO] Exclude: **/*.txt
[INFO] 563 resources included (use -debug for more details)
[INFO] 
[INFO] --- apache-rat-plugin:0.9:check (rat-check) @ olingo-odata2-parent-incubating ---
[INFO] 56 implicit excludes (use -debug for more details).
[INFO] Exclude: **/MANIFEST.MF
[INFO] Exclude: .gitignore
[INFO] Exclude: .git/**
[INFO] Exclude: bin/**
[INFO] Exclude: **/*.project
[INFO] Exclude: **/*.classpath
[INFO] Exclude: **/*.json
[INFO] Exclude: **/*.batch
[INFO] Exclude: **/NOTICE
[INFO] Exclude: **/DEPENDENCIES
[INFO] Exclude: **/archetype-resources/**
[INFO] Exclude: **/archetype-metadata.xml
[INFO] Exclude: **/archetype.properties
[INFO] Exclude: **/*.txt
[INFO] 563 resources included (use -debug for more details)
[INFO] Rat check: Summary of files. Unapproved: 79 unknown: 79 generated: 0 approved: 33 licence.
[INFO] ------------------------------------------------------------------------
[INFO] Reactor Summary:
[INFO] 
[INFO] olingo-odata2-parent-incubating ................... FAILURE [13.686s]
[INFO] olingo-odata2-lib-incubating ...................... SKIPPED
[INFO] olingo-odata2-api-incubating ...................... SKIPPED
[INFO] olingo-odata2-api-annotation-incubating ........... SKIPPED
[INFO] olingo-odata2-testutil-incubating ................. SKIPPED
[INFO] olingo-odata2-core-incubating ..................... SKIPPED
[INFO] olingo-odata2-ref-incubating ...................... SKIPPED
[INFO] olingo-odata2-fit-incubating ...................... SKIPPED
[INFO] olingo-odata2-ref-web-incubating .................. SKIPPED
[INFO] olingo-odata2-jpa-processor-incubating ............ SKIPPED
[INFO] olingo-odata2-jpa-processor-api-incubating ........ SKIPPED
[INFO] olingo-odata2-jpa-processor-core-incubating ....... SKIPPED
[INFO] olingo-odata2-jpa-processor-ref-incubating ........ SKIPPED
[INFO] olingo-odata2-jpa-processor-ref-web-incubating .... SKIPPED
[INFO] olingo-odata2-annotation-processor-incubating ..... SKIPPED
[INFO] olingo-odata2-annotation-processor-api-incubating . SKIPPED
[INFO] olingo-odata2-annotation-processor-core-incubating  SKIPPED
[INFO] olingo-odata2-annotation-processor-ref-incubating . SKIPPED
[INFO] olingo-odata2-annotation-processor-ref-web-incubating  SKIPPED
[INFO] olingo-odata2-dist-incubating ..................... SKIPPED
[INFO] olingo-odata2-dist-lib-incubating ................. SKIPPED
[INFO] olingo-odata2-dist-jpa-incubating ................. SKIPPED
[INFO] olingo-odata2-dist-ref-incubating ................. SKIPPED
[INFO] olingo-odata2-dist-javadoc-incubating ............. SKIPPED
[INFO] olingo-odata2-sample-incubating ................... SKIPPED
[INFO] olingo-odata2-sample-cars-service-archetype-incubating  SKIPPED
[INFO] ------------------------------------------------------------------------
[INFO] BUILD FAILURE
[INFO] ------------------------------------------------------------------------
[INFO] Total time: 15.624s
[INFO] Finished at: Wed Jan 08 06:37:49 UTC 2014
[INFO] Final Memory: 16M/93M
[INFO] ------------------------------------------------------------------------
[ERROR] Failed to execute goal org.apache.rat:apache-rat-plugin:0.9:check (rat-check) on project olingo-odata2-parent-incubating: Too many files with unapproved license: 79 See RAT report in: <https://builds.apache.org/job/olingo-odata2-quality/ws/target/rat.txt> -> [Help 1]
[ERROR] 
[ERROR] To see the full stack trace of the errors, re-run Maven with the -e switch.
[ERROR] Re-run Maven using the -X switch to enable full debug logging.
[ERROR] 
[ERROR] For more information about the errors and possible solutions, please read the following articles:
[ERROR] [Help 1] http://cwiki.apache.org/confluence/display/MAVEN/MojoFailureException
Build step 'Invoke top-level Maven targets' marked build as failure