You are viewing a plain text version of this content. The canonical link for it is here.
Posted to builds@solr.apache.org by Apache Jenkins Server <je...@builds.apache.org> on 2022/03/31 21:42:31 UTC
[JENKINS] Solr » Solr-Check-9.x - Build # 609 - Unstable!
Build: https://ci-builds.apache.org/job/Solr/job/Solr-Check-9.x/609/
1 tests failed.
FAILED: org.apache.solr.handler.designer.TestSchemaDesignerSettingsDAO.classMethod
Error Message:
com.carrotsearch.randomizedtesting.ThreadLeakError: 1 thread leaked from SUITE scope at org.apache.solr.handler.designer.TestSchemaDesignerSettingsDAO:
1) Thread[id=33302, name=ZKEventListenerThread, state=TIMED_WAITING, group=TGRP-TestSchemaDesignerSettingsDAO]
at java.base@11.0.12/java.lang.Thread.sleep(Native Method)
at app//org.apache.solr.common.cloud.ZkCmdExecutor.retryDelay(ZkCmdExecutor.java:161)
at app//org.apache.solr.common.cloud.ZkCmdExecutor.retryOperation(ZkCmdExecutor.java:82)
at app//org.apache.solr.common.cloud.SolrZkClient.exists(SolrZkClient.java:328)
at app//org.apache.solr.cloud.ZkController.pathExists(ZkController.java:1228)
at app//org.apache.solr.cloud.ZkSolrResourceLoader.openResource(ZkSolrResourceLoader.java:73)
at app//org.apache.lucene.analysis.AbstractAnalysisFactory.getLines(AbstractAnalysisFactory.java:302)
at app//org.apache.lucene.analysis.AbstractAnalysisFactory.getWordSet(AbstractAnalysisFactory.java:293)
at app//org.apache.lucene.analysis.en.AbstractWordsFileFilterFactory.inform(AbstractWordsFileFilterFactory.java:88)
at app//org.apache.solr.core.SolrResourceLoader.informAware(SolrResourceLoader.java:762)
at app//org.apache.solr.schema.ManagedIndexSchema.informResourceLoaderAwareObjectsInChain(ManagedIndexSchema.java:1470)
at app//org.apache.solr.schema.ManagedIndexSchema.informResourceLoaderAwareObjectsForFieldType(ManagedIndexSchema.java:1319)
at app//org.apache.solr.schema.ManagedIndexSchema.postReadInform(ManagedIndexSchema.java:1307)
at app//org.apache.solr.schema.IndexSchema.readSchema(IndexSchema.java:654)
at app//org.apache.solr.schema.IndexSchema.<init>(IndexSchema.java:188)
at app//org.apache.solr.schema.ManagedIndexSchema.<init>(ManagedIndexSchema.java:119)
at app//org.apache.solr.schema.ManagedIndexSchemaFactory.create(ManagedIndexSchemaFactory.java:279)
at app//org.apache.solr.schema.ManagedIndexSchemaFactory.create(ManagedIndexSchemaFactory.java:51)
at app//org.apache.solr.core.ConfigSetService.createIndexSchema(ConfigSetService.java:345)
at app//org.apache.solr.core.ConfigSetService.lambda$loadConfigSet$0(ConfigSetService.java:256)
at app//org.apache.solr.core.ConfigSetService$$Lambda$340/0x0000000100586040.get(Unknown Source)
at app//org.apache.solr.core.ConfigSet.<init>(ConfigSet.java:49)
at app//org.apache.solr.core.ConfigSetService.loadConfigSet(ConfigSetService.java:252)
at app//org.apache.solr.core.CoreContainer.reload(CoreContainer.java:1850)
at app//org.apache.solr.core.SolrCore.lambda$getConfListener$21(SolrCore.java:3394)
at app//org.apache.solr.core.SolrCore$$Lambda$1012/0x0000000100aa6040.run(Unknown Source)
at app//org.apache.solr.cloud.ZkController.lambda$fireEventListeners$18(ZkController.java:2761)
at app//org.apache.solr.cloud.ZkController$$Lambda$1561/0x0000000100722440.run(Unknown Source)
at java.base@11.0.12/java.lang.Thread.run(Thread.java:834)
Stack Trace:
com.carrotsearch.randomizedtesting.ThreadLeakError: 1 thread leaked from SUITE scope at org.apache.solr.handler.designer.TestSchemaDesignerSettingsDAO:
1) Thread[id=33302, name=ZKEventListenerThread, state=TIMED_WAITING, group=TGRP-TestSchemaDesignerSettingsDAO]
at java.base@11.0.12/java.lang.Thread.sleep(Native Method)
at app//org.apache.solr.common.cloud.ZkCmdExecutor.retryDelay(ZkCmdExecutor.java:161)
at app//org.apache.solr.common.cloud.ZkCmdExecutor.retryOperation(ZkCmdExecutor.java:82)
at app//org.apache.solr.common.cloud.SolrZkClient.exists(SolrZkClient.java:328)
at app//org.apache.solr.cloud.ZkController.pathExists(ZkController.java:1228)
at app//org.apache.solr.cloud.ZkSolrResourceLoader.openResource(ZkSolrResourceLoader.java:73)
at app//org.apache.lucene.analysis.AbstractAnalysisFactory.getLines(AbstractAnalysisFactory.java:302)
at app//org.apache.lucene.analysis.AbstractAnalysisFactory.getWordSet(AbstractAnalysisFactory.java:293)
at app//org.apache.lucene.analysis.en.AbstractWordsFileFilterFactory.inform(AbstractWordsFileFilterFactory.java:88)
at app//org.apache.solr.core.SolrResourceLoader.informAware(SolrResourceLoader.java:762)
at app//org.apache.solr.schema.ManagedIndexSchema.informResourceLoaderAwareObjectsInChain(ManagedIndexSchema.java:1470)
at app//org.apache.solr.schema.ManagedIndexSchema.informResourceLoaderAwareObjectsForFieldType(ManagedIndexSchema.java:1319)
at app//org.apache.solr.schema.ManagedIndexSchema.postReadInform(ManagedIndexSchema.java:1307)
at app//org.apache.solr.schema.IndexSchema.readSchema(IndexSchema.java:654)
at app//org.apache.solr.schema.IndexSchema.<init>(IndexSchema.java:188)
at app//org.apache.solr.schema.ManagedIndexSchema.<init>(ManagedIndexSchema.java:119)
at app//org.apache.solr.schema.ManagedIndexSchemaFactory.create(ManagedIndexSchemaFactory.java:279)
at app//org.apache.solr.schema.ManagedIndexSchemaFactory.create(ManagedIndexSchemaFactory.java:51)
at app//org.apache.solr.core.ConfigSetService.createIndexSchema(ConfigSetService.java:345)
at app//org.apache.solr.core.ConfigSetService.lambda$loadConfigSet$0(ConfigSetService.java:256)
at app//org.apache.solr.core.ConfigSetService$$Lambda$340/0x0000000100586040.get(Unknown Source)
at app//org.apache.solr.core.ConfigSet.<init>(ConfigSet.java:49)
at app//org.apache.solr.core.ConfigSetService.loadConfigSet(ConfigSetService.java:252)
at app//org.apache.solr.core.CoreContainer.reload(CoreContainer.java:1850)
at app//org.apache.solr.core.SolrCore.lambda$getConfListener$21(SolrCore.java:3394)
at app//org.apache.solr.core.SolrCore$$Lambda$1012/0x0000000100aa6040.run(Unknown Source)
at app//org.apache.solr.cloud.ZkController.lambda$fireEventListeners$18(ZkController.java:2761)
at app//org.apache.solr.cloud.ZkController$$Lambda$1561/0x0000000100722440.run(Unknown Source)
at java.base@11.0.12/java.lang.Thread.run(Thread.java:834)
at __randomizedtesting.SeedInfo.seed([86C2DE70493447D9]:0)
Build Log:
[...truncated 1431 lines...]
ERROR: The following test(s) have failed:
- org.apache.solr.handler.designer.TestSchemaDesignerSettingsDAO.classMethod (:solr:core)
Test output: /home/jenkins/jenkins-slave/workspace/Solr/Solr-Check-9.x/solr/core/build/test-results/test/outputs/OUTPUT-org.apache.solr.handler.designer.TestSchemaDesignerSettingsDAO.txt
Reproduce with: gradlew :solr:core:test --tests "org.apache.solr.handler.designer.TestSchemaDesignerSettingsDAO.classMethod" -Ptests.jvms=4 -Ptests.haltonfailure=false "-Ptests.jvmargs=-XX:TieredStopAtLevel=1 -XX:ReservedCodeCacheSize=120m" -Ptests.seed=86C2DE70493447D9 -Ptests.multiplier=2 -Ptests.badapples=false -Ptests.file.encoding=UTF-8
Deprecated Gradle features were used in this build, making it incompatible with Gradle 8.0.
You can use '--warning-mode all' to show the individual deprecation warnings and determine if they come from your own scripts or plugins.
See https://docs.gradle.org/7.2/userguide/command_line_interface.html#sec:command_line_warnings
BUILD SUCCESSFUL in 53m 29s
531 actionable tasks: 531 executed
Build step 'Invoke Gradle script' changed build result to SUCCESS
Archiving artifacts
java.lang.InterruptedException: no matches found within 10000
at hudson.FilePath$ValidateAntFileMask.hasMatch(FilePath.java:3079)
at hudson.FilePath$ValidateAntFileMask.invoke(FilePath.java:2958)
at hudson.FilePath$ValidateAntFileMask.invoke(FilePath.java:2939)
at hudson.FilePath$FileCallableWrapper.call(FilePath.java:3329)
Also: hudson.remoting.Channel$CallSiteStackTrace: Remote call to lucene-solr-1
at hudson.remoting.Channel.attachCallSiteStackTrace(Channel.java:1797)
at hudson.remoting.UserRequest$ExceptionResponse.retrieve(UserRequest.java:356)
at hudson.remoting.Channel.call(Channel.java:1001)
at hudson.FilePath.act(FilePath.java:1165)
at hudson.FilePath.act(FilePath.java:1154)
at hudson.FilePath.validateAntFileMask(FilePath.java:2937)
at hudson.tasks.ArtifactArchiver.perform(ArtifactArchiver.java:268)
at hudson.tasks.BuildStepCompatibilityLayer.perform(BuildStepCompatibilityLayer.java:78)
at hudson.tasks.BuildStepMonitor$1.perform(BuildStepMonitor.java:20)
at hudson.model.AbstractBuild$AbstractBuildExecution.perform(AbstractBuild.java:806)
at hudson.model.AbstractBuild$AbstractBuildExecution.performAllBuildSteps(AbstractBuild.java:755)
at hudson.model.Build$BuildExecution.post2(Build.java:178)
at hudson.model.AbstractBuild$AbstractBuildExecution.post(AbstractBuild.java:699)
at hudson.model.Run.execute(Run.java:1913)
at hudson.model.FreeStyleBuild.run(FreeStyleBuild.java:43)
at hudson.model.ResourceController.execute(ResourceController.java:99)
at hudson.model.Executor.run(Executor.java:432)
Caused: hudson.FilePath$TunneledInterruptedException
at hudson.FilePath$FileCallableWrapper.call(FilePath.java:3331)
at hudson.remoting.UserRequest.perform(UserRequest.java:211)
at hudson.remoting.UserRequest.perform(UserRequest.java:54)
at hudson.remoting.Request$2.run(Request.java:376)
at hudson.remoting.InterceptingExecutorService.lambda$wrap$0(InterceptingExecutorService.java:78)
at java.util.concurrent.FutureTask.run(FutureTask.java:266)
at java.util.concurrent.ThreadPoolExecutor.runWorker(ThreadPoolExecutor.java:1149)
at java.util.concurrent.ThreadPoolExecutor$Worker.run(ThreadPoolExecutor.java:624)
at java.lang.Thread.run(Thread.java:748)
Caused: java.lang.InterruptedException: java.lang.InterruptedException: no matches found within 10000
at hudson.FilePath.act(FilePath.java:1167)
at hudson.FilePath.act(FilePath.java:1154)
at hudson.FilePath.validateAntFileMask(FilePath.java:2937)
at hudson.tasks.ArtifactArchiver.perform(ArtifactArchiver.java:268)
at hudson.tasks.BuildStepCompatibilityLayer.perform(BuildStepCompatibilityLayer.java:78)
at hudson.tasks.BuildStepMonitor$1.perform(BuildStepMonitor.java:20)
at hudson.model.AbstractBuild$AbstractBuildExecution.perform(AbstractBuild.java:806)
at hudson.model.AbstractBuild$AbstractBuildExecution.performAllBuildSteps(AbstractBuild.java:755)
at hudson.model.Build$BuildExecution.post2(Build.java:178)
at hudson.model.AbstractBuild$AbstractBuildExecution.post(AbstractBuild.java:699)
at hudson.model.Run.execute(Run.java:1913)
at hudson.model.FreeStyleBuild.run(FreeStyleBuild.java:43)
at hudson.model.ResourceController.execute(ResourceController.java:99)
at hudson.model.Executor.run(Executor.java:432)
No artifacts found that match the file pattern "**/*.events,heapdumps/**,**/hs_err_pid*". Configuration error?
Recording test results
[Checks API] No suitable checks publisher found.
Build step 'Publish JUnit test result report' changed build result to UNSTABLE
Email was triggered for: Unstable (Test Failures)
Sending email for trigger: Unstable (Test Failures)
[JENKINS] Solr » Solr-Check-9.x - Build # 611 - Still Unstable!
Posted by Apache Jenkins Server <je...@builds.apache.org>.
Build: https://ci-builds.apache.org/job/Solr/job/Solr-Check-9.x/611/
1 tests failed.
FAILED: org.apache.solr.search.facet.TestCloudJSONFacetSKGEquiv.testRandom
Error Message:
java.lang.AssertionError: rows=0&q=(field_9_multi_ss:50+OR+field_13_multi_sds:31+OR+field_13_multi_sds:47+OR+field_11_multi_sdsS:30+OR+field_11_multi_sdsS:15+OR+field_5_multi_sdsS:36+OR+field_2_multi_sdsS:46+OR+field_10_multi_sds:26+OR+field_7_multi_sds:52+OR+field_4_multi_sds:28)&fore=(field_10_multi_sds:16+OR+field_1_multi_sds:28+OR+field_7_multi_sds:55+OR+field_0_multi_ss:30+OR+field_12_multi_ss:62+OR+field_8_multi_sdsS:53+OR+field_7_multi_sds:13+OR+field_8_multi_sdsS:10+OR+field_4_multi_sds:49)&back=(field_8_multi_sdsS:9+OR+field_6_multi_ss:43+OR+field_10_multi_sds:45+OR+field_3_multi_ss:37+OR+field_10_multi_sds:31+OR+field_4_multi_sds:44+OR+field_2_multi_sdsS:46+OR+field_13_multi_sds:50+OR+field_8_multi_sdsS:39+OR+field_7_multi_sds:21)&json.facet={"facet_1":{"method":"${method_val:smart}","limit":30,"overrequest":0,"sort":"count+desc","allBuckets":false,"refine":true,"type":"terms","field":"field_12_solo_s","facet":{"skg":{"type":"func","func":"relatedness($fore,$back)","${sweep_key:xxx}":"${sweep_val:yyy}"}}},"facet_2":{"method":"${method_val:smart}","limit":-1,"overrequest":27,"perSeg":false,"sort":"index+asc","allBuckets":false,"refine":true,"type":"terms","field":"field_14_multi_sdsS","facet":{"skg":{"type":"func","func":"relatedness($fore,$back)","${sweep_key:xxx}":"${sweep_val:yyy}"}}}}&_stateVer_=org.apache.solr.search.facet.TestCloudJSONFacetSKGEquiv_collection:4 ===> Mismatch: .facet_2.buckets.length:50!=29 using method_val=enum&sweep_key=sweep_collection&sweep_val=true
Stack Trace:
java.lang.AssertionError: rows=0&q=(field_9_multi_ss:50+OR+field_13_multi_sds:31+OR+field_13_multi_sds:47+OR+field_11_multi_sdsS:30+OR+field_11_multi_sdsS:15+OR+field_5_multi_sdsS:36+OR+field_2_multi_sdsS:46+OR+field_10_multi_sds:26+OR+field_7_multi_sds:52+OR+field_4_multi_sds:28)&fore=(field_10_multi_sds:16+OR+field_1_multi_sds:28+OR+field_7_multi_sds:55+OR+field_0_multi_ss:30+OR+field_12_multi_ss:62+OR+field_8_multi_sdsS:53+OR+field_7_multi_sds:13+OR+field_8_multi_sdsS:10+OR+field_4_multi_sds:49)&back=(field_8_multi_sdsS:9+OR+field_6_multi_ss:43+OR+field_10_multi_sds:45+OR+field_3_multi_ss:37+OR+field_10_multi_sds:31+OR+field_4_multi_sds:44+OR+field_2_multi_sdsS:46+OR+field_13_multi_sds:50+OR+field_8_multi_sdsS:39+OR+field_7_multi_sds:21)&json.facet={"facet_1":{"method":"${method_val:smart}","limit":30,"overrequest":0,"sort":"count+desc","allBuckets":false,"refine":true,"type":"terms","field":"field_12_solo_s","facet":{"skg":{"type":"func","func":"relatedness($fore,$back)","${sweep_key:xxx}":"${sweep_val:yyy}"}}},"facet_2":{"method":"${method_val:smart}","limit":-1,"overrequest":27,"perSeg":false,"sort":"index+asc","allBuckets":false,"refine":true,"type":"terms","field":"field_14_multi_sdsS","facet":{"skg":{"type":"func","func":"relatedness($fore,$back)","${sweep_key:xxx}":"${sweep_val:yyy}"}}}}&_stateVer_=org.apache.solr.search.facet.TestCloudJSONFacetSKGEquiv_collection:4 ===> Mismatch: .facet_2.buckets.length:50!=29 using method_val=enum&sweep_key=sweep_collection&sweep_val=true
at __randomizedtesting.SeedInfo.seed([EA4CF23E5A36B72:7CE8EA2C54C3DD01]:0)
at org.apache.solr.search.facet.TestCloudJSONFacetSKGEquiv.assertFacetSKGsAreConsistent(TestCloudJSONFacetSKGEquiv.java:833)
at org.apache.solr.search.facet.TestCloudJSONFacetSKGEquiv.testRandom(TestCloudJSONFacetSKGEquiv.java:730)
at java.base/jdk.internal.reflect.NativeMethodAccessorImpl.invoke0(Native Method)
at java.base/jdk.internal.reflect.NativeMethodAccessorImpl.invoke(NativeMethodAccessorImpl.java:62)
at java.base/jdk.internal.reflect.DelegatingMethodAccessorImpl.invoke(DelegatingMethodAccessorImpl.java:43)
at java.base/java.lang.reflect.Method.invoke(Method.java:566)
at com.carrotsearch.randomizedtesting.RandomizedRunner.invoke(RandomizedRunner.java:1758)
at com.carrotsearch.randomizedtesting.RandomizedRunner$8.evaluate(RandomizedRunner.java:946)
at com.carrotsearch.randomizedtesting.RandomizedRunner$9.evaluate(RandomizedRunner.java:982)
at com.carrotsearch.randomizedtesting.RandomizedRunner$10.evaluate(RandomizedRunner.java:996)
at com.carrotsearch.randomizedtesting.rules.SystemPropertiesRestoreRule$1.evaluate(SystemPropertiesRestoreRule.java:57)
at org.junit.rules.RunRules.evaluate(RunRules.java:20)
at org.apache.lucene.util.TestRuleSetupTeardownChained$1.evaluate(TestRuleSetupTeardownChained.java:44)
at org.apache.lucene.util.AbstractBeforeAfterRule$1.evaluate(AbstractBeforeAfterRule.java:43)
at org.apache.lucene.util.TestRuleThreadAndTestName$1.evaluate(TestRuleThreadAndTestName.java:45)
at org.apache.lucene.util.TestRuleIgnoreAfterMaxFailures$1.evaluate(TestRuleIgnoreAfterMaxFailures.java:60)
at org.apache.lucene.util.TestRuleMarkFailure$1.evaluate(TestRuleMarkFailure.java:44)
at org.junit.rules.RunRules.evaluate(RunRules.java:20)
at com.carrotsearch.randomizedtesting.rules.StatementAdapter.evaluate(StatementAdapter.java:36)
at com.carrotsearch.randomizedtesting.ThreadLeakControl$StatementRunner.run(ThreadLeakControl.java:375)
at com.carrotsearch.randomizedtesting.ThreadLeakControl.forkTimeoutingTask(ThreadLeakControl.java:824)
at com.carrotsearch.randomizedtesting.ThreadLeakControl$3.evaluate(ThreadLeakControl.java:475)
at com.carrotsearch.randomizedtesting.RandomizedRunner.runSingleTest(RandomizedRunner.java:955)
at com.carrotsearch.randomizedtesting.RandomizedRunner$5.evaluate(RandomizedRunner.java:840)
at com.carrotsearch.randomizedtesting.RandomizedRunner$6.evaluate(RandomizedRunner.java:891)
at com.carrotsearch.randomizedtesting.RandomizedRunner$7.evaluate(RandomizedRunner.java:902)
at com.carrotsearch.randomizedtesting.rules.StatementAdapter.evaluate(StatementAdapter.java:36)
at org.apache.lucene.util.AbstractBeforeAfterRule$1.evaluate(AbstractBeforeAfterRule.java:43)
at org.apache.lucene.util.AbstractBeforeAfterRule$1.evaluate(AbstractBeforeAfterRule.java:43)
at com.carrotsearch.randomizedtesting.rules.SystemPropertiesRestoreRule$1.evaluate(SystemPropertiesRestoreRule.java:57)
at org.junit.rules.RunRules.evaluate(RunRules.java:20)
at org.apache.lucene.util.AbstractBeforeAfterRule$1.evaluate(AbstractBeforeAfterRule.java:43)
at com.carrotsearch.randomizedtesting.rules.StatementAdapter.evaluate(StatementAdapter.java:36)
at org.apache.lucene.util.TestRuleStoreClassName$1.evaluate(TestRuleStoreClassName.java:38)
at com.carrotsearch.randomizedtesting.rules.NoShadowingOrOverridesOnMethodsRule$1.evaluate(NoShadowingOrOverridesOnMethodsRule.java:40)
at com.carrotsearch.randomizedtesting.rules.NoShadowingOrOverridesOnMethodsRule$1.evaluate(NoShadowingOrOverridesOnMethodsRule.java:40)
at com.carrotsearch.randomizedtesting.rules.StatementAdapter.evaluate(StatementAdapter.java:36)
at com.carrotsearch.randomizedtesting.rules.StatementAdapter.evaluate(StatementAdapter.java:36)
at org.apache.lucene.util.TestRuleAssertionsRequired$1.evaluate(TestRuleAssertionsRequired.java:53)
at org.apache.lucene.util.AbstractBeforeAfterRule$1.evaluate(AbstractBeforeAfterRule.java:43)
at org.apache.lucene.util.TestRuleMarkFailure$1.evaluate(TestRuleMarkFailure.java:44)
at org.apache.lucene.util.TestRuleIgnoreAfterMaxFailures$1.evaluate(TestRuleIgnoreAfterMaxFailures.java:60)
at org.apache.lucene.util.TestRuleIgnoreTestSuites$1.evaluate(TestRuleIgnoreTestSuites.java:47)
at org.junit.rules.RunRules.evaluate(RunRules.java:20)
at com.carrotsearch.randomizedtesting.rules.StatementAdapter.evaluate(StatementAdapter.java:36)
at com.carrotsearch.randomizedtesting.ThreadLeakControl$StatementRunner.run(ThreadLeakControl.java:375)
at com.carrotsearch.randomizedtesting.ThreadLeakControl.lambda$forkTimeoutingTask$0(ThreadLeakControl.java:831)
at java.base/java.lang.Thread.run(Thread.java:834)
Caused by: java.lang.AssertionError: Mismatch: .facet_2.buckets.length:50!=29 using method_val=enum&sweep_key=sweep_collection&sweep_val=true
at org.junit.Assert.fail(Assert.java:89)
at org.apache.solr.search.facet.TestCloudJSONFacetSKGEquiv.assertFacetSKGsAreConsistent(TestCloudJSONFacetSKGEquiv.java:828)
... 47 more
Build Log:
[...truncated 17168 lines...]
ERROR: The following test(s) have failed:
- org.apache.solr.search.facet.TestCloudJSONFacetSKGEquiv.testRandom (:solr:core)
Test output: /home/jenkins/jenkins-slave/workspace/Solr/Solr-Check-9.x/solr/core/build/test-results/test/outputs/OUTPUT-org.apache.solr.search.facet.TestCloudJSONFacetSKGEquiv.txt
Reproduce with: gradlew :solr:core:test --tests "org.apache.solr.search.facet.TestCloudJSONFacetSKGEquiv.testRandom" -Ptests.jvms=4 -Ptests.haltonfailure=false "-Ptests.jvmargs=-XX:TieredStopAtLevel=1 -XX:ReservedCodeCacheSize=120m" -Ptests.seed=EA4CF23E5A36B72 -Ptests.multiplier=2 -Ptests.badapples=false -Ptests.file.encoding=ISO-8859-1
Deprecated Gradle features were used in this build, making it incompatible with Gradle 8.0.
You can use '--warning-mode all' to show the individual deprecation warnings and determine if they come from your own scripts or plugins.
See https://docs.gradle.org/7.2/userguide/command_line_interface.html#sec:command_line_warnings
BUILD SUCCESSFUL in 54m
531 actionable tasks: 531 executed
Build step 'Invoke Gradle script' changed build result to SUCCESS
Archiving artifacts
java.lang.InterruptedException: no matches found within 10000
at hudson.FilePath$ValidateAntFileMask.hasMatch(FilePath.java:3079)
at hudson.FilePath$ValidateAntFileMask.invoke(FilePath.java:2958)
at hudson.FilePath$ValidateAntFileMask.invoke(FilePath.java:2939)
at hudson.FilePath$FileCallableWrapper.call(FilePath.java:3329)
Also: hudson.remoting.Channel$CallSiteStackTrace: Remote call to lucene-solr-1
at hudson.remoting.Channel.attachCallSiteStackTrace(Channel.java:1797)
at hudson.remoting.UserRequest$ExceptionResponse.retrieve(UserRequest.java:356)
at hudson.remoting.Channel.call(Channel.java:1001)
at hudson.FilePath.act(FilePath.java:1165)
at hudson.FilePath.act(FilePath.java:1154)
at hudson.FilePath.validateAntFileMask(FilePath.java:2937)
at hudson.tasks.ArtifactArchiver.perform(ArtifactArchiver.java:268)
at hudson.tasks.BuildStepCompatibilityLayer.perform(BuildStepCompatibilityLayer.java:78)
at hudson.tasks.BuildStepMonitor$1.perform(BuildStepMonitor.java:20)
at hudson.model.AbstractBuild$AbstractBuildExecution.perform(AbstractBuild.java:806)
at hudson.model.AbstractBuild$AbstractBuildExecution.performAllBuildSteps(AbstractBuild.java:755)
at hudson.model.Build$BuildExecution.post2(Build.java:178)
at hudson.model.AbstractBuild$AbstractBuildExecution.post(AbstractBuild.java:699)
at hudson.model.Run.execute(Run.java:1913)
at hudson.model.FreeStyleBuild.run(FreeStyleBuild.java:43)
at hudson.model.ResourceController.execute(ResourceController.java:99)
at hudson.model.Executor.run(Executor.java:432)
Caused: hudson.FilePath$TunneledInterruptedException
at hudson.FilePath$FileCallableWrapper.call(FilePath.java:3331)
at hudson.remoting.UserRequest.perform(UserRequest.java:211)
at hudson.remoting.UserRequest.perform(UserRequest.java:54)
at hudson.remoting.Request$2.run(Request.java:376)
at hudson.remoting.InterceptingExecutorService.lambda$wrap$0(InterceptingExecutorService.java:78)
at java.util.concurrent.FutureTask.run(FutureTask.java:266)
at java.util.concurrent.ThreadPoolExecutor.runWorker(ThreadPoolExecutor.java:1149)
at java.util.concurrent.ThreadPoolExecutor$Worker.run(ThreadPoolExecutor.java:624)
at java.lang.Thread.run(Thread.java:748)
Caused: java.lang.InterruptedException: java.lang.InterruptedException: no matches found within 10000
at hudson.FilePath.act(FilePath.java:1167)
at hudson.FilePath.act(FilePath.java:1154)
at hudson.FilePath.validateAntFileMask(FilePath.java:2937)
at hudson.tasks.ArtifactArchiver.perform(ArtifactArchiver.java:268)
at hudson.tasks.BuildStepCompatibilityLayer.perform(BuildStepCompatibilityLayer.java:78)
at hudson.tasks.BuildStepMonitor$1.perform(BuildStepMonitor.java:20)
at hudson.model.AbstractBuild$AbstractBuildExecution.perform(AbstractBuild.java:806)
at hudson.model.AbstractBuild$AbstractBuildExecution.performAllBuildSteps(AbstractBuild.java:755)
at hudson.model.Build$BuildExecution.post2(Build.java:178)
at hudson.model.AbstractBuild$AbstractBuildExecution.post(AbstractBuild.java:699)
at hudson.model.Run.execute(Run.java:1913)
at hudson.model.FreeStyleBuild.run(FreeStyleBuild.java:43)
at hudson.model.ResourceController.execute(ResourceController.java:99)
at hudson.model.Executor.run(Executor.java:432)
No artifacts found that match the file pattern "**/*.events,heapdumps/**,**/hs_err_pid*". Configuration error?
Recording test results
[Checks API] No suitable checks publisher found.
Build step 'Publish JUnit test result report' changed build result to UNSTABLE
Email was triggered for: Unstable (Test Failures)
Sending email for trigger: Unstable (Test Failures)
[JENKINS] Solr » Solr-Check-9.x - Build # 610 - Still Unstable!
Posted by Apache Jenkins Server <je...@builds.apache.org>.
Build: https://ci-builds.apache.org/job/Solr/job/Solr-Check-9.x/610/
2 tests failed.
FAILED: org.apache.solr.util.OrderedExecutorTest.classMethod
Error Message:
com.carrotsearch.randomizedtesting.ThreadLeakError: 1 thread leaked from SUITE scope at org.apache.solr.util.OrderedExecutorTest:
1) Thread[id=26017, name=testLockWhenQueueIsFull_test-17157-thread-1, state=RUNNABLE, group=TGRP-OrderedExecutorTest]
at java.base@11.0.12/jdk.internal.misc.Unsafe.unpark(Native Method)
at java.base@11.0.12/java.util.concurrent.locks.LockSupport.unpark(LockSupport.java:160)
at java.base@11.0.12/java.util.concurrent.locks.AbstractQueuedSynchronizer.unparkSuccessor(AbstractQueuedSynchronizer.java:709)
at java.base@11.0.12/java.util.concurrent.locks.AbstractQueuedSynchronizer.release(AbstractQueuedSynchronizer.java:1305)
at java.base@11.0.12/java.util.concurrent.locks.ReentrantLock.unlock(ReentrantLock.java:439)
at java.base@11.0.12/java.util.concurrent.ThreadPoolExecutor.tryTerminate(ThreadPoolExecutor.java:726)
at java.base@11.0.12/java.util.concurrent.ThreadPoolExecutor.processWorkerExit(ThreadPoolExecutor.java:994)
at java.base@11.0.12/java.util.concurrent.ThreadPoolExecutor.runWorker(ThreadPoolExecutor.java:1142)
at java.base@11.0.12/java.util.concurrent.ThreadPoolExecutor$Worker.run(ThreadPoolExecutor.java:628)
at java.base@11.0.12/java.lang.Thread.run(Thread.java:834)
Stack Trace:
com.carrotsearch.randomizedtesting.ThreadLeakError: 1 thread leaked from SUITE scope at org.apache.solr.util.OrderedExecutorTest:
1) Thread[id=26017, name=testLockWhenQueueIsFull_test-17157-thread-1, state=RUNNABLE, group=TGRP-OrderedExecutorTest]
at java.base@11.0.12/jdk.internal.misc.Unsafe.unpark(Native Method)
at java.base@11.0.12/java.util.concurrent.locks.LockSupport.unpark(LockSupport.java:160)
at java.base@11.0.12/java.util.concurrent.locks.AbstractQueuedSynchronizer.unparkSuccessor(AbstractQueuedSynchronizer.java:709)
at java.base@11.0.12/java.util.concurrent.locks.AbstractQueuedSynchronizer.release(AbstractQueuedSynchronizer.java:1305)
at java.base@11.0.12/java.util.concurrent.locks.ReentrantLock.unlock(ReentrantLock.java:439)
at java.base@11.0.12/java.util.concurrent.ThreadPoolExecutor.tryTerminate(ThreadPoolExecutor.java:726)
at java.base@11.0.12/java.util.concurrent.ThreadPoolExecutor.processWorkerExit(ThreadPoolExecutor.java:994)
at java.base@11.0.12/java.util.concurrent.ThreadPoolExecutor.runWorker(ThreadPoolExecutor.java:1142)
at java.base@11.0.12/java.util.concurrent.ThreadPoolExecutor$Worker.run(ThreadPoolExecutor.java:628)
at java.base@11.0.12/java.lang.Thread.run(Thread.java:834)
at __randomizedtesting.SeedInfo.seed([B97E91596DF33991]:0)
FAILED: org.apache.solr.client.solrj.impl.CloudSolrClientBuilderTest.classMethod
Error Message:
com.carrotsearch.randomizedtesting.ThreadLeakError: 1 thread leaked from SUITE scope at org.apache.solr.client.solrj.impl.CloudSolrClientBuilderTest:
1) Thread[id=436, name=h2sc-251-thread-1, state=TERMINATED, group={null group}]
at (empty stack)
Stack Trace:
com.carrotsearch.randomizedtesting.ThreadLeakError: 1 thread leaked from SUITE scope at org.apache.solr.client.solrj.impl.CloudSolrClientBuilderTest:
1) Thread[id=436, name=h2sc-251-thread-1, state=TERMINATED, group={null group}]
at (empty stack)
at __randomizedtesting.SeedInfo.seed([B97E91596DF33991]:0)
Build Log:
[...truncated 1107 lines...]
ERROR: The following test(s) have failed:
- org.apache.solr.client.solrj.impl.CloudSolrClientBuilderTest.classMethod (:solr:solrj)
Test output: /home/jenkins/jenkins-slave/workspace/Solr/Solr-Check-9.x/solr/solrj/build/test-results/test/outputs/OUTPUT-org.apache.solr.client.solrj.impl.CloudSolrClientBuilderTest.txt
Reproduce with: gradlew :solr:solrj:test --tests "org.apache.solr.client.solrj.impl.CloudSolrClientBuilderTest.classMethod" -Ptests.jvms=4 -Ptests.haltonfailure=false "-Ptests.jvmargs=-XX:TieredStopAtLevel=1 -XX:ReservedCodeCacheSize=120m" -Ptests.seed=B97E91596DF33991 -Ptests.multiplier=2 -Ptests.badapples=false -Ptests.file.encoding=UTF-8
- org.apache.solr.util.OrderedExecutorTest.classMethod (:solr:core)
Test output: /home/jenkins/jenkins-slave/workspace/Solr/Solr-Check-9.x/solr/core/build/test-results/test/outputs/OUTPUT-org.apache.solr.util.OrderedExecutorTest.txt
Reproduce with: gradlew :solr:core:test --tests "org.apache.solr.util.OrderedExecutorTest.classMethod" -Ptests.jvms=4 -Ptests.haltonfailure=false "-Ptests.jvmargs=-XX:TieredStopAtLevel=1 -XX:ReservedCodeCacheSize=120m" -Ptests.seed=B97E91596DF33991 -Ptests.multiplier=2 -Ptests.badapples=false -Ptests.file.encoding=UTF-8
Deprecated Gradle features were used in this build, making it incompatible with Gradle 8.0.
You can use '--warning-mode all' to show the individual deprecation warnings and determine if they come from your own scripts or plugins.
See https://docs.gradle.org/7.2/userguide/command_line_interface.html#sec:command_line_warnings
BUILD SUCCESSFUL in 52m 39s
531 actionable tasks: 531 executed
Build step 'Invoke Gradle script' changed build result to SUCCESS
Archiving artifacts
java.lang.InterruptedException: no matches found within 10000
at hudson.FilePath$ValidateAntFileMask.hasMatch(FilePath.java:3079)
at hudson.FilePath$ValidateAntFileMask.invoke(FilePath.java:2958)
at hudson.FilePath$ValidateAntFileMask.invoke(FilePath.java:2939)
at hudson.FilePath$FileCallableWrapper.call(FilePath.java:3329)
Also: hudson.remoting.Channel$CallSiteStackTrace: Remote call to lucene-solr-2
at hudson.remoting.Channel.attachCallSiteStackTrace(Channel.java:1797)
at hudson.remoting.UserRequest$ExceptionResponse.retrieve(UserRequest.java:356)
at hudson.remoting.Channel.call(Channel.java:1001)
at hudson.FilePath.act(FilePath.java:1165)
at hudson.FilePath.act(FilePath.java:1154)
at hudson.FilePath.validateAntFileMask(FilePath.java:2937)
at hudson.tasks.ArtifactArchiver.perform(ArtifactArchiver.java:268)
at hudson.tasks.BuildStepCompatibilityLayer.perform(BuildStepCompatibilityLayer.java:78)
at hudson.tasks.BuildStepMonitor$1.perform(BuildStepMonitor.java:20)
at hudson.model.AbstractBuild$AbstractBuildExecution.perform(AbstractBuild.java:806)
at hudson.model.AbstractBuild$AbstractBuildExecution.performAllBuildSteps(AbstractBuild.java:755)
at hudson.model.Build$BuildExecution.post2(Build.java:178)
at hudson.model.AbstractBuild$AbstractBuildExecution.post(AbstractBuild.java:699)
at hudson.model.Run.execute(Run.java:1913)
at hudson.model.FreeStyleBuild.run(FreeStyleBuild.java:43)
at hudson.model.ResourceController.execute(ResourceController.java:99)
at hudson.model.Executor.run(Executor.java:432)
Caused: hudson.FilePath$TunneledInterruptedException
at hudson.FilePath$FileCallableWrapper.call(FilePath.java:3331)
at hudson.remoting.UserRequest.perform(UserRequest.java:211)
at hudson.remoting.UserRequest.perform(UserRequest.java:54)
at hudson.remoting.Request$2.run(Request.java:376)
at hudson.remoting.InterceptingExecutorService.lambda$wrap$0(InterceptingExecutorService.java:78)
at java.util.concurrent.FutureTask.run(FutureTask.java:266)
at java.util.concurrent.ThreadPoolExecutor.runWorker(ThreadPoolExecutor.java:1149)
at java.util.concurrent.ThreadPoolExecutor$Worker.run(ThreadPoolExecutor.java:624)
at java.lang.Thread.run(Thread.java:748)
Caused: java.lang.InterruptedException: java.lang.InterruptedException: no matches found within 10000
at hudson.FilePath.act(FilePath.java:1167)
at hudson.FilePath.act(FilePath.java:1154)
at hudson.FilePath.validateAntFileMask(FilePath.java:2937)
at hudson.tasks.ArtifactArchiver.perform(ArtifactArchiver.java:268)
at hudson.tasks.BuildStepCompatibilityLayer.perform(BuildStepCompatibilityLayer.java:78)
at hudson.tasks.BuildStepMonitor$1.perform(BuildStepMonitor.java:20)
at hudson.model.AbstractBuild$AbstractBuildExecution.perform(AbstractBuild.java:806)
at hudson.model.AbstractBuild$AbstractBuildExecution.performAllBuildSteps(AbstractBuild.java:755)
at hudson.model.Build$BuildExecution.post2(Build.java:178)
at hudson.model.AbstractBuild$AbstractBuildExecution.post(AbstractBuild.java:699)
at hudson.model.Run.execute(Run.java:1913)
at hudson.model.FreeStyleBuild.run(FreeStyleBuild.java:43)
at hudson.model.ResourceController.execute(ResourceController.java:99)
at hudson.model.Executor.run(Executor.java:432)
No artifacts found that match the file pattern "**/*.events,heapdumps/**,**/hs_err_pid*". Configuration error?
Recording test results
[Checks API] No suitable checks publisher found.
Build step 'Publish JUnit test result report' changed build result to UNSTABLE
Email was triggered for: Unstable (Test Failures)
Sending email for trigger: Unstable (Test Failures)