You are viewing a plain text version of this content. The canonical link for it is here.
Posted to builds@beam.apache.org by Apache Jenkins Server <je...@builds.apache.org> on 2022/12/02 19:36:02 UTC

Build failed in Jenkins: beam_PerformanceTests_InfluxDbIO_IT #2625

See <https://ci-beam.apache.org/job/beam_PerformanceTests_InfluxDbIO_IT/2625/display/redirect?page=changes>

Changes:

[Xinyu Liu] Disable flaky async tests in samza runner

[noreply] Revert "Support SqlTypes Date and Timestamp (MicrosInstant) in AvroUtils

[noreply] Bump actions/setup-java from 3.6.0 to 3.7.0 (#24484)

[noreply] Add GPU benchmark to RunInference Grafana dashboard (#24485)

[Yi Hu] Add back javadoc

[noreply] [CdapIO] Update read timeout for SparkReceiverIOIT job (#24428)

[noreply] Bump cloud.google.com/go/datastore from 1.9.0 to 1.10.0 in /sdks

[noreply] Reduce version matrix of build wheel on pull request event (#24448)

[noreply] [Spark dataset runner] Make sure PCollection views get only broadcasted

[noreply] Fix for #22951 w/ GroupIntoBatchesOverride fix (#24463)

[noreply] Never mark issues as stale (#24494)

[noreply] [BigQueryIO] Use final destination table schema and metadata when

[noreply] Minor visibility improvements to render runner. (#24480)

[noreply] [Go SDK]: Infer field names from struct tags (#24473)


------------------------------------------
[...truncated 184.94 KB...]
Stored cache entry for task ':sdks:java:io:influxdb:compileJava' with cache key cfccd1837405c63c74f3e24925cefa14
:sdks:java:io:influxdb:compileJava (Thread[Execution worker,5,main]) completed. Took 12.094 secs.
Resolve mutations for :sdks:java:io:influxdb:classes (Thread[Execution worker Thread 4,5,main]) started.
Resolve mutations for :sdks:java:io:influxdb:classes (Thread[Execution worker Thread 4,5,main]) completed. Took 0.0 secs.
:sdks:java:io:influxdb:classes (Thread[Execution worker Thread 4,5,main]) started.

> Task :sdks:java:io:influxdb:classes
Skipping task ':sdks:java:io:influxdb:classes' as it has no actions.
:sdks:java:io:influxdb:classes (Thread[Execution worker Thread 4,5,main]) completed. Took 0.0 secs.
Resolve mutations for :sdks:java:io:influxdb:compileTestJava (Thread[Execution worker Thread 4,5,main]) started.
Resolve mutations for :sdks:java:io:influxdb:compileTestJava (Thread[Execution worker Thread 4,5,main]) completed. Took 0.001 secs.
:sdks:java:io:influxdb:compileTestJava (Thread[Execution worker Thread 4,5,main]) started.

> Task :sdks:java:io:influxdb:compileTestJava
Custom actions are attached to task ':sdks:java:io:influxdb:compileTestJava'.
Build cache key for task ':sdks:java:io:influxdb:compileTestJava' is b53aa5919398d56db9d5a3ed38c4e0eb
Task ':sdks:java:io:influxdb:compileTestJava' is not up-to-date because:
  No history is available.
The input changes require a full rebuild for incremental task ':sdks:java:io:influxdb:compileTestJava'.
Full recompilation is required because no incremental change information is available. This is usually caused by clean builds or changing compiler arguments.
Compiling with toolchain '/usr/lib/jvm/java-8-openjdk-amd64'.
Compiling with JDK Java compiler API.
Note: <https://ci-beam.apache.org/job/beam_PerformanceTests_InfluxDbIO_IT/ws/src/sdks/java/io/influxdb/src/test/java/org/apache/beam/sdk/io/influxdb/InfluxDbIOTest.java> uses unchecked or unsafe operations.
Note: Recompile with -Xlint:unchecked for details.
Class dependency analysis for incremental compilation took 0.002 secs.
Created classpath snapshot for incremental compilation in 0.044 secs.
Stored cache entry for task ':sdks:java:io:influxdb:compileTestJava' with cache key b53aa5919398d56db9d5a3ed38c4e0eb
:sdks:java:io:influxdb:compileTestJava (Thread[Execution worker Thread 4,5,main]) completed. Took 2.704 secs.
Resolve mutations for :sdks:java:io:influxdb:testClasses (Thread[Execution worker Thread 6,5,main]) started.
Resolve mutations for :sdks:java:io:influxdb:testClasses (Thread[Execution worker Thread 6,5,main]) completed. Took 0.0 secs.
:sdks:java:io:influxdb:testClasses (Thread[Execution worker,5,main]) started.

> Task :sdks:java:io:influxdb:testClasses
Skipping task ':sdks:java:io:influxdb:testClasses' as it has no actions.
:sdks:java:io:influxdb:testClasses (Thread[Execution worker,5,main]) completed. Took 0.0 secs.

> Task :sdks:java:core:compileTestJava
Note: Some input files use or override a deprecated API.
Note: Recompile with -Xlint:deprecation for details.
Note: Some input files use unchecked or unsafe operations.
Note: Recompile with -Xlint:unchecked for details.
Class dependency analysis for incremental compilation took 0.583 secs.
Created classpath snapshot for incremental compilation in 0.467 secs.
Stored cache entry for task ':sdks:java:core:compileTestJava' with cache key c37e5e7b2e79501ad5650247ae1de715
:sdks:java:core:compileTestJava (Thread[Execution worker Thread 7,5,main]) completed. Took 39.851 secs.
Resolve mutations for :sdks:java:core:testClasses (Thread[Execution worker Thread 5,5,main]) started.
Resolve mutations for :sdks:java:core:testClasses (Thread[Execution worker Thread 5,5,main]) completed. Took 0.0 secs.
:sdks:java:core:testClasses (Thread[Execution worker,5,main]) started.

> Task :sdks:java:core:testClasses
Skipping task ':sdks:java:core:testClasses' as it has no actions.
:sdks:java:core:testClasses (Thread[Execution worker,5,main]) completed. Took 0.0 secs.
Resolve mutations for :sdks:java:core:shadowTestJar (Thread[Execution worker Thread 7,5,main]) started.
Resolve mutations for :sdks:java:core:shadowTestJar (Thread[Execution worker Thread 7,5,main]) completed. Took 0.0 secs.
:sdks:java:core:shadowTestJar (Thread[Execution worker Thread 5,5,main]) started.

> Task :sdks:java:core:shadowTestJar
Build cache key for task ':sdks:java:core:shadowTestJar' is ddb166bbfca91ade4caf339eaa54086b
Task ':sdks:java:core:shadowTestJar' is not up-to-date because:
  No history is available.
*******************
GRADLE SHADOW STATS

Total Jars: 4 (includes project)
Total Time: 1.066s [1066ms]
Average Time/Jar: 0.2665s [266.5ms]
*******************
Stored cache entry for task ':sdks:java:core:shadowTestJar' with cache key ddb166bbfca91ade4caf339eaa54086b
:sdks:java:core:shadowTestJar (Thread[Execution worker Thread 5,5,main]) completed. Took 2.984 secs.
work action resolve beam-sdks-java-core-tests.jar (project :sdks:java:core) (Thread[Execution worker Thread 2,5,main]) started.
work action null (Thread[Execution worker Thread 2,5,main]) completed. Took 0.0 secs.
Resolve mutations for :runners:core-java:compileTestJava (Thread[Execution worker Thread 7,5,main]) started.
Resolve mutations for :runners:core-java:compileTestJava (Thread[Execution worker Thread 7,5,main]) completed. Took 0.0 secs.
:runners:core-java:compileTestJava (Thread[Execution worker Thread 5,5,main]) started.

> Task :runners:core-java:compileTestJava
Custom actions are attached to task ':runners:core-java:compileTestJava'.
Build cache key for task ':runners:core-java:compileTestJava' is 506c65d65ebd18eba49cce928c48fc8f
Task ':runners:core-java:compileTestJava' is not up-to-date because:
  No history is available.
The input changes require a full rebuild for incremental task ':runners:core-java:compileTestJava'.
Full recompilation is required because no incremental change information is available. This is usually caused by clean builds or changing compiler arguments.
Compiling with toolchain '/usr/lib/jvm/java-8-openjdk-amd64'.
Compiling with JDK Java compiler API.
Note: Some input files use or override a deprecated API.
Note: Recompile with -Xlint:deprecation for details.
Note: Some input files use unchecked or unsafe operations.
Note: Recompile with -Xlint:unchecked for details.
Class dependency analysis for incremental compilation took 0.04 secs.
Created classpath snapshot for incremental compilation in 0.608 secs.
Stored cache entry for task ':runners:core-java:compileTestJava' with cache key 506c65d65ebd18eba49cce928c48fc8f
:runners:core-java:compileTestJava (Thread[Execution worker Thread 5,5,main]) completed. Took 8.42 secs.
Resolve mutations for :runners:core-java:testClasses (Thread[Execution worker Thread 2,5,main]) started.
Resolve mutations for :runners:core-java:testClasses (Thread[Execution worker Thread 2,5,main]) completed. Took 0.0 secs.
:runners:core-java:testClasses (Thread[Execution worker Thread 3,5,main]) started.

> Task :runners:core-java:testClasses
Skipping task ':runners:core-java:testClasses' as it has no actions.
:runners:core-java:testClasses (Thread[Execution worker Thread 3,5,main]) completed. Took 0.0 secs.
Resolve mutations for :runners:core-java:testJar (Thread[Execution worker Thread 5,5,main]) started.
Resolve mutations for :runners:core-java:testJar (Thread[Execution worker Thread 5,5,main]) completed. Took 0.0 secs.
:runners:core-java:testJar (Thread[Execution worker Thread 2,5,main]) started.

> Task :runners:core-java:testJar
Caching disabled for task ':runners:core-java:testJar' because:
  Not worth caching
Task ':runners:core-java:testJar' is not up-to-date because:
  No history is available.
file or directory '<https://ci-beam.apache.org/job/beam_PerformanceTests_InfluxDbIO_IT/ws/src/runners/core-java/build/resources/test',> not found
:runners:core-java:testJar (Thread[Execution worker Thread 2,5,main]) completed. Took 0.041 secs.
work action resolve beam-runners-core-java-tests.jar (project :runners:core-java) (Thread[Execution worker Thread 3,5,main]) started.
work action null (Thread[Execution worker Thread 3,5,main]) completed. Took 0.0 secs.
Resolve mutations for :runners:direct-java:compileTestJava (Thread[Execution worker Thread 7,5,main]) started.
Resolve mutations for :runners:direct-java:compileTestJava (Thread[Execution worker Thread 7,5,main]) completed. Took 0.0 secs.
:runners:direct-java:compileTestJava (Thread[Execution worker Thread 2,5,main]) started.

> Task :runners:direct-java:compileTestJava
Custom actions are attached to task ':runners:direct-java:compileTestJava'.
Build cache key for task ':runners:direct-java:compileTestJava' is c4bf72e6f2ffc1bdd6ea9ee66bfcb315
Task ':runners:direct-java:compileTestJava' is not up-to-date because:
  No history is available.
The input changes require a full rebuild for incremental task ':runners:direct-java:compileTestJava'.
Full recompilation is required because no incremental change information is available. This is usually caused by clean builds or changing compiler arguments.
Compiling with toolchain '/usr/lib/jvm/java-8-openjdk-amd64'.
Compiling with JDK Java compiler API.
Note: Some input files use or override a deprecated API.
Note: Recompile with -Xlint:deprecation for details.
Note: Some input files use unchecked or unsafe operations.
Note: Recompile with -Xlint:unchecked for details.
Class dependency analysis for incremental compilation took 0.038 secs.
Created classpath snapshot for incremental compilation in 0.04 secs.
Stored cache entry for task ':runners:direct-java:compileTestJava' with cache key c4bf72e6f2ffc1bdd6ea9ee66bfcb315
:runners:direct-java:compileTestJava (Thread[Execution worker Thread 2,5,main]) completed. Took 6.763 secs.
Resolve mutations for :runners:direct-java:testClasses (Thread[Execution worker,5,main]) started.
Resolve mutations for :runners:direct-java:testClasses (Thread[Execution worker,5,main]) completed. Took 0.0 secs.
:runners:direct-java:testClasses (Thread[Execution worker Thread 5,5,main]) started.

> Task :runners:direct-java:testClasses
Skipping task ':runners:direct-java:testClasses' as it has no actions.
:runners:direct-java:testClasses (Thread[Execution worker Thread 5,5,main]) completed. Took 0.0 secs.
Resolve mutations for :runners:direct-java:shadowTestJar (Thread[Execution worker Thread 2,5,main]) started.
Resolve mutations for :runners:direct-java:shadowTestJar (Thread[Execution worker Thread 2,5,main]) completed. Took 0.0 secs.
:runners:direct-java:shadowTestJar (Thread[Execution worker,5,main]) started.

> Task :runners:direct-java:shadowTestJar
Build cache key for task ':runners:direct-java:shadowTestJar' is 2704da31dfcf841b2e27224aa8679e1f
Task ':runners:direct-java:shadowTestJar' is not up-to-date because:
  No history is available.
file or directory '<https://ci-beam.apache.org/job/beam_PerformanceTests_InfluxDbIO_IT/ws/src/runners/direct-java/build/resources/test',> not found
*******************
GRADLE SHADOW STATS

Total Jars: 7 (includes project)
Total Time: 0.81s [810ms]
Average Time/Jar: 0.11571428571430001s [115.7142857143ms]
*******************
Stored cache entry for task ':runners:direct-java:shadowTestJar' with cache key 2704da31dfcf841b2e27224aa8679e1f
:runners:direct-java:shadowTestJar (Thread[Execution worker,5,main]) completed. Took 1.231 secs.
work action resolve beam-runners-direct-java-tests.jar (project :runners:direct-java) (Thread[Execution worker Thread 5,5,main]) started.
work action null (Thread[Execution worker Thread 5,5,main]) completed. Took 0.0 secs.
Resolve mutations for :sdks:java:io:influxdb:integrationTest (Thread[Execution worker Thread 2,5,main]) started.
Resolve mutations for :sdks:java:io:influxdb:integrationTest (Thread[Execution worker Thread 2,5,main]) completed. Took 0.0 secs.
:sdks:java:io:influxdb:integrationTest (Thread[Execution worker,5,main]) started.
producer locations for task group 0 (Thread[Execution worker Thread 4,5,main]) started.
producer locations for task group 0 (Thread[Execution worker Thread 4,5,main]) completed. Took 0.0 secs.
Gradle Test Executor 4 started executing tests.

> Task :sdks:java:io:influxdb:integrationTest
Custom actions are attached to task ':sdks:java:io:influxdb:integrationTest'.
Build cache key for task ':sdks:java:io:influxdb:integrationTest' is 668f07a78760f48b761a2f2ca7b1d13e
Task ':sdks:java:io:influxdb:integrationTest' is not up-to-date because:
  Task.upToDateWhen is false.
Starting process 'Gradle Test Executor 4'. Working directory: <https://ci-beam.apache.org/job/beam_PerformanceTests_InfluxDbIO_IT/ws/src/sdks/java/io/influxdb> Command: /usr/lib/jvm/java-8-openjdk-amd64/bin/java -DbeamTestPipelineOptions=["--influxDBURL=http://34.68.92.229:8086","--influxDBUserName=superadmin","--influxDBPassword=supersecretpassword","--databaseName=db1"] -Djava.security.manager=worker.org.gradle.process.internal.worker.child.BootstrapSecurityManager -Dorg.gradle.internal.worker.tmpdir=<https://ci-beam.apache.org/job/beam_PerformanceTests_InfluxDbIO_IT/ws/src/sdks/java/io/influxdb/build/tmp/integrationTest/work> -Dorg.gradle.native=false -Xmx2g -Dfile.encoding=UTF-8 -Duser.country=US -Duser.language=en -Duser.variant -ea -cp /home/jenkins/.gradle/caches/7.5.1/workerMain/gradle-worker.jar worker.org.gradle.process.internal.worker.GradleWorkerMain 'Gradle Test Executor 4'
Successfully started process 'Gradle Test Executor 4'

org.apache.beam.sdk.io.influxdb.InfluxDbIOIT > testWriteAndReadWithMultipleMetric FAILED
    java.lang.AssertionError: Count All/Flatten.PCollections.out: 
    Expected: <4000L>
         but: was <3999L>
        at org.apache.beam.sdk.testing.PAssert$PAssertionSite.capture(PAssert.java:175)
        at org.apache.beam.sdk.testing.PAssert.thatSingleton(PAssert.java:498)
        at org.apache.beam.sdk.testing.PAssert.thatSingleton(PAssert.java:490)
        at org.apache.beam.sdk.io.influxdb.InfluxDbIOIT.testWriteAndReadWithMultipleMetric(InfluxDbIOIT.java:246)

        Caused by:
        java.lang.AssertionError: 
        Expected: <4000L>
             but: was <3999L>
            at org.hamcrest.MatcherAssert.assertThat(MatcherAssert.java:18)
            at org.hamcrest.MatcherAssert.assertThat(MatcherAssert.java:6)
            at org.apache.beam.sdk.testing.PAssert$AssertIsEqualTo.apply(PAssert.java:1643)
            at org.apache.beam.sdk.testing.PAssert$AssertIsEqualTo.apply(PAssert.java:1634)
            at org.apache.beam.sdk.testing.PAssert$CheckRelationAgainstExpected.apply(PAssert.java:1299)
            at org.apache.beam.sdk.testing.PAssert$CheckRelationAgainstExpected.apply(PAssert.java:1279)
            at org.apache.beam.sdk.testing.PAssert.doChecks(PAssert.java:1621)
            at org.apache.beam.sdk.testing.PAssert$SingletonCheckerDoFn.processElement(PAssert.java:1614)
            at org.apache.beam.sdk.testing.PAssert$SingletonCheckerDoFn$DoFnInvoker.invokeProcessElement(Unknown Source)
            at org.apache.beam.repackaged.direct_java.runners.core.SimpleDoFnRunner.invokeProcessElement(SimpleDoFnRunner.java:211)
            at org.apache.beam.repackaged.direct_java.runners.core.SimpleDoFnRunner.processElement(SimpleDoFnRunner.java:188)
            at org.apache.beam.repackaged.direct_java.runners.core.SimplePushbackSideInputDoFnRunner.processElementInReadyWindows(SimplePushbackSideInputDoFnRunner.java:79)
            at org.apache.beam.runners.direct.ParDoEvaluator.processElement(ParDoEvaluator.java:244)
            at org.apache.beam.runners.direct.DoFnLifecycleManagerRemovingTransformEvaluator.processElement(DoFnLifecycleManagerRemovingTransformEvaluator.java:54)
            at org.apache.beam.runners.direct.DirectTransformExecutor.processElements(DirectTransformExecutor.java:165)
            at org.apache.beam.runners.direct.DirectTransformExecutor.run(DirectTransformExecutor.java:129)
            at java.util.concurrent.Executors$RunnableAdapter.call(Executors.java:511)
            at java.util.concurrent.FutureTask.run(FutureTask.java:266)
            at java.util.concurrent.ThreadPoolExecutor.runWorker(ThreadPoolExecutor.java:1149)
            at java.util.concurrent.ThreadPoolExecutor$Worker.run(ThreadPoolExecutor.java:624)
            at java.lang.Thread.run(Thread.java:750)

Gradle Test Executor 4 finished executing tests.

> Task :sdks:java:io:influxdb:integrationTest

6 tests completed, 1 failed
Finished generating test XML results (0.017 secs) into: <https://ci-beam.apache.org/job/beam_PerformanceTests_InfluxDbIO_IT/ws/src/sdks/java/io/influxdb/build/test-results/integrationTest>
Generating HTML test report...
Finished generating test html results (0.021 secs) into: <https://ci-beam.apache.org/job/beam_PerformanceTests_InfluxDbIO_IT/ws/src/sdks/java/io/influxdb/build/reports/tests/integrationTest>

> Task :sdks:java:io:influxdb:integrationTest FAILED
:sdks:java:io:influxdb:integrationTest (Thread[Execution worker,5,main]) completed. Took 7.603 secs.

FAILURE: Build failed with an exception.

* What went wrong:
Execution failed for task ':sdks:java:io:influxdb:integrationTest'.
> There were failing tests. See the report at: file://<https://ci-beam.apache.org/job/beam_PerformanceTests_InfluxDbIO_IT/ws/src/sdks/java/io/influxdb/build/reports/tests/integrationTest/index.html>

* Try:
> Run with --stacktrace option to get the stack trace.
> Run with --debug option to get more log output.

* Get more help at https://help.gradle.org

Deprecated Gradle features were used in this build, making it incompatible with Gradle 8.0.

You can use '--warning-mode all' to show the individual deprecation warnings and determine if they come from your own scripts or plugins.

See https://docs.gradle.org/7.5.1/userguide/command_line_interface.html#sec:command_line_warnings

BUILD FAILED in 1m 25s
74 actionable tasks: 48 executed, 24 from cache, 2 up-to-date

Publishing build scan...
https://gradle.com/s/pusmdk6yd6hfc

Stopped 3 worker daemon(s).
Build step 'Invoke Gradle script' changed build result to FAILURE
Build step 'Invoke Gradle script' marked build as failure

---------------------------------------------------------------------
To unsubscribe, e-mail: builds-unsubscribe@beam.apache.org
For additional commands, e-mail: builds-help@beam.apache.org


Jenkins build is back to normal : beam_PerformanceTests_InfluxDbIO_IT #2626

Posted by Apache Jenkins Server <je...@builds.apache.org>.
See <https://ci-beam.apache.org/job/beam_PerformanceTests_InfluxDbIO_IT/2626/display/redirect?page=changes>


---------------------------------------------------------------------
To unsubscribe, e-mail: builds-unsubscribe@beam.apache.org
For additional commands, e-mail: builds-help@beam.apache.org