You are viewing a plain text version of this content. The canonical link for it is here.
Posted to dev@lucene.apache.org by Apache Jenkins Server <je...@builds.apache.org> on 2012/01/16 02:36:38 UTC
[JENKINS] Lucene-3.x - Build # 613 - Still Failing
Build: https://builds.apache.org/job/Lucene-3.x/613/
1 tests failed.
FAILED: <init>.org.apache.lucene.analysis.kuromoji.dict.UnknownDictionaryTest
Error Message:
com_cenqua_clover/CoverageRecorder
Stack Trace:
java.lang.NoClassDefFoundError: com_cenqua_clover/CoverageRecorder
at org.apache.lucene.util.LuceneTestCase.<clinit>(LuceneTestCase.java:112)
at java.lang.Class.forName0(Native Method)
at java.lang.Class.forName(Class.java:186)
Caused by: java.lang.ClassNotFoundException: com_cenqua_clover.CoverageRecorder
at java.net.URLClassLoader$1.run(URLClassLoader.java:217)
at java.security.AccessController.doPrivileged(Native Method)
at java.net.URLClassLoader.findClass(URLClassLoader.java:205)
at java.lang.ClassLoader.loadClass(ClassLoader.java:321)
at sun.misc.Launcher$AppClassLoader.loadClass(Launcher.java:294)
at java.lang.ClassLoader.loadClass(ClassLoader.java:266)
Build Log (for compile errors):
[...truncated 25880 lines...]
---------------------------------------------------------------------
To unsubscribe, e-mail: dev-unsubscribe@lucene.apache.org
For additional commands, e-mail: dev-help@lucene.apache.org
Re: [JENKINS] Lucene-3.x - Build # 614 - Still Failing
Posted by Robert Muir <rc...@gmail.com>.
I think i caused this by adding test-tools in a hackedy way to this
module. I'll disable it until its hooked into 'test' properly (with
clover working, etc).
On Mon, Jan 16, 2012 at 8:28 PM, Apache Jenkins Server
<je...@builds.apache.org> wrote:
> Build: https://builds.apache.org/job/Lucene-3.x/614/
>
> 1 tests failed.
> FAILED: <init>.org.apache.lucene.analysis.kuromoji.dict.UnknownDictionaryTest
>
> Error Message:
> com_cenqua_clover/CoverageRecorder
>
> Stack Trace:
> java.lang.NoClassDefFoundError: com_cenqua_clover/CoverageRecorder
> at org.apache.lucene.util.LuceneTestCase.<clinit>(LuceneTestCase.java:112)
> at java.lang.Class.forName0(Native Method)
> at java.lang.Class.forName(Class.java:186)
> Caused by: java.lang.ClassNotFoundException: com_cenqua_clover.CoverageRecorder
> at java.net.URLClassLoader$1.run(URLClassLoader.java:217)
> at java.security.AccessController.doPrivileged(Native Method)
> at java.net.URLClassLoader.findClass(URLClassLoader.java:205)
> at java.lang.ClassLoader.loadClass(ClassLoader.java:321)
> at sun.misc.Launcher$AppClassLoader.loadClass(Launcher.java:294)
> at java.lang.ClassLoader.loadClass(ClassLoader.java:266)
>
>
>
>
> Build Log (for compile errors):
> [...truncated 25873 lines...]
>
>
>
> ---------------------------------------------------------------------
> To unsubscribe, e-mail: dev-unsubscribe@lucene.apache.org
> For additional commands, e-mail: dev-help@lucene.apache.org
>
--
lucidimagination.com
---------------------------------------------------------------------
To unsubscribe, e-mail: dev-unsubscribe@lucene.apache.org
For additional commands, e-mail: dev-help@lucene.apache.org
[JENKINS] Lucene-3.x - Build # 614 - Still Failing
Posted by Apache Jenkins Server <je...@builds.apache.org>.
Build: https://builds.apache.org/job/Lucene-3.x/614/
1 tests failed.
FAILED: <init>.org.apache.lucene.analysis.kuromoji.dict.UnknownDictionaryTest
Error Message:
com_cenqua_clover/CoverageRecorder
Stack Trace:
java.lang.NoClassDefFoundError: com_cenqua_clover/CoverageRecorder
at org.apache.lucene.util.LuceneTestCase.<clinit>(LuceneTestCase.java:112)
at java.lang.Class.forName0(Native Method)
at java.lang.Class.forName(Class.java:186)
Caused by: java.lang.ClassNotFoundException: com_cenqua_clover.CoverageRecorder
at java.net.URLClassLoader$1.run(URLClassLoader.java:217)
at java.security.AccessController.doPrivileged(Native Method)
at java.net.URLClassLoader.findClass(URLClassLoader.java:205)
at java.lang.ClassLoader.loadClass(ClassLoader.java:321)
at sun.misc.Launcher$AppClassLoader.loadClass(Launcher.java:294)
at java.lang.ClassLoader.loadClass(ClassLoader.java:266)
Build Log (for compile errors):
[...truncated 25873 lines...]
---------------------------------------------------------------------
To unsubscribe, e-mail: dev-unsubscribe@lucene.apache.org
For additional commands, e-mail: dev-help@lucene.apache.org