You are viewing a plain text version of this content. The canonical link for it is here.
Posted to builds@beam.apache.org by Apache Jenkins Server <je...@builds.apache.org> on 2023/02/14 04:27:06 UTC
Build failed in Jenkins: beam_PostCommit_Python_VR_Flink #3456
See <https://ci-beam.apache.org/job/beam_PostCommit_Python_VR_Flink/3456/display/redirect?page=changes>
Changes:
[noreply] Adding support for DLQ for ZetaSQL (#25426)
[noreply] Remove python 3.6 references (#25445)
------------------------------------------
[...truncated 73.94 KB...]
<https://ci-beam.apache.org/job/beam_PostCommit_Python_VR_Flink/ws/src/build/gradleenv/1922375555/lib/python3.8/site-packages/setuptools/dist.py>:534: UserWarning: Normalizing '2.46.0.dev' to '2.46.0.dev0'
warnings.warn(tmpl.format(**locals()))
warning: no files found matching 'README.md'
warning: no files found matching 'NOTICE'
warning: no files found matching 'LICENSE'
warning: no files found matching 'LICENSE.python'
warning: sdist: standard file not found: should have one of README, README.rst, README.txt, README.md
> Task :sdks:java:container:pullLicenses
Collecting setuptools
Using cached setuptools-67.2.0-py3-none-any.whl (1.1 MB)
Collecting wheel
Using cached wheel-0.38.4-py3-none-any.whl (36 kB)
Installing collected packages: pip, setuptools, wheel
Attempting uninstall: pip
Found existing installation: pip 20.0.2
Uninstalling pip-20.0.2:
Successfully uninstalled pip-20.0.2
Attempting uninstall: setuptools
Found existing installation: setuptools 44.0.0
Uninstalling setuptools-44.0.0:
Successfully uninstalled setuptools-44.0.0
Successfully installed pip-23.0 setuptools-67.2.0 wheel-0.38.4
Collecting beautifulsoup4<5.0,>=4.9.0
Using cached beautifulsoup4-4.11.2-py3-none-any.whl (129 kB)
Collecting pyyaml<6.0.0,>=3.12
Using cached PyYAML-5.4.1-cp38-cp38-manylinux1_x86_64.whl (662 kB)
Collecting tenacity<6.0,>=5.0.2
Using cached tenacity-5.1.5-py2.py3-none-any.whl (34 kB)
Collecting soupsieve>1.2
Using cached soupsieve-2.3.2.post1-py3-none-any.whl (37 kB)
Collecting six>=1.9.0
Using cached six-1.16.0-py2.py3-none-any.whl (11 kB)
Installing collected packages: soupsieve, six, pyyaml, tenacity, beautifulsoup4
Successfully installed beautifulsoup4-4.11.2 pyyaml-5.4.1 six-1.16.0 soupsieve-2.3.2.post1 tenacity-5.1.5
Executing python <https://ci-beam.apache.org/job/beam_PostCommit_Python_VR_Flink/ws/src/sdks/java/container/license_scripts/pull_licenses_java.py> --license_index=<https://ci-beam.apache.org/job/beam_PostCommit_Python_VR_Flink/ws/src/sdks/java/container/build/reports/dependency-license/index.json> --output_dir=<https://ci-beam.apache.org/job/beam_PostCommit_Python_VR_Flink/ws/src/sdks/java/container/build/target/java_third_party_licenses> --dep_url_yaml=<https://ci-beam.apache.org/job/beam_PostCommit_Python_VR_Flink/ws/src/sdks/java/container/license_scripts/dep_urls_java.yaml> --manual_license_path=<https://ci-beam.apache.org/job/beam_PostCommit_Python_VR_Flink/ws/src/sdks/java/container/license_scripts/manual_licenses>
INFO:root:Pulling license for 124 dependencies using 16 threads.
Traceback (most recent call last):
File "<https://ci-beam.apache.org/job/beam_PostCommit_Python_VR_Flink/ws/src/sdks/java/container/license_scripts/pull_licenses_java.py",> line 58, in pull_from_url
url_read = urlopen(Request(url, headers={
File "/usr/lib/python3.8/urllib/request.py", line 222, in urlopen
return opener.open(url, data, timeout)
File "/usr/lib/python3.8/urllib/request.py", line 531, in open
response = meth(req, response)
File "/usr/lib/python3.8/urllib/request.py", line 640, in http_response
response = self.parent.error(
File "/usr/lib/python3.8/urllib/request.py", line 569, in error
return self._call_chain(*args)
File "/usr/lib/python3.8/urllib/request.py", line 502, in _call_chain
result = func(*args)
File "/usr/lib/python3.8/urllib/request.py", line 649, in http_error_default
raise HTTPError(req.full_url, code, msg, hdrs, fp)
urllib.error.HTTPError: HTTP Error 404: Not Found
ERROR:root:Invalid url for zstd-jni-1.5.2-5: https://opensource.org/licenses/BSD-2-Clause. Retrying...
INFO:root:Replaced local file URL with file://<https://ci-beam.apache.org/job/beam_PostCommit_Python_VR_Flink/ws/src/sdks/java/container/license_scripts/manual_licenses/xz/COPYING> for xz-1.5
Traceback (most recent call last):
File "<https://ci-beam.apache.org/job/beam_PostCommit_Python_VR_Flink/ws/src/sdks/java/container/license_scripts/pull_licenses_java.py",> line 58, in pull_from_url
url_read = urlopen(Request(url, headers={
File "/usr/lib/python3.8/urllib/request.py", line 222, in urlopen
return opener.open(url, data, timeout)
File "/usr/lib/python3.8/urllib/request.py", line 531, in open
response = meth(req, response)
File "/usr/lib/python3.8/urllib/request.py", line 640, in http_response
response = self.parent.error(
File "/usr/lib/python3.8/urllib/request.py", line 569, in error
return self._call_chain(*args)
File "/usr/lib/python3.8/urllib/request.py", line 502, in _call_chain
result = func(*args)
File "/usr/lib/python3.8/urllib/request.py", line 649, in http_error_default
raise HTTPError(req.full_url, code, msg, hdrs, fp)
urllib.error.HTTPError: HTTP Error 404: Not Found
ERROR:root:Invalid url for zstd-jni-1.5.2-5: https://opensource.org/licenses/BSD-2-Clause. Retrying...
Traceback (most recent call last):
File "<https://ci-beam.apache.org/job/beam_PostCommit_Python_VR_Flink/ws/src/sdks/java/container/license_scripts/pull_licenses_java.py",> line 58, in pull_from_url
url_read = urlopen(Request(url, headers={
File "/usr/lib/python3.8/urllib/request.py", line 222, in urlopen
return opener.open(url, data, timeout)
File "/usr/lib/python3.8/urllib/request.py", line 531, in open
response = meth(req, response)
File "/usr/lib/python3.8/urllib/request.py", line 640, in http_response
response = self.parent.error(
File "/usr/lib/python3.8/urllib/request.py", line 569, in error
return self._call_chain(*args)
File "/usr/lib/python3.8/urllib/request.py", line 502, in _call_chain
result = func(*args)
File "/usr/lib/python3.8/urllib/request.py", line 649, in http_error_default
raise HTTPError(req.full_url, code, msg, hdrs, fp)
urllib.error.HTTPError: HTTP Error 404: Not Found
ERROR:root:Invalid url for zstd-jni-1.5.2-5: https://opensource.org/licenses/BSD-2-Clause. Retrying...
> Task :runners:flink:1.15:job-server:shadowJar FROM-CACHE
> Task :sdks:java:container:pullLicenses
Traceback (most recent call last):
File "<https://ci-beam.apache.org/job/beam_PostCommit_Python_VR_Flink/ws/src/sdks/java/container/license_scripts/pull_licenses_java.py",> line 58, in pull_from_url
url_read = urlopen(Request(url, headers={
File "/usr/lib/python3.8/urllib/request.py", line 222, in urlopen
return opener.open(url, data, timeout)
File "/usr/lib/python3.8/urllib/request.py", line 531, in open
response = meth(req, response)
File "/usr/lib/python3.8/urllib/request.py", line 640, in http_response
response = self.parent.error(
File "/usr/lib/python3.8/urllib/request.py", line 569, in error
return self._call_chain(*args)
File "/usr/lib/python3.8/urllib/request.py", line 502, in _call_chain
result = func(*args)
File "/usr/lib/python3.8/urllib/request.py", line 649, in http_error_default
raise HTTPError(req.full_url, code, msg, hdrs, fp)
urllib.error.HTTPError: HTTP Error 404: Not Found
ERROR:root:Invalid url for zstd-jni-1.5.2-5: https://opensource.org/licenses/BSD-2-Clause. Retrying...
Traceback (most recent call last):
File "<https://ci-beam.apache.org/job/beam_PostCommit_Python_VR_Flink/ws/src/sdks/java/container/license_scripts/pull_licenses_java.py",> line 58, in pull_from_url
url_read = urlopen(Request(url, headers={
File "/usr/lib/python3.8/urllib/request.py", line 222, in urlopen
return opener.open(url, data, timeout)
File "/usr/lib/python3.8/urllib/request.py", line 531, in open
response = meth(req, response)
File "/usr/lib/python3.8/urllib/request.py", line 640, in http_response
response = self.parent.error(
File "/usr/lib/python3.8/urllib/request.py", line 569, in error
return self._call_chain(*args)
File "/usr/lib/python3.8/urllib/request.py", line 502, in _call_chain
result = func(*args)
File "/usr/lib/python3.8/urllib/request.py", line 649, in http_error_default
raise HTTPError(req.full_url, code, msg, hdrs, fp)
urllib.error.HTTPError: HTTP Error 404: Not Found
ERROR:root:Invalid url for zstd-jni-1.5.2-5: https://opensource.org/licenses/BSD-2-Clause. Retrying...
> Task :release:go-licenses:java:createLicenses
> Task :sdks:java:container:java8:copyGolangLicenses
> Task :sdks:java:container:pullLicenses
Traceback (most recent call last):
File "<https://ci-beam.apache.org/job/beam_PostCommit_Python_VR_Flink/ws/src/sdks/java/container/license_scripts/pull_licenses_java.py",> line 58, in pull_from_url
url_read = urlopen(Request(url, headers={
File "/usr/lib/python3.8/urllib/request.py", line 222, in urlopen
return opener.open(url, data, timeout)
File "/usr/lib/python3.8/urllib/request.py", line 531, in open
response = meth(req, response)
File "/usr/lib/python3.8/urllib/request.py", line 640, in http_response
response = self.parent.error(
File "/usr/lib/python3.8/urllib/request.py", line 569, in error
return self._call_chain(*args)
File "/usr/lib/python3.8/urllib/request.py", line 502, in _call_chain
result = func(*args)
File "/usr/lib/python3.8/urllib/request.py", line 649, in http_error_default
raise HTTPError(req.full_url, code, msg, hdrs, fp)
urllib.error.HTTPError: HTTP Error 404: Not Found
ERROR:root:Invalid url for zstd-jni-1.5.2-5: https://opensource.org/licenses/BSD-2-Clause. Retrying...
Traceback (most recent call last):
File "<https://ci-beam.apache.org/job/beam_PostCommit_Python_VR_Flink/ws/src/sdks/java/container/license_scripts/pull_licenses_java.py",> line 58, in pull_from_url
url_read = urlopen(Request(url, headers={
File "/usr/lib/python3.8/urllib/request.py", line 222, in urlopen
return opener.open(url, data, timeout)
File "/usr/lib/python3.8/urllib/request.py", line 531, in open
response = meth(req, response)
File "/usr/lib/python3.8/urllib/request.py", line 640, in http_response
response = self.parent.error(
File "/usr/lib/python3.8/urllib/request.py", line 569, in error
return self._call_chain(*args)
File "/usr/lib/python3.8/urllib/request.py", line 502, in _call_chain
result = func(*args)
File "/usr/lib/python3.8/urllib/request.py", line 649, in http_error_default
raise HTTPError(req.full_url, code, msg, hdrs, fp)
urllib.error.HTTPError: HTTP Error 404: Not Found
ERROR:root:Invalid url for zstd-jni-1.5.2-5: https://opensource.org/licenses/BSD-2-Clause. Retrying...
Traceback (most recent call last):
File "<https://ci-beam.apache.org/job/beam_PostCommit_Python_VR_Flink/ws/src/sdks/java/container/license_scripts/pull_licenses_java.py",> line 58, in pull_from_url
url_read = urlopen(Request(url, headers={
File "/usr/lib/python3.8/urllib/request.py", line 222, in urlopen
return opener.open(url, data, timeout)
File "/usr/lib/python3.8/urllib/request.py", line 531, in open
response = meth(req, response)
File "/usr/lib/python3.8/urllib/request.py", line 640, in http_response
response = self.parent.error(
File "/usr/lib/python3.8/urllib/request.py", line 569, in error
return self._call_chain(*args)
File "/usr/lib/python3.8/urllib/request.py", line 502, in _call_chain
result = func(*args)
File "/usr/lib/python3.8/urllib/request.py", line 649, in http_error_default
raise HTTPError(req.full_url, code, msg, hdrs, fp)
urllib.error.HTTPError: HTTP Error 404: Not Found
ERROR:root:Invalid url for zstd-jni-1.5.2-5: https://opensource.org/licenses/BSD-2-Clause. Retrying...
Traceback (most recent call last):
File "<https://ci-beam.apache.org/job/beam_PostCommit_Python_VR_Flink/ws/src/sdks/java/container/license_scripts/pull_licenses_java.py",> line 58, in pull_from_url
url_read = urlopen(Request(url, headers={
File "/usr/lib/python3.8/urllib/request.py", line 222, in urlopen
return opener.open(url, data, timeout)
File "/usr/lib/python3.8/urllib/request.py", line 531, in open
response = meth(req, response)
File "/usr/lib/python3.8/urllib/request.py", line 640, in http_response
response = self.parent.error(
File "/usr/lib/python3.8/urllib/request.py", line 569, in error
return self._call_chain(*args)
File "/usr/lib/python3.8/urllib/request.py", line 502, in _call_chain
result = func(*args)
File "/usr/lib/python3.8/urllib/request.py", line 649, in http_error_default
raise HTTPError(req.full_url, code, msg, hdrs, fp)
urllib.error.HTTPError: HTTP Error 404: Not Found
ERROR:root:Invalid url for zstd-jni-1.5.2-5: https://opensource.org/licenses/BSD-2-Clause after 9 retries.
ERROR:root:['zstd-jni-1.5.2-5']
ERROR:root:**************************************** Licenses were not able to be pulled automatically for some dependencies. Please search source code of the dependencies on the internet and add "license" and "notice" (if available) field to <https://ci-beam.apache.org/job/beam_PostCommit_Python_VR_Flink/ws/src/sdks/java/container/license_scripts/dep_urls_java.yaml> for each missing license. Dependency List: [zstd-jni-1.5.2-5]
INFO:root:pull_licenses_java.py failed. It took 43.869465 seconds with 16 threads.
Traceback (most recent call last):
File "<https://ci-beam.apache.org/job/beam_PostCommit_Python_VR_Flink/ws/src/sdks/java/container/license_scripts/pull_licenses_java.py",> line 326, in <module>
raise RuntimeError('{n} error(s) occurred.'.format(n=len(error_msg)),
RuntimeError: ('1 error(s) occurred.', ['**************************************** Licenses were not able to be pulled automatically for some dependencies. Please search source code of the dependencies on the internet and add "license" and "notice" (if available) field to <https://ci-beam.apache.org/job/beam_PostCommit_Python_VR_Flink/ws/src/sdks/java/container/license_scripts/dep_urls_java.yaml> for each missing license. Dependency List: [zstd-jni-1.5.2-5]'])
> Task :sdks:java:container:pullLicenses FAILED
> Task :sdks:java:container:goPrepare UP-TO-DATE
> Task :sdks:java:container:goBuild
/home/jenkins/go/bin/go1.19.3 build -o ./build/target/linux_amd64/boot boot.go boot_test.go
> Task :sdks:java:container:java8:copySdkHarnessLauncher
Execution optimizations have been disabled for task ':sdks:java:container:java8:copySdkHarnessLauncher' to ensure correctness due to the following reasons:
- Gradle detected a problem with the following location: '<https://ci-beam.apache.org/job/beam_PostCommit_Python_VR_Flink/ws/src/sdks/java/container/build/target'.> Reason: Task ':sdks:java:container:java8:copySdkHarnessLauncher' uses this output of task ':sdks:java:container:downloadCloudProfilerAgent' without declaring an explicit or implicit dependency. This can lead to incorrect results being produced, depending on what order the tasks are executed. Please refer to https://docs.gradle.org/7.5.1/userguide/validation_problems.html#implicit_dependency for more details about this problem.
- Gradle detected a problem with the following location: '<https://ci-beam.apache.org/job/beam_PostCommit_Python_VR_Flink/ws/src/sdks/java/container/build/target'.> Reason: Task ':sdks:java:container:java8:copySdkHarnessLauncher' uses this output of task ':sdks:java:container:pullLicenses' without declaring an explicit or implicit dependency. This can lead to incorrect results being produced, depending on what order the tasks are executed. Please refer to https://docs.gradle.org/7.5.1/userguide/validation_problems.html#implicit_dependency for more details about this problem.
FAILURE: Build failed with an exception.
* What went wrong:
Execution failed for task ':sdks:java:container:pullLicenses'.
> Process 'command './license_scripts/license_script.sh'' finished with non-zero exit value 1
* Try:
> Run with --stacktrace option to get the stack trace.
> Run with --info or --debug option to get more log output.
* Get more help at https://help.gradle.org
Deprecated Gradle features were used in this build, making it incompatible with Gradle 8.0.
You can use '--warning-mode all' to show the individual deprecation warnings and determine if they come from your own scripts or plugins.
See https://docs.gradle.org/7.5.1/userguide/command_line_interface.html#sec:command_line_warnings
Execution optimizations have been disabled for 1 invalid unit(s) of work during this build to ensure correctness.
Please consult deprecation warnings for more details.
BUILD FAILED in 1m 26s
145 actionable tasks: 96 executed, 45 from cache, 4 up-to-date
Publishing build scan...
https://gradle.com/s/gdqqxhyvvjob2
Build step 'Invoke Gradle script' changed build result to FAILURE
Build step 'Invoke Gradle script' marked build as failure
---------------------------------------------------------------------
To unsubscribe, e-mail: builds-unsubscribe@beam.apache.org
For additional commands, e-mail: builds-help@beam.apache.org
Jenkins build is back to normal : beam_PostCommit_Python_VR_Flink #3458
Posted by Apache Jenkins Server <je...@builds.apache.org>.
See <https://ci-beam.apache.org/job/beam_PostCommit_Python_VR_Flink/3458/display/redirect?page=changes>
---------------------------------------------------------------------
To unsubscribe, e-mail: builds-unsubscribe@beam.apache.org
For additional commands, e-mail: builds-help@beam.apache.org
Build failed in Jenkins: beam_PostCommit_Python_VR_Flink #3457
Posted by Apache Jenkins Server <je...@builds.apache.org>.
See <https://ci-beam.apache.org/job/beam_PostCommit_Python_VR_Flink/3457/display/redirect>
Changes:
------------------------------------------
[...truncated 72.99 KB...]
Writing mypy to org/apache/beam/model/interactive/v1/beam_interactive_api_pb2.pyi
<https://ci-beam.apache.org/job/beam_PostCommit_Python_VR_Flink/ws/src/build/gradleenv/1922375555/lib/python3.8/site-packages/setuptools/dist.py>:547: UserWarning: Normalizing '2.46.0.dev' to '2.46.0.dev0'
warnings.warn(tmpl.format(**locals()))
warning: no files found matching 'README.md'
warning: no files found matching 'NOTICE'
warning: no files found matching 'LICENSE'
warning: no files found matching 'LICENSE.python'
warning: sdist: standard file not found: should have one of README, README.rst, README.txt, README.md
> Task :sdks:java:container:pullLicenses
Collecting setuptools
Using cached setuptools-67.3.1-py3-none-any.whl (1.1 MB)
Collecting wheel
Using cached wheel-0.38.4-py3-none-any.whl (36 kB)
Installing collected packages: pip, setuptools, wheel
Attempting uninstall: pip
Found existing installation: pip 20.0.2
Uninstalling pip-20.0.2:
Successfully uninstalled pip-20.0.2
Attempting uninstall: setuptools
Found existing installation: setuptools 44.0.0
Uninstalling setuptools-44.0.0:
Successfully uninstalled setuptools-44.0.0
Successfully installed pip-23.0 setuptools-67.3.1 wheel-0.38.4
Collecting beautifulsoup4<5.0,>=4.9.0
Using cached beautifulsoup4-4.11.2-py3-none-any.whl (129 kB)
Collecting pyyaml<6.0.0,>=3.12
Using cached PyYAML-5.4.1-cp38-cp38-manylinux1_x86_64.whl (662 kB)
Collecting tenacity<6.0,>=5.0.2
Using cached tenacity-5.1.5-py2.py3-none-any.whl (34 kB)
Collecting soupsieve>1.2
Using cached soupsieve-2.3.2.post1-py3-none-any.whl (37 kB)
Collecting six>=1.9.0
Using cached six-1.16.0-py2.py3-none-any.whl (11 kB)
Installing collected packages: soupsieve, six, pyyaml, tenacity, beautifulsoup4
Successfully installed beautifulsoup4-4.11.2 pyyaml-5.4.1 six-1.16.0 soupsieve-2.3.2.post1 tenacity-5.1.5
Executing python <https://ci-beam.apache.org/job/beam_PostCommit_Python_VR_Flink/ws/src/sdks/java/container/license_scripts/pull_licenses_java.py> --license_index=<https://ci-beam.apache.org/job/beam_PostCommit_Python_VR_Flink/ws/src/sdks/java/container/build/reports/dependency-license/index.json> --output_dir=<https://ci-beam.apache.org/job/beam_PostCommit_Python_VR_Flink/ws/src/sdks/java/container/build/target/java_third_party_licenses> --dep_url_yaml=<https://ci-beam.apache.org/job/beam_PostCommit_Python_VR_Flink/ws/src/sdks/java/container/license_scripts/dep_urls_java.yaml> --manual_license_path=<https://ci-beam.apache.org/job/beam_PostCommit_Python_VR_Flink/ws/src/sdks/java/container/license_scripts/manual_licenses>
INFO:root:Pulling license for 124 dependencies using 16 threads.
INFO:root:Replaced local file URL with file://<https://ci-beam.apache.org/job/beam_PostCommit_Python_VR_Flink/ws/src/sdks/java/container/license_scripts/manual_licenses/xz/COPYING> for xz-1.5
Traceback (most recent call last):
File "<https://ci-beam.apache.org/job/beam_PostCommit_Python_VR_Flink/ws/src/sdks/java/container/license_scripts/pull_licenses_java.py",> line 58, in pull_from_url
url_read = urlopen(Request(url, headers={
File "/usr/lib/python3.8/urllib/request.py", line 222, in urlopen
return opener.open(url, data, timeout)
File "/usr/lib/python3.8/urllib/request.py", line 531, in open
response = meth(req, response)
File "/usr/lib/python3.8/urllib/request.py", line 640, in http_response
response = self.parent.error(
File "/usr/lib/python3.8/urllib/request.py", line 569, in error
return self._call_chain(*args)
File "/usr/lib/python3.8/urllib/request.py", line 502, in _call_chain
result = func(*args)
File "/usr/lib/python3.8/urllib/request.py", line 649, in http_error_default
raise HTTPError(req.full_url, code, msg, hdrs, fp)
urllib.error.HTTPError: HTTP Error 404: Not Found
ERROR:root:Invalid url for zstd-jni-1.5.2-5: https://opensource.org/licenses/BSD-2-Clause. Retrying...
Traceback (most recent call last):
File "<https://ci-beam.apache.org/job/beam_PostCommit_Python_VR_Flink/ws/src/sdks/java/container/license_scripts/pull_licenses_java.py",> line 58, in pull_from_url
url_read = urlopen(Request(url, headers={
File "/usr/lib/python3.8/urllib/request.py", line 222, in urlopen
return opener.open(url, data, timeout)
File "/usr/lib/python3.8/urllib/request.py", line 531, in open
response = meth(req, response)
File "/usr/lib/python3.8/urllib/request.py", line 640, in http_response
response = self.parent.error(
File "/usr/lib/python3.8/urllib/request.py", line 569, in error
return self._call_chain(*args)
File "/usr/lib/python3.8/urllib/request.py", line 502, in _call_chain
result = func(*args)
File "/usr/lib/python3.8/urllib/request.py", line 649, in http_error_default
raise HTTPError(req.full_url, code, msg, hdrs, fp)
urllib.error.HTTPError: HTTP Error 404: Not Found
ERROR:root:Invalid url for zstd-jni-1.5.2-5: https://opensource.org/licenses/BSD-2-Clause. Retrying...
Traceback (most recent call last):
File "<https://ci-beam.apache.org/job/beam_PostCommit_Python_VR_Flink/ws/src/sdks/java/container/license_scripts/pull_licenses_java.py",> line 58, in pull_from_url
url_read = urlopen(Request(url, headers={
File "/usr/lib/python3.8/urllib/request.py", line 222, in urlopen
return opener.open(url, data, timeout)
File "/usr/lib/python3.8/urllib/request.py", line 531, in open
response = meth(req, response)
File "/usr/lib/python3.8/urllib/request.py", line 640, in http_response
response = self.parent.error(
File "/usr/lib/python3.8/urllib/request.py", line 569, in error
return self._call_chain(*args)
File "/usr/lib/python3.8/urllib/request.py", line 502, in _call_chain
result = func(*args)
File "/usr/lib/python3.8/urllib/request.py", line 649, in http_error_default
raise HTTPError(req.full_url, code, msg, hdrs, fp)
urllib.error.HTTPError: HTTP Error 404: Not Found
ERROR:root:Invalid url for zstd-jni-1.5.2-5: https://opensource.org/licenses/BSD-2-Clause. Retrying...
Traceback (most recent call last):
File "<https://ci-beam.apache.org/job/beam_PostCommit_Python_VR_Flink/ws/src/sdks/java/container/license_scripts/pull_licenses_java.py",> line 58, in pull_from_url
url_read = urlopen(Request(url, headers={
File "/usr/lib/python3.8/urllib/request.py", line 222, in urlopen
return opener.open(url, data, timeout)
File "/usr/lib/python3.8/urllib/request.py", line 531, in open
response = meth(req, response)
File "/usr/lib/python3.8/urllib/request.py", line 640, in http_response
response = self.parent.error(
File "/usr/lib/python3.8/urllib/request.py", line 569, in error
return self._call_chain(*args)
File "/usr/lib/python3.8/urllib/request.py", line 502, in _call_chain
result = func(*args)
File "/usr/lib/python3.8/urllib/request.py", line 649, in http_error_default
raise HTTPError(req.full_url, code, msg, hdrs, fp)
urllib.error.HTTPError: HTTP Error 404: Not Found
ERROR:root:Invalid url for zstd-jni-1.5.2-5: https://opensource.org/licenses/BSD-2-Clause. Retrying...
Traceback (most recent call last):
File "<https://ci-beam.apache.org/job/beam_PostCommit_Python_VR_Flink/ws/src/sdks/java/container/license_scripts/pull_licenses_java.py",> line 58, in pull_from_url
url_read = urlopen(Request(url, headers={
File "/usr/lib/python3.8/urllib/request.py", line 222, in urlopen
return opener.open(url, data, timeout)
File "/usr/lib/python3.8/urllib/request.py", line 531, in open
response = meth(req, response)
File "/usr/lib/python3.8/urllib/request.py", line 640, in http_response
response = self.parent.error(
File "/usr/lib/python3.8/urllib/request.py", line 569, in error
return self._call_chain(*args)
File "/usr/lib/python3.8/urllib/request.py", line 502, in _call_chain
result = func(*args)
File "/usr/lib/python3.8/urllib/request.py", line 649, in http_error_default
raise HTTPError(req.full_url, code, msg, hdrs, fp)
urllib.error.HTTPError: HTTP Error 404: Not Found
ERROR:root:Invalid url for zstd-jni-1.5.2-5: https://opensource.org/licenses/BSD-2-Clause. Retrying...
> Task :sdks:java:extensions:sql:expansion-service:shadowJar
> Task :release:go-licenses:java:createLicenses
> Task :sdks:java:container:java8:copyGolangLicenses
> Task :sdks:java:container:pullLicenses
Traceback (most recent call last):
File "<https://ci-beam.apache.org/job/beam_PostCommit_Python_VR_Flink/ws/src/sdks/java/container/license_scripts/pull_licenses_java.py",> line 58, in pull_from_url
url_read = urlopen(Request(url, headers={
File "/usr/lib/python3.8/urllib/request.py", line 222, in urlopen
return opener.open(url, data, timeout)
File "/usr/lib/python3.8/urllib/request.py", line 531, in open
response = meth(req, response)
File "/usr/lib/python3.8/urllib/request.py", line 640, in http_response
response = self.parent.error(
File "/usr/lib/python3.8/urllib/request.py", line 569, in error
return self._call_chain(*args)
File "/usr/lib/python3.8/urllib/request.py", line 502, in _call_chain
result = func(*args)
File "/usr/lib/python3.8/urllib/request.py", line 649, in http_error_default
raise HTTPError(req.full_url, code, msg, hdrs, fp)
urllib.error.HTTPError: HTTP Error 404: Not Found
ERROR:root:Invalid url for zstd-jni-1.5.2-5: https://opensource.org/licenses/BSD-2-Clause. Retrying...
Traceback (most recent call last):
File "<https://ci-beam.apache.org/job/beam_PostCommit_Python_VR_Flink/ws/src/sdks/java/container/license_scripts/pull_licenses_java.py",> line 58, in pull_from_url
url_read = urlopen(Request(url, headers={
File "/usr/lib/python3.8/urllib/request.py", line 222, in urlopen
return opener.open(url, data, timeout)
File "/usr/lib/python3.8/urllib/request.py", line 531, in open
response = meth(req, response)
File "/usr/lib/python3.8/urllib/request.py", line 640, in http_response
response = self.parent.error(
File "/usr/lib/python3.8/urllib/request.py", line 569, in error
return self._call_chain(*args)
File "/usr/lib/python3.8/urllib/request.py", line 502, in _call_chain
result = func(*args)
File "/usr/lib/python3.8/urllib/request.py", line 649, in http_error_default
raise HTTPError(req.full_url, code, msg, hdrs, fp)
urllib.error.HTTPError: HTTP Error 404: Not Found
ERROR:root:Invalid url for zstd-jni-1.5.2-5: https://opensource.org/licenses/BSD-2-Clause. Retrying...
Traceback (most recent call last):
File "<https://ci-beam.apache.org/job/beam_PostCommit_Python_VR_Flink/ws/src/sdks/java/container/license_scripts/pull_licenses_java.py",> line 58, in pull_from_url
url_read = urlopen(Request(url, headers={
File "/usr/lib/python3.8/urllib/request.py", line 222, in urlopen
return opener.open(url, data, timeout)
File "/usr/lib/python3.8/urllib/request.py", line 531, in open
response = meth(req, response)
File "/usr/lib/python3.8/urllib/request.py", line 640, in http_response
response = self.parent.error(
File "/usr/lib/python3.8/urllib/request.py", line 569, in error
return self._call_chain(*args)
File "/usr/lib/python3.8/urllib/request.py", line 502, in _call_chain
result = func(*args)
File "/usr/lib/python3.8/urllib/request.py", line 649, in http_error_default
raise HTTPError(req.full_url, code, msg, hdrs, fp)
urllib.error.HTTPError: HTTP Error 404: Not Found
ERROR:root:Invalid url for zstd-jni-1.5.2-5: https://opensource.org/licenses/BSD-2-Clause. Retrying...
Traceback (most recent call last):
File "<https://ci-beam.apache.org/job/beam_PostCommit_Python_VR_Flink/ws/src/sdks/java/container/license_scripts/pull_licenses_java.py",> line 58, in pull_from_url
url_read = urlopen(Request(url, headers={
File "/usr/lib/python3.8/urllib/request.py", line 222, in urlopen
return opener.open(url, data, timeout)
File "/usr/lib/python3.8/urllib/request.py", line 531, in open
response = meth(req, response)
File "/usr/lib/python3.8/urllib/request.py", line 640, in http_response
response = self.parent.error(
File "/usr/lib/python3.8/urllib/request.py", line 569, in error
return self._call_chain(*args)
File "/usr/lib/python3.8/urllib/request.py", line 502, in _call_chain
result = func(*args)
File "/usr/lib/python3.8/urllib/request.py", line 649, in http_error_default
raise HTTPError(req.full_url, code, msg, hdrs, fp)
urllib.error.HTTPError: HTTP Error 404: Not Found
ERROR:root:Invalid url for zstd-jni-1.5.2-5: https://opensource.org/licenses/BSD-2-Clause after 9 retries.
ERROR:root:['zstd-jni-1.5.2-5']
ERROR:root:**************************************** Licenses were not able to be pulled automatically for some dependencies. Please search source code of the dependencies on the internet and add "license" and "notice" (if available) field to <https://ci-beam.apache.org/job/beam_PostCommit_Python_VR_Flink/ws/src/sdks/java/container/license_scripts/dep_urls_java.yaml> for each missing license. Dependency List: [zstd-jni-1.5.2-5]
INFO:root:pull_licenses_java.py failed. It took 43.794738 seconds with 16 threads.
Traceback (most recent call last):
File "<https://ci-beam.apache.org/job/beam_PostCommit_Python_VR_Flink/ws/src/sdks/java/container/license_scripts/pull_licenses_java.py",> line 326, in <module>
raise RuntimeError('{n} error(s) occurred.'.format(n=len(error_msg)),
RuntimeError: ('1 error(s) occurred.', ['**************************************** Licenses were not able to be pulled automatically for some dependencies. Please search source code of the dependencies on the internet and add "license" and "notice" (if available) field to <https://ci-beam.apache.org/job/beam_PostCommit_Python_VR_Flink/ws/src/sdks/java/container/license_scripts/dep_urls_java.yaml> for each missing license. Dependency List: [zstd-jni-1.5.2-5]'])
> Task :sdks:java:container:pullLicenses FAILED
> Task :sdks:java:container:goPrepare UP-TO-DATE
> Task :sdks:java:container:goBuild
/home/jenkins/go/bin/go1.19.3 build -o ./build/target/linux_amd64/boot boot.go boot_test.go
> Task :sdks:java:container:java8:copySdkHarnessLauncher
Execution optimizations have been disabled for task ':sdks:java:container:java8:copySdkHarnessLauncher' to ensure correctness due to the following reasons:
- Gradle detected a problem with the following location: '<https://ci-beam.apache.org/job/beam_PostCommit_Python_VR_Flink/ws/src/sdks/java/container/build/target'.> Reason: Task ':sdks:java:container:java8:copySdkHarnessLauncher' uses this output of task ':sdks:java:container:downloadCloudProfilerAgent' without declaring an explicit or implicit dependency. This can lead to incorrect results being produced, depending on what order the tasks are executed. Please refer to https://docs.gradle.org/7.5.1/userguide/validation_problems.html#implicit_dependency for more details about this problem.
- Gradle detected a problem with the following location: '<https://ci-beam.apache.org/job/beam_PostCommit_Python_VR_Flink/ws/src/sdks/java/container/build/target'.> Reason: Task ':sdks:java:container:java8:copySdkHarnessLauncher' uses this output of task ':sdks:java:container:pullLicenses' without declaring an explicit or implicit dependency. This can lead to incorrect results being produced, depending on what order the tasks are executed. Please refer to https://docs.gradle.org/7.5.1/userguide/validation_problems.html#implicit_dependency for more details about this problem.
> Task :runners:flink:1.15:job-server:shadowJar
FAILURE: Build failed with an exception.
* What went wrong:
Execution failed for task ':sdks:java:container:pullLicenses'.
> Process 'command './license_scripts/license_script.sh'' finished with non-zero exit value 1
* Try:
> Run with --stacktrace option to get the stack trace.
> Run with --info or --debug option to get more log output.
* Get more help at https://help.gradle.org
Deprecated Gradle features were used in this build, making it incompatible with Gradle 8.0.
You can use '--warning-mode all' to show the individual deprecation warnings and determine if they come from your own scripts or plugins.
See https://docs.gradle.org/7.5.1/userguide/command_line_interface.html#sec:command_line_warnings
Execution optimizations have been disabled for 1 invalid unit(s) of work during this build to ensure correctness.
Please consult deprecation warnings for more details.
BUILD FAILED in 4m 2s
145 actionable tasks: 98 executed, 43 from cache, 4 up-to-date
Publishing build scan...
https://gradle.com/s/opgpr2xhykygy
Build step 'Invoke Gradle script' changed build result to FAILURE
Build step 'Invoke Gradle script' marked build as failure
---------------------------------------------------------------------
To unsubscribe, e-mail: builds-unsubscribe@beam.apache.org
For additional commands, e-mail: builds-help@beam.apache.org